{"text_format":"1","workbook":"xlsx","n_sheets":9,"sheets":["Overview","Sheet Validation","1. Staff costs"," 2-3-6. Travel&Costs of Stay","4. Equipment Costs","5. Subcontracting Costs","Co-financing","Breakdown & Project Funding","Unit Costs & Funding Rule"],"not_rendered":{"charts":0,"images":2,"macros":1,"external_links":1,"defined_names":23,"comments":0,"pivot_tables":0},"unopened":[],"bounds":{"document_bytes":16777216,"sheet_cells":100000,"rows_first":2000,"rows_last":500,"rows_between":2000,"halvings":0,"cell_chars":16384,"cell_head_chars":4096},"cells_cut":0,"cells_raw":0,"read":"whole","date_system":"1900"}

{"sheet":"Overview","index":0,"n_rows":81,"n_cols":12,"rows_kept":81,"cut":false,"hidden":false,"merged":[[11,4,11,11],[12,4,12,11],[6,1,6,11],[7,1,7,11],[8,1,8,11],[10,1,10,2],[10,4,10,11],[11,1,11,2],[12,1,12,2],[17,4,17,7],[17,8,17,11],[13,1,13,2],[13,3,13,11],[15,1,15,11],[16,1,16,2],[16,4,16,7],[16,8,16,11],[17,1,17,2],[20,4,20,7],[20,8,20,11],[21,1,21,2],[21,4,21,7],[21,8,21,11],[22,1,22,2],[22,4,22,7],[22,8,22,11],[24,1,24,11],[18,1,18,2],[18,4,18,7],[18,8,18,11],[19,1,19,2],[19,4,19,7],[19,8,19,11],[20,1,20,2]]}
[]
[]
[null,null,null,"Key Action 2: Cooperation for innovation and the exchange of good practices"]
[null,null,null,"Capacity Building in the field of higher education"]
[]
[]
[null,"Before completing this table please read carefully the instructions available on the EACEA website"]
[null,"CALL FOR PROPOSALS 2020 – EAC/A02/2019 - Erasmus+ Programme (2019/C 373/06)"]
[null,"Programme guide and instructions for applicants"]
[]
[null,"Action",null,"Joint Project",{"$f":"IF(D11=\"\",\"Please select Action Type\",IF(OR(D11=\"Joint Project\",D11=\"Structural Project\"),\"\",\"Error Type of Action\"))","v":""}]
[null,"Duration number of months",null,36.0,{"$f":"IF(D12=\"\",\"Please select duration\",IF(OR(D12=24,D12=36),\"\",\"Error duration\"))","v":""}]
[null,"Project Acronym",null,"UNITEL",{"$f":"IF(D13=\"\",\"Please fill in Project Acronym\",\"\")","v":""}]
[null,"Project Title",null,"Modernisation and internationalisation of Iranian HEIs via collaborative TEL-based curriculum development in engineering and STEM"]
[]
[null,"EU GRANT REQUESTED FROM THE EUROPEAN UNION (in EUR)"]
[null,"1. Staff Costs",null,{"$f":"'1. Staff costs'!D9","v":0},{"$f":"\"Cannot exceed 40% of total Grant requested\"","v":"Cannot exceed 40% of total Grant requested"},null,null,null,{"$f":"IF(COUNTIF('1. Staff costs'!T:T,\"Error\")<=1,\"\",\"Please check data in Tab '1. Staff Costs'\")","v":""}]
[null,"2. Travel Costs",null,{"$f":"' 2-3-6. Travel&Costs of Stay'!D8","v":"#ERROR!"},null,null,null,null,{"$f":"IF(COUNTIF(' 2-3-6. Travel&Costs of Stay'!R:R,\"Error\")<=1,\"\",\"Please check data in Tab '2-3-6. Travel&Costs of Stay'\")","v":""}]
[null,"3. Costs of Stay",null,{"$f":"' 2-3-6. Travel&Costs of Stay'!D9","v":"#ERROR!"},null,null,null,null,{"$f":"IF(COUNTIF(' 2-3-6. Travel&Costs of Stay'!R:R,\"Error\")<=1,\"\",\"Please check data in Tab '2-3-6. Travel&Costs of Stay'\")","v":""}]
[null,"4. Equipment Costs",null,{"$f":"'4. Equipment Costs'!C4","v":"#ERROR!"},{"$f":"\"Cannot exceed 30% of Total Grant requested\"","v":"Cannot exceed 30% of Total Grant requested"},null,null,null,{"$f":"IF(COUNTIF('4. Equipment Costs'!I:I,\"Error\")<=1,\"\",\"Please check data in Tab '4. Equipment Costs''\")","v":""}]
[null,"5. Subcontracting Costs",null,{"$f":"'5. Subcontracting Costs'!C4","v":"#ERROR!"},{"$f":"\"Cannot exceed 10% of Total Grant requested\"","v":"Cannot exceed 10% of Total Grant requested"},null,null,null,{"$f":"IF(COUNTIF('5. Subcontracting Costs'!I:I,\"Error\")<=1,\"\",\"Please check data in Tab '5. Subcontracting Costs'\")","v":""}]
[null,"6. Exceptional Costs",null,{"$f":"IF(OR(C27=\"\",D27=\"\"),0,' 2-3-6. Travel&Costs of Stay'!D10)","v":0},null,null,null,null,{"$f":"IF(COUNTIF(' 2-3-6. Travel&Costs of Stay'!R:R,\"Error\")<=1,\"\",\"Please check data in Tab '2-3-6. Travel&Costs of Stay'\")","v":""}]
[null,"Total Grant requested from the European Union",null,{"$f":"SUM(D17:D22)","v":"#ERROR!"},{"$f":"\"Should be equal or above EUR 500.000,00 and cannot exceed EUR 1.000.000,00\"","v":"Should be equal or above EUR 500.000,00 and cannot exceed EUR 1.000.000,00"},null,null,null,{"$f":"IF(OR(COUNTIF('Co-financing'!J:J,\"Error\")<=1,AND('Co-financing'!B14=\"\",'Co-financing'!E14=\"\",'Co-financing'!F14=\"\",'Co-financing'!G14=\"\",'Co-financing'!H14=0)),\"\",\"Please check data in Tab 'Co-financing'\")","v":""}]
[]
[null,"DISTRIBUTION OF THE GRANT BY ORGANISATION (in EUR)"]
[null,"Partner \nN°","Name of Partner","Country","PR/PA","1. Staff \nCosts","2. Travel \nCosts","3. Costs of \nStay","4. Equipment \nCosts","5. Subcontracting \nCosts","6. Exceptional Costs","Total \nCosts (in EUR)"]
[null,"P1","Università degli Studi Guglielmo Marconi ","Italy",{"$f":"IFERROR(IF(D27<>\"\",VLOOKUP(D27,CountryType,2,FALSE),\"\"),\"Country not found\")","v":"Programme Countries"},{"$f":"SUMIF('1. Staff costs'!C:C,B27,'1. Staff costs'!S:S)","v":"#ERROR!"},{"$f":"SUMIF(' 2-3-6. Travel&Costs of Stay'!C:C,B27,' 2-3-6. Travel&Costs of Stay'!O:O)","v":"#ERROR!"},{"$f":"SUMIF(' 2-3-6. Travel&Costs of Stay'!C:C,B27,' 2-3-6. Travel&Costs of Stay'!P:P)","v":"#ERROR!"},{"$f":"SUMIF('4. Equipment Costs'!C:C,B27,'4. Equipment Costs'!H:H)","v":0},{"$f":"SUMIF('5. Subcontracting Costs'!C:C,B27,'5. Subcontracting Costs'!H:H)","v":"#ERROR!"},{"$f":"SUMIF(' 2-3-6. Travel&Costs of Stay'!C:C,B27,' 2-3-6. Travel&Costs of Stay'!N:N)","v":0},{"$f":"IF(OR(C27=\"\",D27=\"\"),0,SUM(F27:K27))","v":"#ERROR!"}]
[null,"P2","TURUN YLIOPISTO","Finland",{"$f":"IFERROR(IF(D28<>\"\",VLOOKUP(D28,CountryType,2,FALSE),\"\"),\"Country not found\")","v":"Programme Countries"},{"$f":"SUMIF('1. Staff costs'!C:C,B28,'1. Staff costs'!S:S)","v":"#ERROR!"},{"$f":"SUMIF(' 2-3-6. Travel&Costs of Stay'!C:C,B28,' 2-3-6. Travel&Costs of Stay'!O:O)","v":"#ERROR!"},{"$f":"SUMIF(' 2-3-6. Travel&Costs of Stay'!C:C,B28,' 2-3-6. Travel&Costs of Stay'!P:P)","v":"#ERROR!"},{"$f":"SUMIF('4. Equipment Costs'!C:C,B28,'4. Equipment Costs'!H:H)","v":0},{"$f":"SUMIF('5. Subcontracting Costs'!C:C,B28,'5. Subcontracting Costs'!H:H)","v":"#ERROR!"},{"$f":"SUMIF(' 2-3-6. Travel&Costs of Stay'!C:C,B28,' 2-3-6. Travel&Costs of Stay'!N:N)","v":0},"#ERROR!"]
[null,"P3","UNIVERSIDADE ABERTA","Portugal",{"$f":"IFERROR(IF(D29<>\"\",VLOOKUP(D29,CountryType,2,FALSE),\"\"),\"Country not found\")","v":"Programme Countries"},{"$f":"SUMIF('1. Staff costs'!C:C,B29,'1. Staff costs'!S:S)","v":"#ERROR!"},{"$f":"SUMIF(' 2-3-6. Travel&Costs of Stay'!C:C,B29,' 2-3-6. Travel&Costs of Stay'!O:O)","v":"#ERROR!"},{"$f":"SUMIF(' 2-3-6. Travel&Costs of Stay'!C:C,B29,' 2-3-6. Travel&Costs of Stay'!P:P)","v":"#ERROR!"},{"$f":"SUMIF('4. Equipment Costs'!C:C,B29,'4. Equipment Costs'!H:H)","v":0},{"$f":"SUMIF('5. Subcontracting Costs'!C:C,B29,'5. Subcontracting Costs'!H:H)","v":"#ERROR!"},{"$f":"SUMIF(' 2-3-6. Travel&Costs of Stay'!C:C,B29,' 2-3-6. Travel&Costs of Stay'!N:N)","v":0},"#ERROR!"]
[null,"P4","Prisma Electronics ABEE","Greece",{"$f":"IFERROR(IF(D30<>\"\",VLOOKUP(D30,CountryType,2,FALSE),\"\"),\"Country not found\")","v":"Programme Countries"},{"$f":"SUMIF('1. Staff costs'!C:C,B30,'1. Staff costs'!S:S)","v":"#ERROR!"},{"$f":"SUMIF(' 2-3-6. Travel&Costs of Stay'!C:C,B30,' 2-3-6. Travel&Costs of Stay'!O:O)","v":"#ERROR!"},{"$f":"SUMIF(' 2-3-6. Travel&Costs of Stay'!C:C,B30,' 2-3-6. Travel&Costs of Stay'!P:P)","v":"#ERROR!"},{"$f":"SUMIF('4. Equipment Costs'!C:C,B30,'4. Equipment Costs'!H:H)","v":0},{"$f":"SUMIF('5. Subcontracting Costs'!C:C,B30,'5. Subcontracting Costs'!H:H)","v":"#ERROR!"},{"$f":"SUMIF(' 2-3-6. Travel&Costs of Stay'!C:C,B30,' 2-3-6. Travel&Costs of Stay'!N:N)","v":0},"#ERROR!"]
[null,"P5","IMAM KHOMEINI INTERNATIONAL UNIVERSITY","Iran",{"$f":"IFERROR(IF(D31<>\"\",VLOOKUP(D31,CountryType,2,FALSE),\"\"),\"Country not found\")","v":"Partner Countries"},{"$f":"SUMIF('1. Staff costs'!C:C,B31,'1. Staff costs'!S:S)","v":"#ERROR!"},{"$f":"SUMIF(' 2-3-6. Travel&Costs of Stay'!C:C,B31,' 2-3-6. Travel&Costs of Stay'!O:O)","v":"#ERROR!"},{"$f":"SUMIF(' 2-3-6. Travel&Costs of Stay'!C:C,B31,' 2-3-6. Travel&Costs of Stay'!P:P)","v":"#ERROR!"},{"$f":"SUMIF('4. Equipment Costs'!C:C,B31,'4. Equipment Costs'!H:H)","v":"#ERROR!"},{"$f":"SUMIF('5. Subcontracting Costs'!C:C,B31,'5. Subcontracting Costs'!H:H)","v":"#ERROR!"},{"$f":"SUMIF(' 2-3-6. Travel&Costs of Stay'!C:C,B31,' 2-3-6. Travel&Costs of Stay'!N:N)","v":0},"#ERROR!"]
[null,"P6","UNIVERSITY OF SISTAN AND BALUCHESTAN","Iran",{"$f":"IFERROR(IF(D32<>\"\",VLOOKUP(D32,CountryType,2,FALSE),\"\"),\"Country not found\")","v":"Partner Countries"},{"$f":"SUMIF('1. Staff costs'!C:C,B32,'1. Staff costs'!S:S)","v":"#ERROR!"},{"$f":"SUMIF(' 2-3-6. Travel&Costs of Stay'!C:C,B32,' 2-3-6. Travel&Costs of Stay'!O:O)","v":"#ERROR!"},{"$f":"SUMIF(' 2-3-6. Travel&Costs of Stay'!C:C,B32,' 2-3-6. Travel&Costs of Stay'!P:P)","v":"#ERROR!"},{"$f":"SUMIF('4. Equipment Costs'!C:C,B32,'4. Equipment Costs'!H:H)","v":"#ERROR!"},{"$f":"SUMIF('5. Subcontracting Costs'!C:C,B32,'5. Subcontracting Costs'!H:H)","v":"#ERROR!"},{"$f":"SUMIF(' 2-3-6. Travel&Costs of Stay'!C:C,B32,' 2-3-6. Travel&Costs of Stay'!N:N)","v":0},"#ERROR!"]
[null,"P7","SHIRAZ UNIVERSITY","Iran",{"$f":"IFERROR(IF(D33<>\"\",VLOOKUP(D33,CountryType,2,FALSE),\"\"),\"Country not found\")","v":"Partner Countries"},{"$f":"SUMIF('1. Staff costs'!C:C,B33,'1. Staff costs'!S:S)","v":"#ERROR!"},{"$f":"SUMIF(' 2-3-6. Travel&Costs of Stay'!C:C,B33,' 2-3-6. Travel&Costs of Stay'!O:O)","v":"#ERROR!"},{"$f":"SUMIF(' 2-3-6. Travel&Costs of Stay'!C:C,B33,' 2-3-6. Travel&Costs of Stay'!P:P)","v":"#ERROR!"},{"$f":"SUMIF('4. Equipment Costs'!C:C,B33,'4. Equipment Costs'!H:H)","v":"#ERROR!"},{"$f":"SUMIF('5. Subcontracting Costs'!C:C,B33,'5. Subcontracting Costs'!H:H)","v":"#ERROR!"},{"$f":"SUMIF(' 2-3-6. Travel&Costs of Stay'!C:C,B33,' 2-3-6. Travel&Costs of Stay'!N:N)","v":0},"#ERROR!"]
[null,"P8","University of Isfahan","Iran",{"$f":"IFERROR(IF(D34<>\"\",VLOOKUP(D34,CountryType,2,FALSE),\"\"),\"Country not found\")","v":"Partner Countries"},{"$f":"SUMIF('1. Staff costs'!C:C,B34,'1. Staff costs'!S:S)","v":"#ERROR!"},{"$f":"SUMIF(' 2-3-6. Travel&Costs of Stay'!C:C,B34,' 2-3-6. Travel&Costs of Stay'!O:O)","v":"#ERROR!"},{"$f":"SUMIF(' 2-3-6. Travel&Costs of Stay'!C:C,B34,' 2-3-6. Travel&Costs of Stay'!P:P)","v":"#ERROR!"},{"$f":"SUMIF('4. Equipment Costs'!C:C,B34,'4. Equipment Costs'!H:H)","v":"#ERROR!"},{"$f":"SUMIF('5. Subcontracting Costs'!C:C,B34,'5. Subcontracting Costs'!H:H)","v":"#ERROR!"},{"$f":"SUMIF(' 2-3-6. Travel&Costs of Stay'!C:C,B34,' 2-3-6. Travel&Costs of Stay'!N:N)","v":0},"#ERROR!"]
[null,"P9","UNIVERSITY OF TEHRAN","Iran",{"$f":"IFERROR(IF(D35<>\"\",VLOOKUP(D35,CountryType,2,FALSE),\"\"),\"Country not found\")","v":"Partner Countries"},{"$f":"SUMIF('1. Staff costs'!C:C,B35,'1. Staff costs'!S:S)","v":"#ERROR!"},{"$f":"SUMIF(' 2-3-6. Travel&Costs of Stay'!C:C,B35,' 2-3-6. Travel&Costs of Stay'!O:O)","v":"#ERROR!"},{"$f":"SUMIF(' 2-3-6. Travel&Costs of Stay'!C:C,B35,' 2-3-6. Travel&Costs of Stay'!P:P)","v":"#ERROR!"},{"$f":"SUMIF('4. Equipment Costs'!C:C,B35,'4. Equipment Costs'!H:H)","v":"#ERROR!"},{"$f":"SUMIF('5. Subcontracting Costs'!C:C,B35,'5. Subcontracting Costs'!H:H)","v":"#ERROR!"},{"$f":"SUMIF(' 2-3-6. Travel&Costs of Stay'!C:C,B35,' 2-3-6. Travel&Costs of Stay'!N:N)","v":0},"#ERROR!"]
[null,"P10","SHAHID CHAMRAN UNIVERSITY OF AHVAZ","Iran",{"$f":"IFERROR(IF(D36<>\"\",VLOOKUP(D36,CountryType,2,FALSE),\"\"),\"Country not found\")","v":"Partner Countries"},{"$f":"SUMIF('1. Staff costs'!C:C,B36,'1. Staff costs'!S:S)","v":"#ERROR!"},{"$f":"SUMIF(' 2-3-6. Travel&Costs of Stay'!C:C,B36,' 2-3-6. Travel&Costs of Stay'!O:O)","v":"#ERROR!"},{"$f":"SUMIF(' 2-3-6. Travel&Costs of Stay'!C:C,B36,' 2-3-6. Travel&Costs of Stay'!P:P)","v":"#ERROR!"},{"$f":"SUMIF('4. Equipment Costs'!C:C,B36,'4. Equipment Costs'!H:H)","v":"#ERROR!"},{"$f":"SUMIF('5. Subcontracting Costs'!C:C,B36,'5. Subcontracting Costs'!H:H)","v":"#ERROR!"},{"$f":"SUMIF(' 2-3-6. Travel&Costs of Stay'!C:C,B36,' 2-3-6. Travel&Costs of Stay'!N:N)","v":0},"#ERROR!"]
[null,"P11","Sharif University of Technology","Iran",{"$f":"IFERROR(IF(D37<>\"\",VLOOKUP(D37,CountryType,2,FALSE),\"\"),\"Country not found\")","v":"Partner Countries"},{"$f":"SUMIF('1. Staff costs'!C:C,B37,'1. Staff costs'!S:S)","v":"#ERROR!"},{"$f":"SUMIF(' 2-3-6. Travel&Costs of Stay'!C:C,B37,' 2-3-6. Travel&Costs of Stay'!O:O)","v":"#ERROR!"},{"$f":"SUMIF(' 2-3-6. Travel&Costs of Stay'!C:C,B37,' 2-3-6. Travel&Costs of Stay'!P:P)","v":"#ERROR!"},{"$f":"SUMIF('4. Equipment Costs'!C:C,B37,'4. Equipment Costs'!H:H)","v":"#ERROR!"},{"$f":"SUMIF('5. Subcontracting Costs'!C:C,B37,'5. Subcontracting Costs'!H:H)","v":"#ERROR!"},{"$f":"SUMIF(' 2-3-6. Travel&Costs of Stay'!C:C,B37,' 2-3-6. Travel&Costs of Stay'!N:N)","v":0},"#ERROR!"]
[null,"P12","NAMVARAN P&T COMPANY","Iran",{"$f":"IFERROR(IF(D38<>\"\",VLOOKUP(D38,CountryType,2,FALSE),\"\"),\"Country not found\")","v":"Partner Countries"},{"$f":"SUMIF('1. Staff costs'!C:C,B38,'1. Staff costs'!S:S)","v":"#ERROR!"},{"$f":"SUMIF(' 2-3-6. Travel&Costs of Stay'!C:C,B38,' 2-3-6. Travel&Costs of Stay'!O:O)","v":"#ERROR!"},{"$f":"SUMIF(' 2-3-6. Travel&Costs of Stay'!C:C,B38,' 2-3-6. Travel&Costs of Stay'!P:P)","v":"#ERROR!"},{"$f":"SUMIF('4. Equipment Costs'!C:C,B38,'4. Equipment Costs'!H:H)","v":0},{"$f":"SUMIF('5. Subcontracting Costs'!C:C,B38,'5. Subcontracting Costs'!H:H)","v":"#ERROR!"},{"$f":"SUMIF(' 2-3-6. Travel&Costs of Stay'!C:C,B38,' 2-3-6. Travel&Costs of Stay'!N:N)","v":0},"#ERROR!"]
[null,"P13",null,null,{"$f":"IFERROR(IF(D39<>\"\",VLOOKUP(D39,CountryType,2,FALSE),\"\"),\"Country not found\")","v":""},{"$f":"SUMIF('1. Staff costs'!C:C,B39,'1. Staff costs'!S:S)","v":0},{"$f":"SUMIF(' 2-3-6. Travel&Costs of Stay'!C:C,B39,' 2-3-6. Travel&Costs of Stay'!O:O)","v":0},{"$f":"SUMIF(' 2-3-6. Travel&Costs of Stay'!C:C,B39,' 2-3-6. Travel&Costs of Stay'!P:P)","v":0},{"$f":"SUMIF('4. Equipment Costs'!C:C,B39,'4. Equipment Costs'!H:H)","v":0},{"$f":"SUMIF('5. Subcontracting Costs'!C:C,B39,'5. Subcontracting Costs'!H:H)","v":0},{"$f":"SUMIF(' 2-3-6. Travel&Costs of Stay'!C:C,B39,' 2-3-6. Travel&Costs of Stay'!N:N)","v":0},0]
[null,"P14",null,null,{"$f":"IFERROR(IF(D40<>\"\",VLOOKUP(D40,CountryType,2,FALSE),\"\"),\"Country not found\")","v":""},{"$f":"SUMIF('1. Staff costs'!C:C,B40,'1. Staff costs'!S:S)","v":0},{"$f":"SUMIF(' 2-3-6. Travel&Costs of Stay'!C:C,B40,' 2-3-6. Travel&Costs of Stay'!O:O)","v":0},{"$f":"SUMIF(' 2-3-6. Travel&Costs of Stay'!C:C,B40,' 2-3-6. Travel&Costs of Stay'!P:P)","v":0},{"$f":"SUMIF('4. Equipment Costs'!C:C,B40,'4. Equipment Costs'!H:H)","v":0},{"$f":"SUMIF('5. Subcontracting Costs'!C:C,B40,'5. Subcontracting Costs'!H:H)","v":0},{"$f":"SUMIF(' 2-3-6. Travel&Costs of Stay'!C:C,B40,' 2-3-6. Travel&Costs of Stay'!N:N)","v":0},0]
[null,"P15",null,null,{"$f":"IFERROR(IF(D41<>\"\",VLOOKUP(D41,CountryType,2,FALSE),\"\"),\"Country not found\")","v":""},{"$f":"SUMIF('1. Staff costs'!C:C,B41,'1. Staff costs'!S:S)","v":0},{"$f":"SUMIF(' 2-3-6. Travel&Costs of Stay'!C:C,B41,' 2-3-6. Travel&Costs of Stay'!O:O)","v":0},{"$f":"SUMIF(' 2-3-6. Travel&Costs of Stay'!C:C,B41,' 2-3-6. Travel&Costs of Stay'!P:P)","v":0},{"$f":"SUMIF('4. Equipment Costs'!C:C,B41,'4. Equipment Costs'!H:H)","v":0},{"$f":"SUMIF('5. Subcontracting Costs'!C:C,B41,'5. Subcontracting Costs'!H:H)","v":0},{"$f":"SUMIF(' 2-3-6. Travel&Costs of Stay'!C:C,B41,' 2-3-6. Travel&Costs of Stay'!N:N)","v":0},0]
[null,"P16",null,null,{"$f":"IFERROR(IF(D42<>\"\",VLOOKUP(D42,CountryType,2,FALSE),\"\"),\"Country not found\")","v":""},{"$f":"SUMIF('1. Staff costs'!C:C,B42,'1. Staff costs'!S:S)","v":0},{"$f":"SUMIF(' 2-3-6. Travel&Costs of Stay'!C:C,B42,' 2-3-6. Travel&Costs of Stay'!O:O)","v":0},{"$f":"SUMIF(' 2-3-6. Travel&Costs of Stay'!C:C,B42,' 2-3-6. Travel&Costs of Stay'!P:P)","v":0},{"$f":"SUMIF('4. Equipment Costs'!C:C,B42,'4. Equipment Costs'!H:H)","v":0},{"$f":"SUMIF('5. Subcontracting Costs'!C:C,B42,'5. Subcontracting Costs'!H:H)","v":0},{"$f":"SUMIF(' 2-3-6. Travel&Costs of Stay'!C:C,B42,' 2-3-6. Travel&Costs of Stay'!N:N)","v":0},0]
[null,"P17",null,null,{"$f":"IFERROR(IF(D43<>\"\",VLOOKUP(D43,CountryType,2,FALSE),\"\"),\"Country not found\")","v":""},{"$f":"SUMIF('1. Staff costs'!C:C,B43,'1. Staff costs'!S:S)","v":0},{"$f":"SUMIF(' 2-3-6. Travel&Costs of Stay'!C:C,B43,' 2-3-6. Travel&Costs of Stay'!O:O)","v":0},{"$f":"SUMIF(' 2-3-6. Travel&Costs of Stay'!C:C,B43,' 2-3-6. Travel&Costs of Stay'!P:P)","v":0},{"$f":"SUMIF('4. Equipment Costs'!C:C,B43,'4. Equipment Costs'!H:H)","v":0},{"$f":"SUMIF('5. Subcontracting Costs'!C:C,B43,'5. Subcontracting Costs'!H:H)","v":0},{"$f":"SUMIF(' 2-3-6. Travel&Costs of Stay'!C:C,B43,' 2-3-6. Travel&Costs of Stay'!N:N)","v":0},0]
[null,"P18",null,null,{"$f":"IFERROR(IF(D44<>\"\",VLOOKUP(D44,CountryType,2,FALSE),\"\"),\"Country not found\")","v":""},{"$f":"SUMIF('1. Staff costs'!C:C,B44,'1. Staff costs'!S:S)","v":0},{"$f":"SUMIF(' 2-3-6. Travel&Costs of Stay'!C:C,B44,' 2-3-6. Travel&Costs of Stay'!O:O)","v":0},{"$f":"SUMIF(' 2-3-6. Travel&Costs of Stay'!C:C,B44,' 2-3-6. Travel&Costs of Stay'!P:P)","v":0},{"$f":"SUMIF('4. Equipment Costs'!C:C,B44,'4. Equipment Costs'!H:H)","v":0},{"$f":"SUMIF('5. Subcontracting Costs'!C:C,B44,'5. Subcontracting Costs'!H:H)","v":0},{"$f":"SUMIF(' 2-3-6. Travel&Costs of Stay'!C:C,B44,' 2-3-6. Travel&Costs of Stay'!N:N)","v":0},0]
[null,"P19",null,null,{"$f":"IFERROR(IF(D45<>\"\",VLOOKUP(D45,CountryType,2,FALSE),\"\"),\"Country not found\")","v":""},{"$f":"SUMIF('1. Staff costs'!C:C,B45,'1. Staff costs'!S:S)","v":0},{"$f":"SUMIF(' 2-3-6. Travel&Costs of Stay'!C:C,B45,' 2-3-6. Travel&Costs of Stay'!O:O)","v":0},{"$f":"SUMIF(' 2-3-6. Travel&Costs of Stay'!C:C,B45,' 2-3-6. Travel&Costs of Stay'!P:P)","v":0},{"$f":"SUMIF('4. Equipment Costs'!C:C,B45,'4. Equipment Costs'!H:H)","v":0},{"$f":"SUMIF('5. Subcontracting Costs'!C:C,B45,'5. Subcontracting Costs'!H:H)","v":0},{"$f":"SUMIF(' 2-3-6. Travel&Costs of Stay'!C:C,B45,' 2-3-6. Travel&Costs of Stay'!N:N)","v":0},0]
[null,"P20",null,null,{"$f":"IFERROR(IF(D46<>\"\",VLOOKUP(D46,CountryType,2,FALSE),\"\"),\"Country not found\")","v":""},{"$f":"SUMIF('1. Staff costs'!C:C,B46,'1. Staff costs'!S:S)","v":0},{"$f":"SUMIF(' 2-3-6. Travel&Costs of Stay'!C:C,B46,' 2-3-6. Travel&Costs of Stay'!O:O)","v":0},{"$f":"SUMIF(' 2-3-6. Travel&Costs of Stay'!C:C,B46,' 2-3-6. Travel&Costs of Stay'!P:P)","v":0},{"$f":"SUMIF('4. Equipment Costs'!C:C,B46,'4. Equipment Costs'!H:H)","v":0},{"$f":"SUMIF('5. Subcontracting Costs'!C:C,B46,'5. Subcontracting Costs'!H:H)","v":0},{"$f":"SUMIF(' 2-3-6. Travel&Costs of Stay'!C:C,B46,' 2-3-6. Travel&Costs of Stay'!N:N)","v":0},0]
[null,"P21",null,null,{"$f":"IFERROR(IF(D47<>\"\",VLOOKUP(D47,CountryType,2,FALSE),\"\"),\"Country not found\")","v":""},{"$f":"SUMIF('1. Staff costs'!C:C,B47,'1. Staff costs'!S:S)","v":0},{"$f":"SUMIF(' 2-3-6. Travel&Costs of Stay'!C:C,B47,' 2-3-6. Travel&Costs of Stay'!O:O)","v":0},{"$f":"SUMIF(' 2-3-6. Travel&Costs of Stay'!C:C,B47,' 2-3-6. Travel&Costs of Stay'!P:P)","v":0},{"$f":"SUMIF('4. Equipment Costs'!C:C,B47,'4. Equipment Costs'!H:H)","v":0},{"$f":"SUMIF('5. Subcontracting Costs'!C:C,B47,'5. Subcontracting Costs'!H:H)","v":0},{"$f":"SUMIF(' 2-3-6. Travel&Costs of Stay'!C:C,B47,' 2-3-6. Travel&Costs of Stay'!N:N)","v":0},0]
[null,"P22",null,null,{"$f":"IFERROR(IF(D48<>\"\",VLOOKUP(D48,CountryType,2,FALSE),\"\"),\"Country not found\")","v":""},{"$f":"SUMIF('1. Staff costs'!C:C,B48,'1. Staff costs'!S:S)","v":0},{"$f":"SUMIF(' 2-3-6. Travel&Costs of Stay'!C:C,B48,' 2-3-6. Travel&Costs of Stay'!O:O)","v":0},{"$f":"SUMIF(' 2-3-6. Travel&Costs of Stay'!C:C,B48,' 2-3-6. Travel&Costs of Stay'!P:P)","v":0},{"$f":"SUMIF('4. Equipment Costs'!C:C,B48,'4. Equipment Costs'!H:H)","v":0},{"$f":"SUMIF('5. Subcontracting Costs'!C:C,B48,'5. Subcontracting Costs'!H:H)","v":0},{"$f":"SUMIF(' 2-3-6. Travel&Costs of Stay'!C:C,B48,' 2-3-6. Travel&Costs of Stay'!N:N)","v":0},0]
[null,"P23",null,null,{"$f":"IFERROR(IF(D49<>\"\",VLOOKUP(D49,CountryType,2,FALSE),\"\"),\"Country not found\")","v":""},{"$f":"SUMIF('1. Staff costs'!C:C,B49,'1. Staff costs'!S:S)","v":0},{"$f":"SUMIF(' 2-3-6. Travel&Costs of Stay'!C:C,B49,' 2-3-6. Travel&Costs of Stay'!O:O)","v":0},{"$f":"SUMIF(' 2-3-6. Travel&Costs of Stay'!C:C,B49,' 2-3-6. Travel&Costs of Stay'!P:P)","v":0},{"$f":"SUMIF('4. Equipment Costs'!C:C,B49,'4. Equipment Costs'!H:H)","v":0},{"$f":"SUMIF('5. Subcontracting Costs'!C:C,B49,'5. Subcontracting Costs'!H:H)","v":0},{"$f":"SUMIF(' 2-3-6. Travel&Costs of Stay'!C:C,B49,' 2-3-6. Travel&Costs of Stay'!N:N)","v":0},0]
[null,"P24",null,null,{"$f":"IFERROR(IF(D50<>\"\",VLOOKUP(D50,CountryType,2,FALSE),\"\"),\"Country not found\")","v":""},{"$f":"SUMIF('1. Staff costs'!C:C,B50,'1. Staff costs'!S:S)","v":0},{"$f":"SUMIF(' 2-3-6. Travel&Costs of Stay'!C:C,B50,' 2-3-6. Travel&Costs of Stay'!O:O)","v":0},{"$f":"SUMIF(' 2-3-6. Travel&Costs of Stay'!C:C,B50,' 2-3-6. Travel&Costs of Stay'!P:P)","v":0},{"$f":"SUMIF('4. Equipment Costs'!C:C,B50,'4. Equipment Costs'!H:H)","v":0},{"$f":"SUMIF('5. Subcontracting Costs'!C:C,B50,'5. Subcontracting Costs'!H:H)","v":0},{"$f":"SUMIF(' 2-3-6. Travel&Costs of Stay'!C:C,B50,' 2-3-6. Travel&Costs of Stay'!N:N)","v":0},0]
[null,"P25",null,null,{"$f":"IFERROR(IF(D51<>\"\",VLOOKUP(D51,CountryType,2,FALSE),\"\"),\"Country not found\")","v":""},{"$f":"SUMIF('1. Staff costs'!C:C,B51,'1. Staff costs'!S:S)","v":0},{"$f":"SUMIF(' 2-3-6. Travel&Costs of Stay'!C:C,B51,' 2-3-6. Travel&Costs of Stay'!O:O)","v":0},{"$f":"SUMIF(' 2-3-6. Travel&Costs of Stay'!C:C,B51,' 2-3-6. Travel&Costs of Stay'!P:P)","v":0},{"$f":"SUMIF('4. Equipment Costs'!C:C,B51,'4. Equipment Costs'!H:H)","v":0},{"$f":"SUMIF('5. Subcontracting Costs'!C:C,B51,'5. Subcontracting Costs'!H:H)","v":0},{"$f":"SUMIF(' 2-3-6. Travel&Costs of Stay'!C:C,B51,' 2-3-6. Travel&Costs of Stay'!N:N)","v":0},0]
[null,"P26",null,null,{"$f":"IFERROR(IF(D52<>\"\",VLOOKUP(D52,CountryType,2,FALSE),\"\"),\"Country not found\")","v":""},{"$f":"SUMIF('1. Staff costs'!C:C,B52,'1. Staff costs'!S:S)","v":0},{"$f":"SUMIF(' 2-3-6. Travel&Costs of Stay'!C:C,B52,' 2-3-6. Travel&Costs of Stay'!O:O)","v":0},{"$f":"SUMIF(' 2-3-6. Travel&Costs of Stay'!C:C,B52,' 2-3-6. Travel&Costs of Stay'!P:P)","v":0},{"$f":"SUMIF('4. Equipment Costs'!C:C,B52,'4. Equipment Costs'!H:H)","v":0},{"$f":"SUMIF('5. Subcontracting Costs'!C:C,B52,'5. Subcontracting Costs'!H:H)","v":0},{"$f":"SUMIF(' 2-3-6. Travel&Costs of Stay'!C:C,B52,' 2-3-6. Travel&Costs of Stay'!N:N)","v":0},0]
[null,"P27",null,null,{"$f":"IFERROR(IF(D53<>\"\",VLOOKUP(D53,CountryType,2,FALSE),\"\"),\"Country not found\")","v":""},{"$f":"SUMIF('1. Staff costs'!C:C,B53,'1. Staff costs'!S:S)","v":0},{"$f":"SUMIF(' 2-3-6. Travel&Costs of Stay'!C:C,B53,' 2-3-6. Travel&Costs of Stay'!O:O)","v":0},{"$f":"SUMIF(' 2-3-6. Travel&Costs of Stay'!C:C,B53,' 2-3-6. Travel&Costs of Stay'!P:P)","v":0},{"$f":"SUMIF('4. Equipment Costs'!C:C,B53,'4. Equipment Costs'!H:H)","v":0},{"$f":"SUMIF('5. Subcontracting Costs'!C:C,B53,'5. Subcontracting Costs'!H:H)","v":0},{"$f":"SUMIF(' 2-3-6. Travel&Costs of Stay'!C:C,B53,' 2-3-6. Travel&Costs of Stay'!N:N)","v":0},0]
[null,"P28",null,null,{"$f":"IFERROR(IF(D54<>\"\",VLOOKUP(D54,CountryType,2,FALSE),\"\"),\"Country not found\")","v":""},{"$f":"SUMIF('1. Staff costs'!C:C,B54,'1. Staff costs'!S:S)","v":0},{"$f":"SUMIF(' 2-3-6. Travel&Costs of Stay'!C:C,B54,' 2-3-6. Travel&Costs of Stay'!O:O)","v":0},{"$f":"SUMIF(' 2-3-6. Travel&Costs of Stay'!C:C,B54,' 2-3-6. Travel&Costs of Stay'!P:P)","v":0},{"$f":"SUMIF('4. Equipment Costs'!C:C,B54,'4. Equipment Costs'!H:H)","v":0},{"$f":"SUMIF('5. Subcontracting Costs'!C:C,B54,'5. Subcontracting Costs'!H:H)","v":0},{"$f":"SUMIF(' 2-3-6. Travel&Costs of Stay'!C:C,B54,' 2-3-6. Travel&Costs of Stay'!N:N)","v":0},0]
[null,"P29",null,null,{"$f":"IFERROR(IF(D55<>\"\",VLOOKUP(D55,CountryType,2,FALSE),\"\"),\"Country not found\")","v":""},{"$f":"SUMIF('1. Staff costs'!C:C,B55,'1. Staff costs'!S:S)","v":0},{"$f":"SUMIF(' 2-3-6. Travel&Costs of Stay'!C:C,B55,' 2-3-6. Travel&Costs of Stay'!O:O)","v":0},{"$f":"SUMIF(' 2-3-6. Travel&Costs of Stay'!C:C,B55,' 2-3-6. Travel&Costs of Stay'!P:P)","v":0},{"$f":"SUMIF('4. Equipment Costs'!C:C,B55,'4. Equipment Costs'!H:H)","v":0},{"$f":"SUMIF('5. Subcontracting Costs'!C:C,B55,'5. Subcontracting Costs'!H:H)","v":0},{"$f":"SUMIF(' 2-3-6. Travel&Costs of Stay'!C:C,B55,' 2-3-6. Travel&Costs of Stay'!N:N)","v":0},0]
[null,"P30",null,null,{"$f":"IFERROR(IF(D56<>\"\",VLOOKUP(D56,CountryType,2,FALSE),\"\"),\"Country not found\")","v":""},{"$f":"SUMIF('1. Staff costs'!C:C,B56,'1. Staff costs'!S:S)","v":0},{"$f":"SUMIF(' 2-3-6. Travel&Costs of Stay'!C:C,B56,' 2-3-6. Travel&Costs of Stay'!O:O)","v":0},{"$f":"SUMIF(' 2-3-6. Travel&Costs of Stay'!C:C,B56,' 2-3-6. Travel&Costs of Stay'!P:P)","v":0},{"$f":"SUMIF('4. Equipment Costs'!C:C,B56,'4. Equipment Costs'!H:H)","v":0},{"$f":"SUMIF('5. Subcontracting Costs'!C:C,B56,'5. Subcontracting Costs'!H:H)","v":0},{"$f":"SUMIF(' 2-3-6. Travel&Costs of Stay'!C:C,B56,' 2-3-6. Travel&Costs of Stay'!N:N)","v":0},0]
[null,"P31",null,null,{"$f":"IFERROR(IF(D57<>\"\",VLOOKUP(D57,CountryType,2,FALSE),\"\"),\"Country not found\")","v":""},{"$f":"SUMIF('1. Staff costs'!C:C,B57,'1. Staff costs'!S:S)","v":0},{"$f":"SUMIF(' 2-3-6. Travel&Costs of Stay'!C:C,B57,' 2-3-6. Travel&Costs of Stay'!O:O)","v":0},{"$f":"SUMIF(' 2-3-6. Travel&Costs of Stay'!C:C,B57,' 2-3-6. Travel&Costs of Stay'!P:P)","v":0},{"$f":"SUMIF('4. Equipment Costs'!C:C,B57,'4. Equipment Costs'!H:H)","v":0},{"$f":"SUMIF('5. Subcontracting Costs'!C:C,B57,'5. Subcontracting Costs'!H:H)","v":0},{"$f":"SUMIF(' 2-3-6. Travel&Costs of Stay'!C:C,B57,' 2-3-6. Travel&Costs of Stay'!N:N)","v":0},0]
[null,"P32",null,null,{"$f":"IFERROR(IF(D58<>\"\",VLOOKUP(D58,CountryType,2,FALSE),\"\"),\"Country not found\")","v":""},{"$f":"SUMIF('1. Staff costs'!C:C,B58,'1. Staff costs'!S:S)","v":0},{"$f":"SUMIF(' 2-3-6. Travel&Costs of Stay'!C:C,B58,' 2-3-6. Travel&Costs of Stay'!O:O)","v":0},{"$f":"SUMIF(' 2-3-6. Travel&Costs of Stay'!C:C,B58,' 2-3-6. Travel&Costs of Stay'!P:P)","v":0},{"$f":"SUMIF('4. Equipment Costs'!C:C,B58,'4. Equipment Costs'!H:H)","v":0},{"$f":"SUMIF('5. Subcontracting Costs'!C:C,B58,'5. Subcontracting Costs'!H:H)","v":0},{"$f":"SUMIF(' 2-3-6. Travel&Costs of Stay'!C:C,B58,' 2-3-6. Travel&Costs of Stay'!N:N)","v":0},0]
[null,"P33",null,null,{"$f":"IFERROR(IF(D59<>\"\",VLOOKUP(D59,CountryType,2,FALSE),\"\"),\"Country not found\")","v":""},{"$f":"SUMIF('1. Staff costs'!C:C,B59,'1. Staff costs'!S:S)","v":0},{"$f":"SUMIF(' 2-3-6. Travel&Costs of Stay'!C:C,B59,' 2-3-6. Travel&Costs of Stay'!O:O)","v":0},{"$f":"SUMIF(' 2-3-6. Travel&Costs of Stay'!C:C,B59,' 2-3-6. Travel&Costs of Stay'!P:P)","v":0},{"$f":"SUMIF('4. Equipment Costs'!C:C,B59,'4. Equipment Costs'!H:H)","v":0},{"$f":"SUMIF('5. Subcontracting Costs'!C:C,B59,'5. Subcontracting Costs'!H:H)","v":0},{"$f":"SUMIF(' 2-3-6. Travel&Costs of Stay'!C:C,B59,' 2-3-6. Travel&Costs of Stay'!N:N)","v":0},0]
[null,"P34",null,null,{"$f":"IFERROR(IF(D60<>\"\",VLOOKUP(D60,CountryType,2,FALSE),\"\"),\"Country not found\")","v":""},{"$f":"SUMIF('1. Staff costs'!C:C,B60,'1. Staff costs'!S:S)","v":0},{"$f":"SUMIF(' 2-3-6. Travel&Costs of Stay'!C:C,B60,' 2-3-6. Travel&Costs of Stay'!O:O)","v":0},{"$f":"SUMIF(' 2-3-6. Travel&Costs of Stay'!C:C,B60,' 2-3-6. Travel&Costs of Stay'!P:P)","v":0},{"$f":"SUMIF('4. Equipment Costs'!C:C,B60,'4. Equipment Costs'!H:H)","v":0},{"$f":"SUMIF('5. Subcontracting Costs'!C:C,B60,'5. Subcontracting Costs'!H:H)","v":0},{"$f":"SUMIF(' 2-3-6. Travel&Costs of Stay'!C:C,B60,' 2-3-6. Travel&Costs of Stay'!N:N)","v":0},0]
[null,"P35",null,null,{"$f":"IFERROR(IF(D61<>\"\",VLOOKUP(D61,CountryType,2,FALSE),\"\"),\"Country not found\")","v":""},{"$f":"SUMIF('1. Staff costs'!C:C,B61,'1. Staff costs'!S:S)","v":0},{"$f":"SUMIF(' 2-3-6. Travel&Costs of Stay'!C:C,B61,' 2-3-6. Travel&Costs of Stay'!O:O)","v":0},{"$f":"SUMIF(' 2-3-6. Travel&Costs of Stay'!C:C,B61,' 2-3-6. Travel&Costs of Stay'!P:P)","v":0},{"$f":"SUMIF('4. Equipment Costs'!C:C,B61,'4. Equipment Costs'!H:H)","v":0},{"$f":"SUMIF('5. Subcontracting Costs'!C:C,B61,'5. Subcontracting Costs'!H:H)","v":0},{"$f":"SUMIF(' 2-3-6. Travel&Costs of Stay'!C:C,B61,' 2-3-6. Travel&Costs of Stay'!N:N)","v":0},0]
[null,"P36",null,null,{"$f":"IFERROR(IF(D62<>\"\",VLOOKUP(D62,CountryType,2,FALSE),\"\"),\"Country not found\")","v":""},{"$f":"SUMIF('1. Staff costs'!C:C,B62,'1. Staff costs'!S:S)","v":0},{"$f":"SUMIF(' 2-3-6. Travel&Costs of Stay'!C:C,B62,' 2-3-6. Travel&Costs of Stay'!O:O)","v":0},{"$f":"SUMIF(' 2-3-6. Travel&Costs of Stay'!C:C,B62,' 2-3-6. Travel&Costs of Stay'!P:P)","v":0},{"$f":"SUMIF('4. Equipment Costs'!C:C,B62,'4. Equipment Costs'!H:H)","v":0},{"$f":"SUMIF('5. Subcontracting Costs'!C:C,B62,'5. Subcontracting Costs'!H:H)","v":0},{"$f":"SUMIF(' 2-3-6. Travel&Costs of Stay'!C:C,B62,' 2-3-6. Travel&Costs of Stay'!N:N)","v":0},0]
[null,"P37",null,null,{"$f":"IFERROR(IF(D63<>\"\",VLOOKUP(D63,CountryType,2,FALSE),\"\"),\"Country not found\")","v":""},{"$f":"SUMIF('1. Staff costs'!C:C,B63,'1. Staff costs'!S:S)","v":0},{"$f":"SUMIF(' 2-3-6. Travel&Costs of Stay'!C:C,B63,' 2-3-6. Travel&Costs of Stay'!O:O)","v":0},{"$f":"SUMIF(' 2-3-6. Travel&Costs of Stay'!C:C,B63,' 2-3-6. Travel&Costs of Stay'!P:P)","v":0},{"$f":"SUMIF('4. Equipment Costs'!C:C,B63,'4. Equipment Costs'!H:H)","v":0},{"$f":"SUMIF('5. Subcontracting Costs'!C:C,B63,'5. Subcontracting Costs'!H:H)","v":0},{"$f":"SUMIF(' 2-3-6. Travel&Costs of Stay'!C:C,B63,' 2-3-6. Travel&Costs of Stay'!N:N)","v":0},0]
[null,"P38",null,null,{"$f":"IFERROR(IF(D64<>\"\",VLOOKUP(D64,CountryType,2,FALSE),\"\"),\"Country not found\")","v":""},{"$f":"SUMIF('1. Staff costs'!C:C,B64,'1. Staff costs'!S:S)","v":0},{"$f":"SUMIF(' 2-3-6. Travel&Costs of Stay'!C:C,B64,' 2-3-6. Travel&Costs of Stay'!O:O)","v":0},{"$f":"SUMIF(' 2-3-6. Travel&Costs of Stay'!C:C,B64,' 2-3-6. Travel&Costs of Stay'!P:P)","v":0},{"$f":"SUMIF('4. Equipment Costs'!C:C,B64,'4. Equipment Costs'!H:H)","v":0},{"$f":"SUMIF('5. Subcontracting Costs'!C:C,B64,'5. Subcontracting Costs'!H:H)","v":0},{"$f":"SUMIF(' 2-3-6. Travel&Costs of Stay'!C:C,B64,' 2-3-6. Travel&Costs of Stay'!N:N)","v":0},0]
[null,"P39",null,null,{"$f":"IFERROR(IF(D65<>\"\",VLOOKUP(D65,CountryType,2,FALSE),\"\"),\"Country not found\")","v":""},{"$f":"SUMIF('1. Staff costs'!C:C,B65,'1. Staff costs'!S:S)","v":0},{"$f":"SUMIF(' 2-3-6. Travel&Costs of Stay'!C:C,B65,' 2-3-6. Travel&Costs of Stay'!O:O)","v":0},{"$f":"SUMIF(' 2-3-6. Travel&Costs of Stay'!C:C,B65,' 2-3-6. Travel&Costs of Stay'!P:P)","v":0},{"$f":"SUMIF('4. Equipment Costs'!C:C,B65,'4. Equipment Costs'!H:H)","v":0},{"$f":"SUMIF('5. Subcontracting Costs'!C:C,B65,'5. Subcontracting Costs'!H:H)","v":0},{"$f":"SUMIF(' 2-3-6. Travel&Costs of Stay'!C:C,B65,' 2-3-6. Travel&Costs of Stay'!N:N)","v":0},0]
[null,"P40",null,null,{"$f":"IFERROR(IF(D66<>\"\",VLOOKUP(D66,CountryType,2,FALSE),\"\"),\"Country not found\")","v":""},{"$f":"SUMIF('1. Staff costs'!C:C,B66,'1. Staff costs'!S:S)","v":0},{"$f":"SUMIF(' 2-3-6. Travel&Costs of Stay'!C:C,B66,' 2-3-6. Travel&Costs of Stay'!O:O)","v":0},{"$f":"SUMIF(' 2-3-6. Travel&Costs of Stay'!C:C,B66,' 2-3-6. Travel&Costs of Stay'!P:P)","v":0},{"$f":"SUMIF('4. Equipment Costs'!C:C,B66,'4. Equipment Costs'!H:H)","v":0},{"$f":"SUMIF('5. Subcontracting Costs'!C:C,B66,'5. Subcontracting Costs'!H:H)","v":0},{"$f":"SUMIF(' 2-3-6. Travel&Costs of Stay'!C:C,B66,' 2-3-6. Travel&Costs of Stay'!N:N)","v":0},0]
[null,"P41",null,null,{"$f":"IFERROR(IF(D67<>\"\",VLOOKUP(D67,CountryType,2,FALSE),\"\"),\"Country not found\")","v":""},{"$f":"SUMIF('1. Staff costs'!C:C,B67,'1. Staff costs'!S:S)","v":0},{"$f":"SUMIF(' 2-3-6. Travel&Costs of Stay'!C:C,B67,' 2-3-6. Travel&Costs of Stay'!O:O)","v":0},{"$f":"SUMIF(' 2-3-6. Travel&Costs of Stay'!C:C,B67,' 2-3-6. Travel&Costs of Stay'!P:P)","v":0},{"$f":"SUMIF('4. Equipment Costs'!C:C,B67,'4. Equipment Costs'!H:H)","v":0},{"$f":"SUMIF('5. Subcontracting Costs'!C:C,B67,'5. Subcontracting Costs'!H:H)","v":0},{"$f":"SUMIF(' 2-3-6. Travel&Costs of Stay'!C:C,B67,' 2-3-6. Travel&Costs of Stay'!N:N)","v":0},0]
[null,"P42",null,null,{"$f":"IFERROR(IF(D68<>\"\",VLOOKUP(D68,CountryType,2,FALSE),\"\"),\"Country not found\")","v":""},{"$f":"SUMIF('1. Staff costs'!C:C,B68,'1. Staff costs'!S:S)","v":0},{"$f":"SUMIF(' 2-3-6. Travel&Costs of Stay'!C:C,B68,' 2-3-6. Travel&Costs of Stay'!O:O)","v":0},{"$f":"SUMIF(' 2-3-6. Travel&Costs of Stay'!C:C,B68,' 2-3-6. Travel&Costs of Stay'!P:P)","v":0},{"$f":"SUMIF('4. Equipment Costs'!C:C,B68,'4. Equipment Costs'!H:H)","v":0},{"$f":"SUMIF('5. Subcontracting Costs'!C:C,B68,'5. Subcontracting Costs'!H:H)","v":0},{"$f":"SUMIF(' 2-3-6. Travel&Costs of Stay'!C:C,B68,' 2-3-6. Travel&Costs of Stay'!N:N)","v":0},0]
[null,"P43",null,null,{"$f":"IFERROR(IF(D69<>\"\",VLOOKUP(D69,CountryType,2,FALSE),\"\"),\"Country not found\")","v":""},{"$f":"SUMIF('1. Staff costs'!C:C,B69,'1. Staff costs'!S:S)","v":0},{"$f":"SUMIF(' 2-3-6. Travel&Costs of Stay'!C:C,B69,' 2-3-6. Travel&Costs of Stay'!O:O)","v":0},{"$f":"SUMIF(' 2-3-6. Travel&Costs of Stay'!C:C,B69,' 2-3-6. Travel&Costs of Stay'!P:P)","v":0},{"$f":"SUMIF('4. Equipment Costs'!C:C,B69,'4. Equipment Costs'!H:H)","v":0},{"$f":"SUMIF('5. Subcontracting Costs'!C:C,B69,'5. Subcontracting Costs'!H:H)","v":0},{"$f":"SUMIF(' 2-3-6. Travel&Costs of Stay'!C:C,B69,' 2-3-6. Travel&Costs of Stay'!N:N)","v":0},0]
[null,"P44",null,null,{"$f":"IFERROR(IF(D70<>\"\",VLOOKUP(D70,CountryType,2,FALSE),\"\"),\"Country not found\")","v":""},{"$f":"SUMIF('1. Staff costs'!C:C,B70,'1. Staff costs'!S:S)","v":0},{"$f":"SUMIF(' 2-3-6. Travel&Costs of Stay'!C:C,B70,' 2-3-6. Travel&Costs of Stay'!O:O)","v":0},{"$f":"SUMIF(' 2-3-6. Travel&Costs of Stay'!C:C,B70,' 2-3-6. Travel&Costs of Stay'!P:P)","v":0},{"$f":"SUMIF('4. Equipment Costs'!C:C,B70,'4. Equipment Costs'!H:H)","v":0},{"$f":"SUMIF('5. Subcontracting Costs'!C:C,B70,'5. Subcontracting Costs'!H:H)","v":0},{"$f":"SUMIF(' 2-3-6. Travel&Costs of Stay'!C:C,B70,' 2-3-6. Travel&Costs of Stay'!N:N)","v":0},0]
[null,"P45",null,null,{"$f":"IFERROR(IF(D71<>\"\",VLOOKUP(D71,CountryType,2,FALSE),\"\"),\"Country not found\")","v":""},{"$f":"SUMIF('1. Staff costs'!C:C,B71,'1. Staff costs'!S:S)","v":0},{"$f":"SUMIF(' 2-3-6. Travel&Costs of Stay'!C:C,B71,' 2-3-6. Travel&Costs of Stay'!O:O)","v":0},{"$f":"SUMIF(' 2-3-6. Travel&Costs of Stay'!C:C,B71,' 2-3-6. Travel&Costs of Stay'!P:P)","v":0},{"$f":"SUMIF('4. Equipment Costs'!C:C,B71,'4. Equipment Costs'!H:H)","v":0},{"$f":"SUMIF('5. Subcontracting Costs'!C:C,B71,'5. Subcontracting Costs'!H:H)","v":0},{"$f":"SUMIF(' 2-3-6. Travel&Costs of Stay'!C:C,B71,' 2-3-6. Travel&Costs of Stay'!N:N)","v":0},0]
[null,"P46",null,null,{"$f":"IFERROR(IF(D72<>\"\",VLOOKUP(D72,CountryType,2,FALSE),\"\"),\"Country not found\")","v":""},{"$f":"SUMIF('1. Staff costs'!C:C,B72,'1. Staff costs'!S:S)","v":0},{"$f":"SUMIF(' 2-3-6. Travel&Costs of Stay'!C:C,B72,' 2-3-6. Travel&Costs of Stay'!O:O)","v":0},{"$f":"SUMIF(' 2-3-6. Travel&Costs of Stay'!C:C,B72,' 2-3-6. Travel&Costs of Stay'!P:P)","v":0},{"$f":"SUMIF('4. Equipment Costs'!C:C,B72,'4. Equipment Costs'!H:H)","v":0},{"$f":"SUMIF('5. Subcontracting Costs'!C:C,B72,'5. Subcontracting Costs'!H:H)","v":0},{"$f":"SUMIF(' 2-3-6. Travel&Costs of Stay'!C:C,B72,' 2-3-6. Travel&Costs of Stay'!N:N)","v":0},0]
[null,"P47",null,null,{"$f":"IFERROR(IF(D73<>\"\",VLOOKUP(D73,CountryType,2,FALSE),\"\"),\"Country not found\")","v":""},{"$f":"SUMIF('1. Staff costs'!C:C,B73,'1. Staff costs'!S:S)","v":0},{"$f":"SUMIF(' 2-3-6. Travel&Costs of Stay'!C:C,B73,' 2-3-6. Travel&Costs of Stay'!O:O)","v":0},{"$f":"SUMIF(' 2-3-6. Travel&Costs of Stay'!C:C,B73,' 2-3-6. Travel&Costs of Stay'!P:P)","v":0},{"$f":"SUMIF('4. Equipment Costs'!C:C,B73,'4. Equipment Costs'!H:H)","v":0},{"$f":"SUMIF('5. Subcontracting Costs'!C:C,B73,'5. Subcontracting Costs'!H:H)","v":0},{"$f":"SUMIF(' 2-3-6. Travel&Costs of Stay'!C:C,B73,' 2-3-6. Travel&Costs of Stay'!N:N)","v":0},0]
[null,"P48",null,null,{"$f":"IFERROR(IF(D74<>\"\",VLOOKUP(D74,CountryType,2,FALSE),\"\"),\"Country not found\")","v":""},{"$f":"SUMIF('1. Staff costs'!C:C,B74,'1. Staff costs'!S:S)","v":0},{"$f":"SUMIF(' 2-3-6. Travel&Costs of Stay'!C:C,B74,' 2-3-6. Travel&Costs of Stay'!O:O)","v":0},{"$f":"SUMIF(' 2-3-6. Travel&Costs of Stay'!C:C,B74,' 2-3-6. Travel&Costs of Stay'!P:P)","v":0},{"$f":"SUMIF('4. Equipment Costs'!C:C,B74,'4. Equipment Costs'!H:H)","v":0},{"$f":"SUMIF('5. Subcontracting Costs'!C:C,B74,'5. Subcontracting Costs'!H:H)","v":0},{"$f":"SUMIF(' 2-3-6. Travel&Costs of Stay'!C:C,B74,' 2-3-6. Travel&Costs of Stay'!N:N)","v":0},0]
[null,"P49",null,null,{"$f":"IFERROR(IF(D75<>\"\",VLOOKUP(D75,CountryType,2,FALSE),\"\"),\"Country not found\")","v":""},{"$f":"SUMIF('1. Staff costs'!C:C,B75,'1. Staff costs'!S:S)","v":0},{"$f":"SUMIF(' 2-3-6. Travel&Costs of Stay'!C:C,B75,' 2-3-6. Travel&Costs of Stay'!O:O)","v":0},{"$f":"SUMIF(' 2-3-6. Travel&Costs of Stay'!C:C,B75,' 2-3-6. Travel&Costs of Stay'!P:P)","v":0},{"$f":"SUMIF('4. Equipment Costs'!C:C,B75,'4. Equipment Costs'!H:H)","v":0},{"$f":"SUMIF('5. Subcontracting Costs'!C:C,B75,'5. Subcontracting Costs'!H:H)","v":0},{"$f":"SUMIF(' 2-3-6. Travel&Costs of Stay'!C:C,B75,' 2-3-6. Travel&Costs of Stay'!N:N)","v":0},0]
[null,"P50",null,null,{"$f":"IFERROR(IF(D76<>\"\",VLOOKUP(D76,CountryType,2,FALSE),\"\"),\"Country not found\")","v":""},{"$f":"SUMIF('1. Staff costs'!C:C,B76,'1. Staff costs'!S:S)","v":0},{"$f":"SUMIF(' 2-3-6. Travel&Costs of Stay'!C:C,B76,' 2-3-6. Travel&Costs of Stay'!O:O)","v":0},{"$f":"SUMIF(' 2-3-6. Travel&Costs of Stay'!C:C,B76,' 2-3-6. Travel&Costs of Stay'!P:P)","v":0},{"$f":"SUMIF('4. Equipment Costs'!C:C,B76,'4. Equipment Costs'!H:H)","v":0},{"$f":"SUMIF('5. Subcontracting Costs'!C:C,B76,'5. Subcontracting Costs'!H:H)","v":0},{"$f":"SUMIF(' 2-3-6. Travel&Costs of Stay'!C:C,B76,' 2-3-6. Travel&Costs of Stay'!N:N)","v":0},0]
[null,"P51",null,null,{"$f":"IFERROR(IF(D77<>\"\",VLOOKUP(D77,CountryType,2,FALSE),\"\"),\"Country not found\")","v":""},{"$f":"SUMIF('1. Staff costs'!C:C,B77,'1. Staff costs'!S:S)","v":0},{"$f":"SUMIF(' 2-3-6. Travel&Costs of Stay'!C:C,B77,' 2-3-6. Travel&Costs of Stay'!O:O)","v":0},{"$f":"SUMIF(' 2-3-6. Travel&Costs of Stay'!C:C,B77,' 2-3-6. Travel&Costs of Stay'!P:P)","v":0},{"$f":"SUMIF('4. Equipment Costs'!C:C,B77,'4. Equipment Costs'!H:H)","v":0},{"$f":"SUMIF('5. Subcontracting Costs'!C:C,B77,'5. Subcontracting Costs'!H:H)","v":0},{"$f":"SUMIF(' 2-3-6. Travel&Costs of Stay'!C:C,B77,' 2-3-6. Travel&Costs of Stay'!N:N)","v":0},0]
[null,"P52",null,null,{"$f":"IFERROR(IF(D78<>\"\",VLOOKUP(D78,CountryType,2,FALSE),\"\"),\"Country not found\")","v":""},{"$f":"SUMIF('1. Staff costs'!C:C,B78,'1. Staff costs'!S:S)","v":0},{"$f":"SUMIF(' 2-3-6. Travel&Costs of Stay'!C:C,B78,' 2-3-6. Travel&Costs of Stay'!O:O)","v":0},{"$f":"SUMIF(' 2-3-6. Travel&Costs of Stay'!C:C,B78,' 2-3-6. Travel&Costs of Stay'!P:P)","v":0},{"$f":"SUMIF('4. Equipment Costs'!C:C,B78,'4. Equipment Costs'!H:H)","v":0},{"$f":"SUMIF('5. Subcontracting Costs'!C:C,B78,'5. Subcontracting Costs'!H:H)","v":0},{"$f":"SUMIF(' 2-3-6. Travel&Costs of Stay'!C:C,B78,' 2-3-6. Travel&Costs of Stay'!N:N)","v":0},0]
[null,"P53",null,null,{"$f":"IFERROR(IF(D79<>\"\",VLOOKUP(D79,CountryType,2,FALSE),\"\"),\"Country not found\")","v":""},{"$f":"SUMIF('1. Staff costs'!C:C,B79,'1. Staff costs'!S:S)","v":0},{"$f":"SUMIF(' 2-3-6. Travel&Costs of Stay'!C:C,B79,' 2-3-6. Travel&Costs of Stay'!O:O)","v":0},{"$f":"SUMIF(' 2-3-6. Travel&Costs of Stay'!C:C,B79,' 2-3-6. Travel&Costs of Stay'!P:P)","v":0},{"$f":"SUMIF('4. Equipment Costs'!C:C,B79,'4. Equipment Costs'!H:H)","v":0},{"$f":"SUMIF('5. Subcontracting Costs'!C:C,B79,'5. Subcontracting Costs'!H:H)","v":0},{"$f":"SUMIF(' 2-3-6. Travel&Costs of Stay'!C:C,B79,' 2-3-6. Travel&Costs of Stay'!N:N)","v":0},0]
[null,"P54",null,null,{"$f":"IFERROR(IF(D80<>\"\",VLOOKUP(D80,CountryType,2,FALSE),\"\"),\"Country not found\")","v":""},{"$f":"SUMIF('1. Staff costs'!C:C,B80,'1. Staff costs'!S:S)","v":0},{"$f":"SUMIF(' 2-3-6. Travel&Costs of Stay'!C:C,B80,' 2-3-6. Travel&Costs of Stay'!O:O)","v":0},{"$f":"SUMIF(' 2-3-6. Travel&Costs of Stay'!C:C,B80,' 2-3-6. Travel&Costs of Stay'!P:P)","v":0},{"$f":"SUMIF('4. Equipment Costs'!C:C,B80,'4. Equipment Costs'!H:H)","v":0},{"$f":"SUMIF('5. Subcontracting Costs'!C:C,B80,'5. Subcontracting Costs'!H:H)","v":0},{"$f":"SUMIF(' 2-3-6. Travel&Costs of Stay'!C:C,B80,' 2-3-6. Travel&Costs of Stay'!N:N)","v":0},0]
[null,"P55",null,null,{"$f":"IFERROR(IF(D81<>\"\",VLOOKUP(D81,CountryType,2,FALSE),\"\"),\"Country not found\")","v":""},{"$f":"SUMIF('1. Staff costs'!C:C,B81,'1. Staff costs'!S:S)","v":0},{"$f":"SUMIF(' 2-3-6. Travel&Costs of Stay'!C:C,B81,' 2-3-6. Travel&Costs of Stay'!O:O)","v":0},{"$f":"SUMIF(' 2-3-6. Travel&Costs of Stay'!C:C,B81,' 2-3-6. Travel&Costs of Stay'!P:P)","v":0},{"$f":"SUMIF('4. Equipment Costs'!C:C,B81,'4. Equipment Costs'!H:H)","v":0},{"$f":"SUMIF('5. Subcontracting Costs'!C:C,B81,'5. Subcontracting Costs'!H:H)","v":0},{"$f":"SUMIF(' 2-3-6. Travel&Costs of Stay'!C:C,B81,' 2-3-6. Travel&Costs of Stay'!N:N)","v":0},0]

{"sheet":"Sheet Validation","index":1,"n_rows":7,"n_cols":2,"rows_kept":7,"cut":false,"hidden":true,"merged":[]}
["Data Sheet Validation"]
["1. Staff Costs",{"$f":"IF(COUNTIF('1. Staff costs'!T:T,\"Error\")<=1,\"OK\",\"Please check data in Tab '\"&A2&\"'\")","v":"OK"}]
["2-3. Travel Costs&Costs of Stay",{"$f":"IF(COUNTIF(' 2-3-6. Travel&Costs of Stay'!R:R,\"Error\")<=1,\"OK\",\"Please check data in Tab '\"&A3&\"'\")","v":"OK"}]
["4. Equipment Costs",{"$f":"IF(COUNTIF('4. Equipment Costs'!I:T,\"Error\")<=1,\"OK\",\"Please check data in Tab '\"&A4&\"'\")","v":"OK"}]
["5. Subcontracting Costs",{"$f":"IF(COUNTIF('5. Subcontracting Costs'!I:I,\"Error\")<=1,\"OK\",\"Please check data in Tab '\"&A5&\"'\")","v":"OK"}]
["Co-financing",{"$f":"IF(COUNTIF('Co-financing'!J:J,\"Error\")<=1,\"OK\",\"Please check data in Tab '\"&A6&\"'\")","v":"OK"}]
["Exceptional Travel Costs (EUR)",{"$f":"IF(' 2-3-6. Travel&Costs of Stay'!K4=\"\",\"OK\",\"Please check Exceptional Travel Costs (EUR) in Tab '\"&A3&\"'\")","v":"OK"}]

{"sheet":"1. Staff costs","index":2,"n_rows":73,"n_cols":20,"rows_kept":73,"cut":false,"hidden":false,"merged":[[1,1,1,19],[2,1,2,19],[3,1,3,2],[3,5,8,19],[4,1,4,2],[5,1,5,2],[6,1,6,2],[9,1,9,19],[10,8,10,10],[10,11,10,13],[10,14,10,16],[10,17,11,17],[10,18,11,18],[10,19,11,19],[7,1,7,2],[8,1,8,2],[10,1,11,1],[10,2,11,2],[10,3,11,3],[10,4,11,4],[10,5,10,7]]}
[]
[null,"1. Staff Costs"]
[]
[null,null,null,"Total (EUR)","Number of Days"]
[null,"Manager",null,{"$f":"SUM(H:H)","v":0},{"$f":"SUMIF(T:T,\"<>Error\",F:F)","v":444}]
[null,"Teacher/Trainer/Researcher",null,{"$f":"SUM(K:K)","v":0},{"$f":"SUMIF(T:T,\"<>Error\",I:I)","v":2798}]
[null,"Technical Staff",null,{"$f":"SUM(N:N)","v":0},{"$f":"SUMIF(T:T,\"<>Error\",L:L)","v":660}]
[null,"Administrative Staff",null,{"$f":"SUM(Q:Q)","v":0},{"$f":"SUMIF(T:T,\"<>Error\",O:O)","v":348}]
[null,null,null,{"$f":"SUM(D5:D8)","v":0},4250]
[]
[null,"Work\nPackage","Partner \nN°","Name of Partner\n(to encode in overview sheet)","Country\n(to encode in overview sheet)",{"$f":"'Unit Costs & Funding Rule'!D7","v":"Manager"},null,null,{"$f":"'Unit Costs & Funding Rule'!E7","v":"Teacher/Trainer/Researcher"},null,null,{"$f":"'Unit Costs & Funding Rule'!F7","v":"Technical Staff"},null,null,{"$f":"'Unit Costs & Funding Rule'!G7","v":"Administrative Staff"},null,null,"Total Number \nof Days","Total \n(EUR)","Check\nData\nEncoding"]
[null,null,null,null,null,"Number of \ndays","Unit cost \nper day","Total\n(EUR)","Number of \ndays","Unit cost \nper day","Total\n(EUR)","Number of \ndays","Unit cost \nper day","Total\n(EUR)","Number of \ndays","Unit cost \nper day","Total\n(EUR)"]
[null,null,null,{"$f":"IFERROR(IF(VLOOKUP(C13,PartnerN°Ref,2,FALSE)=0,\"\",VLOOKUP(C13,PartnerN°Ref,2,FALSE)),\"\")","v":"#ERROR!"},{"$f":"IFERROR(IF(OR(VLOOKUP(C13,PartnerN°Ref,4,FALSE)=\"Country not found\",VLOOKUP(C13,PartnerN°Ref,3,FALSE)=0),\"\",VLOOKUP(C13,PartnerN°Ref,3,FALSE)),\"\")","v":"#ERROR!"},0.0,{"$f":"IF(T13=\"Error\",0,INDEX(Rates,MATCH(E13,CountryALL,0),MATCH($F$11,Category,0)))","v":"#ERROR!"},{"$f":"IFERROR(IF(T13=\"Error\",0,ROUND(F13*G13,2)),0)","v":0},0.0,{"$f":"IF(T13=\"Error\",0,INDEX(Rates,MATCH(E13,CountryALL,0),MATCH($I$11,Category,0)))","v":"#ERROR!"},{"$f":"IFERROR(IF(T13=\"Error\",0,ROUND(I13*J13,2)),0)","v":0},0.0,{"$f":"IF(T13=\"Error\",0,INDEX(Rates,MATCH(E13,CountryALL,0),MATCH($L$11,Category,0)))","v":"#ERROR!"},{"$f":"IFERROR(IF(T13=\"Error\",0,ROUND(L13*M13,2)),0)","v":0},0.0,{"$f":"IF(T13=\"Error\",0,INDEX(Rates,MATCH(E13,CountryALL,0),MATCH($O$11,Category,0)))","v":"#ERROR!"},{"$f":"IFERROR(IF(T13=\"Error\",0,ROUND(O13*P13,2)),0)","v":0},{"$f":"IF(T13=\"Error\",0,F13+I13+L13+O13)","v":"#ERROR!"},{"$f":"IF(T13=\"Error\",0,H13+K13+N13+Q13)","v":"#ERROR!"},{"$f":"IF(OR(COUNTIF(WorkPackage,B13)=0,COUNTIF(PartnerN°,C13)=0,D13=\"\",COUNTIF(CountryALL,E13)=0,ISNUMBER(F13)=FALSE,ISNUMBER(I13)=FALSE,ISNUMBER(L13)=FALSE,ISNUMBER(O13)=FALSE,IF(ISNUMBER(F13)=TRUE,F13=INT(F13*10)/10=FALSE),IF(ISNUMBER(I13)=TRUE,I13=INT(I13*10)/10=FALSE),IF(ISNUMBER(L13)=TRUE,L13=INT(L13*10)/10=FALSE),IF(ISNUMBER(O13)=TRUE,O13=INT(O13*10)/10=FALSE)),\"Error\",\"\")","v":"#ERROR!"}]
[null,"Preparation","P1",{"$f":"IFERROR(IF(VLOOKUP(C13,PartnerN°Ref,2,FALSE)=0,\"\",VLOOKUP(C13,PartnerN°Ref,2,FALSE)),\"\")","v":"#ERROR!"},{"$f":"IFERROR(IF(OR(VLOOKUP(C13,PartnerN°Ref,4,FALSE)=\"Country not found\",VLOOKUP(C13,PartnerN°Ref,3,FALSE)=0),\"\",VLOOKUP(C13,PartnerN°Ref,3,FALSE)),\"\")","v":"#ERROR!"},2.0,{"$f":"IF(T14=\"Error\",0,INDEX(Rates,MATCH(E14,CountryALL,0),MATCH($F$11,Category,0)))","v":"#ERROR!"},0,13.0,{"$f":"IF(T14=\"Error\",0,INDEX(Rates,MATCH(E14,CountryALL,0),MATCH($I$11,Category,0)))","v":"#ERROR!"},0,0.0,{"$f":"IF(T14=\"Error\",0,INDEX(Rates,MATCH(E14,CountryALL,0),MATCH($L$11,Category,0)))","v":"#ERROR!"},0,0.0,{"$f":"IF(T14=\"Error\",0,INDEX(Rates,MATCH(E14,CountryALL,0),MATCH($O$11,Category,0)))","v":"#ERROR!"},0,"#ERROR!","#ERROR!",{"$f":"IF(OR(COUNTIF(WorkPackage,B13)=0,COUNTIF(PartnerN°,C13)=0,D13=\"\",COUNTIF(CountryALL,E13)=0,ISNUMBER(F13)=FALSE,ISNUMBER(I13)=FALSE,ISNUMBER(L13)=FALSE,ISNUMBER(O13)=FALSE,IF(ISNUMBER(F13)=TRUE,F13=INT(F13*10)/10=FALSE),IF(ISNUMBER(I13)=TRUE,I13=INT(I13*10)/10=FALSE),IF(ISNUMBER(L13)=TRUE,L13=INT(L13*10)/10=FALSE),IF(ISNUMBER(O13)=TRUE,O13=INT(O13*10)/10=FALSE)),\"Error\",\"\")","v":"#ERROR!"}]
[null,"Preparation","P2",{"$f":"IFERROR(IF(VLOOKUP(C15,PartnerN°Ref,2,FALSE)=0,\"\",VLOOKUP(C15,PartnerN°Ref,2,FALSE)),\"\")","v":"#ERROR!"},{"$f":"IFERROR(IF(OR(VLOOKUP(C15,PartnerN°Ref,4,FALSE)=\"Country not found\",VLOOKUP(C15,PartnerN°Ref,3,FALSE)=0),\"\",VLOOKUP(C15,PartnerN°Ref,3,FALSE)),\"\")","v":"#ERROR!"},3.0,{"$f":"IF(T15=\"Error\",0,INDEX(Rates,MATCH(E15,CountryALL,0),MATCH($F$11,Category,0)))","v":"#ERROR!"},0,42.0,{"$f":"IF(T15=\"Error\",0,INDEX(Rates,MATCH(E15,CountryALL,0),MATCH($I$11,Category,0)))","v":"#ERROR!"},0,0.0,{"$f":"IF(T15=\"Error\",0,INDEX(Rates,MATCH(E15,CountryALL,0),MATCH($L$11,Category,0)))","v":"#ERROR!"},0,0.0,{"$f":"IF(T15=\"Error\",0,INDEX(Rates,MATCH(E15,CountryALL,0),MATCH($O$11,Category,0)))","v":"#ERROR!"},0,"#ERROR!","#ERROR!",{"$f":"IF(OR(COUNTIF(WorkPackage,B15)=0,COUNTIF(PartnerN°,C15)=0,D15=\"\",COUNTIF(CountryALL,E15)=0,ISNUMBER(F15)=FALSE,ISNUMBER(I15)=FALSE,ISNUMBER(L15)=FALSE,ISNUMBER(O15)=FALSE,IF(ISNUMBER(F15)=TRUE,F15=INT(F15*10)/10=FALSE),IF(ISNUMBER(I15)=TRUE,I15=INT(I15*10)/10=FALSE),IF(ISNUMBER(L15)=TRUE,L15=INT(L15*10)/10=FALSE),IF(ISNUMBER(O15)=TRUE,O15=INT(O15*10)/10=FALSE)),\"Error\",\"\")","v":"#ERROR!"}]
[null,"Preparation","P3",{"$f":"IFERROR(IF(VLOOKUP(C15,PartnerN°Ref,2,FALSE)=0,\"\",VLOOKUP(C15,PartnerN°Ref,2,FALSE)),\"\")","v":"#ERROR!"},{"$f":"IFERROR(IF(OR(VLOOKUP(C15,PartnerN°Ref,4,FALSE)=\"Country not found\",VLOOKUP(C15,PartnerN°Ref,3,FALSE)=0),\"\",VLOOKUP(C15,PartnerN°Ref,3,FALSE)),\"\")","v":"#ERROR!"},1.0,{"$f":"IF(T16=\"Error\",0,INDEX(Rates,MATCH(E16,CountryALL,0),MATCH($F$11,Category,0)))","v":"#ERROR!"},0,3.0,{"$f":"IF(T16=\"Error\",0,INDEX(Rates,MATCH(E16,CountryALL,0),MATCH($I$11,Category,0)))","v":"#ERROR!"},0,0.0,{"$f":"IF(T16=\"Error\",0,INDEX(Rates,MATCH(E16,CountryALL,0),MATCH($L$11,Category,0)))","v":"#ERROR!"},0,0.0,{"$f":"IF(T16=\"Error\",0,INDEX(Rates,MATCH(E16,CountryALL,0),MATCH($O$11,Category,0)))","v":"#ERROR!"},0,"#ERROR!","#ERROR!",{"$f":"IF(OR(COUNTIF(WorkPackage,B15)=0,COUNTIF(PartnerN°,C15)=0,D15=\"\",COUNTIF(CountryALL,E15)=0,ISNUMBER(F15)=FALSE,ISNUMBER(I15)=FALSE,ISNUMBER(L15)=FALSE,ISNUMBER(O15)=FALSE,IF(ISNUMBER(F15)=TRUE,F15=INT(F15*10)/10=FALSE),IF(ISNUMBER(I15)=TRUE,I15=INT(I15*10)/10=FALSE),IF(ISNUMBER(L15)=TRUE,L15=INT(L15*10)/10=FALSE),IF(ISNUMBER(O15)=TRUE,O15=INT(O15*10)/10=FALSE)),\"Error\",\"\")","v":"#ERROR!"}]
[null,"Preparation","P4",{"$f":"IFERROR(IF(VLOOKUP(C15,PartnerN°Ref,2,FALSE)=0,\"\",VLOOKUP(C15,PartnerN°Ref,2,FALSE)),\"\")","v":"#ERROR!"},{"$f":"IFERROR(IF(OR(VLOOKUP(C15,PartnerN°Ref,4,FALSE)=\"Country not found\",VLOOKUP(C15,PartnerN°Ref,3,FALSE)=0),\"\",VLOOKUP(C15,PartnerN°Ref,3,FALSE)),\"\")","v":"#ERROR!"},1.0,{"$f":"IF(T17=\"Error\",0,INDEX(Rates,MATCH(E17,CountryALL,0),MATCH($F$11,Category,0)))","v":"#ERROR!"},0,17.0,{"$f":"IF(T17=\"Error\",0,INDEX(Rates,MATCH(E17,CountryALL,0),MATCH($I$11,Category,0)))","v":"#ERROR!"},0,0.0,{"$f":"IF(T17=\"Error\",0,INDEX(Rates,MATCH(E17,CountryALL,0),MATCH($L$11,Category,0)))","v":"#ERROR!"},0,0.0,{"$f":"IF(T17=\"Error\",0,INDEX(Rates,MATCH(E17,CountryALL,0),MATCH($O$11,Category,0)))","v":"#ERROR!"},0,"#ERROR!","#ERROR!",{"$f":"IF(OR(COUNTIF(WorkPackage,B15)=0,COUNTIF(PartnerN°,C15)=0,D15=\"\",COUNTIF(CountryALL,E15)=0,ISNUMBER(F15)=FALSE,ISNUMBER(I15)=FALSE,ISNUMBER(L15)=FALSE,ISNUMBER(O15)=FALSE,IF(ISNUMBER(F15)=TRUE,F15=INT(F15*10)/10=FALSE),IF(ISNUMBER(I15)=TRUE,I15=INT(I15*10)/10=FALSE),IF(ISNUMBER(L15)=TRUE,L15=INT(L15*10)/10=FALSE),IF(ISNUMBER(O15)=TRUE,O15=INT(O15*10)/10=FALSE)),\"Error\",\"\")","v":"#ERROR!"}]
[null,"Preparation","P5",{"$f":"IFERROR(IF(VLOOKUP(C15,PartnerN°Ref,2,FALSE)=0,\"\",VLOOKUP(C15,PartnerN°Ref,2,FALSE)),\"\")","v":"#ERROR!"},{"$f":"IFERROR(IF(OR(VLOOKUP(C15,PartnerN°Ref,4,FALSE)=\"Country not found\",VLOOKUP(C15,PartnerN°Ref,3,FALSE)=0),\"\",VLOOKUP(C15,PartnerN°Ref,3,FALSE)),\"\")","v":"#ERROR!"},1.0,{"$f":"IF(T18=\"Error\",0,INDEX(Rates,MATCH(E18,CountryALL,0),MATCH($F$11,Category,0)))","v":"#ERROR!"},0,26.0,{"$f":"IF(T18=\"Error\",0,INDEX(Rates,MATCH(E18,CountryALL,0),MATCH($I$11,Category,0)))","v":"#ERROR!"},0,5.0,{"$f":"IF(T18=\"Error\",0,INDEX(Rates,MATCH(E18,CountryALL,0),MATCH($L$11,Category,0)))","v":"#ERROR!"},0,0.0,{"$f":"IF(T18=\"Error\",0,INDEX(Rates,MATCH(E18,CountryALL,0),MATCH($O$11,Category,0)))","v":"#ERROR!"},0,"#ERROR!","#ERROR!",{"$f":"IF(OR(COUNTIF(WorkPackage,B15)=0,COUNTIF(PartnerN°,C15)=0,D15=\"\",COUNTIF(CountryALL,E15)=0,ISNUMBER(F15)=FALSE,ISNUMBER(I15)=FALSE,ISNUMBER(L15)=FALSE,ISNUMBER(O15)=FALSE,IF(ISNUMBER(F15)=TRUE,F15=INT(F15*10)/10=FALSE),IF(ISNUMBER(I15)=TRUE,I15=INT(I15*10)/10=FALSE),IF(ISNUMBER(L15)=TRUE,L15=INT(L15*10)/10=FALSE),IF(ISNUMBER(O15)=TRUE,O15=INT(O15*10)/10=FALSE)),\"Error\",\"\")","v":"#ERROR!"}]
[null,"Preparation","P6",{"$f":"IFERROR(IF(VLOOKUP(C15,PartnerN°Ref,2,FALSE)=0,\"\",VLOOKUP(C15,PartnerN°Ref,2,FALSE)),\"\")","v":"#ERROR!"},{"$f":"IFERROR(IF(OR(VLOOKUP(C15,PartnerN°Ref,4,FALSE)=\"Country not found\",VLOOKUP(C15,PartnerN°Ref,3,FALSE)=0),\"\",VLOOKUP(C15,PartnerN°Ref,3,FALSE)),\"\")","v":"#ERROR!"},1.0,{"$f":"IF(T19=\"Error\",0,INDEX(Rates,MATCH(E19,CountryALL,0),MATCH($F$11,Category,0)))","v":"#ERROR!"},0,26.0,{"$f":"IF(T19=\"Error\",0,INDEX(Rates,MATCH(E19,CountryALL,0),MATCH($I$11,Category,0)))","v":"#ERROR!"},0,5.0,{"$f":"IF(T19=\"Error\",0,INDEX(Rates,MATCH(E19,CountryALL,0),MATCH($L$11,Category,0)))","v":"#ERROR!"},0,0.0,{"$f":"IF(T19=\"Error\",0,INDEX(Rates,MATCH(E19,CountryALL,0),MATCH($O$11,Category,0)))","v":"#ERROR!"},0,"#ERROR!","#ERROR!",{"$f":"IF(OR(COUNTIF(WorkPackage,B15)=0,COUNTIF(PartnerN°,C15)=0,D15=\"\",COUNTIF(CountryALL,E15)=0,ISNUMBER(F15)=FALSE,ISNUMBER(I15)=FALSE,ISNUMBER(L15)=FALSE,ISNUMBER(O15)=FALSE,IF(ISNUMBER(F15)=TRUE,F15=INT(F15*10)/10=FALSE),IF(ISNUMBER(I15)=TRUE,I15=INT(I15*10)/10=FALSE),IF(ISNUMBER(L15)=TRUE,L15=INT(L15*10)/10=FALSE),IF(ISNUMBER(O15)=TRUE,O15=INT(O15*10)/10=FALSE)),\"Error\",\"\")","v":"#ERROR!"}]
[null,"Preparation","P7",{"$f":"IFERROR(IF(VLOOKUP(C15,PartnerN°Ref,2,FALSE)=0,\"\",VLOOKUP(C15,PartnerN°Ref,2,FALSE)),\"\")","v":"#ERROR!"},{"$f":"IFERROR(IF(OR(VLOOKUP(C15,PartnerN°Ref,4,FALSE)=\"Country not found\",VLOOKUP(C15,PartnerN°Ref,3,FALSE)=0),\"\",VLOOKUP(C15,PartnerN°Ref,3,FALSE)),\"\")","v":"#ERROR!"},1.0,{"$f":"IF(T20=\"Error\",0,INDEX(Rates,MATCH(E20,CountryALL,0),MATCH($F$11,Category,0)))","v":"#ERROR!"},0,26.0,{"$f":"IF(T20=\"Error\",0,INDEX(Rates,MATCH(E20,CountryALL,0),MATCH($I$11,Category,0)))","v":"#ERROR!"},0,5.0,{"$f":"IF(T20=\"Error\",0,INDEX(Rates,MATCH(E20,CountryALL,0),MATCH($L$11,Category,0)))","v":"#ERROR!"},0,0.0,{"$f":"IF(T20=\"Error\",0,INDEX(Rates,MATCH(E20,CountryALL,0),MATCH($O$11,Category,0)))","v":"#ERROR!"},0,"#ERROR!","#ERROR!",{"$f":"IF(OR(COUNTIF(WorkPackage,B15)=0,COUNTIF(PartnerN°,C15)=0,D15=\"\",COUNTIF(CountryALL,E15)=0,ISNUMBER(F15)=FALSE,ISNUMBER(I15)=FALSE,ISNUMBER(L15)=FALSE,ISNUMBER(O15)=FALSE,IF(ISNUMBER(F15)=TRUE,F15=INT(F15*10)/10=FALSE),IF(ISNUMBER(I15)=TRUE,I15=INT(I15*10)/10=FALSE),IF(ISNUMBER(L15)=TRUE,L15=INT(L15*10)/10=FALSE),IF(ISNUMBER(O15)=TRUE,O15=INT(O15*10)/10=FALSE)),\"Error\",\"\")","v":"#ERROR!"}]
[null,"Preparation","P8",{"$f":"IFERROR(IF(VLOOKUP(C15,PartnerN°Ref,2,FALSE)=0,\"\",VLOOKUP(C15,PartnerN°Ref,2,FALSE)),\"\")","v":"#ERROR!"},{"$f":"IFERROR(IF(OR(VLOOKUP(C15,PartnerN°Ref,4,FALSE)=\"Country not found\",VLOOKUP(C15,PartnerN°Ref,3,FALSE)=0),\"\",VLOOKUP(C15,PartnerN°Ref,3,FALSE)),\"\")","v":"#ERROR!"},1.0,{"$f":"IF(T21=\"Error\",0,INDEX(Rates,MATCH(E21,CountryALL,0),MATCH($F$11,Category,0)))","v":"#ERROR!"},0,26.0,{"$f":"IF(T21=\"Error\",0,INDEX(Rates,MATCH(E21,CountryALL,0),MATCH($I$11,Category,0)))","v":"#ERROR!"},0,5.0,{"$f":"IF(T21=\"Error\",0,INDEX(Rates,MATCH(E21,CountryALL,0),MATCH($L$11,Category,0)))","v":"#ERROR!"},0,0.0,{"$f":"IF(T21=\"Error\",0,INDEX(Rates,MATCH(E21,CountryALL,0),MATCH($O$11,Category,0)))","v":"#ERROR!"},0,"#ERROR!","#ERROR!",{"$f":"IF(OR(COUNTIF(WorkPackage,B15)=0,COUNTIF(PartnerN°,C15)=0,D15=\"\",COUNTIF(CountryALL,E15)=0,ISNUMBER(F15)=FALSE,ISNUMBER(I15)=FALSE,ISNUMBER(L15)=FALSE,ISNUMBER(O15)=FALSE,IF(ISNUMBER(F15)=TRUE,F15=INT(F15*10)/10=FALSE),IF(ISNUMBER(I15)=TRUE,I15=INT(I15*10)/10=FALSE),IF(ISNUMBER(L15)=TRUE,L15=INT(L15*10)/10=FALSE),IF(ISNUMBER(O15)=TRUE,O15=INT(O15*10)/10=FALSE)),\"Error\",\"\")","v":"#ERROR!"}]
[null,"Preparation","P9",{"$f":"IFERROR(IF(VLOOKUP(C15,PartnerN°Ref,2,FALSE)=0,\"\",VLOOKUP(C15,PartnerN°Ref,2,FALSE)),\"\")","v":"#ERROR!"},{"$f":"IFERROR(IF(OR(VLOOKUP(C15,PartnerN°Ref,4,FALSE)=\"Country not found\",VLOOKUP(C15,PartnerN°Ref,3,FALSE)=0),\"\",VLOOKUP(C15,PartnerN°Ref,3,FALSE)),\"\")","v":"#ERROR!"},1.0,{"$f":"IF(T22=\"Error\",0,INDEX(Rates,MATCH(E22,CountryALL,0),MATCH($F$11,Category,0)))","v":"#ERROR!"},0,26.0,{"$f":"IF(T22=\"Error\",0,INDEX(Rates,MATCH(E22,CountryALL,0),MATCH($I$11,Category,0)))","v":"#ERROR!"},0,5.0,{"$f":"IF(T22=\"Error\",0,INDEX(Rates,MATCH(E22,CountryALL,0),MATCH($L$11,Category,0)))","v":"#ERROR!"},0,0.0,{"$f":"IF(T22=\"Error\",0,INDEX(Rates,MATCH(E22,CountryALL,0),MATCH($O$11,Category,0)))","v":"#ERROR!"},0,"#ERROR!","#ERROR!",{"$f":"IF(OR(COUNTIF(WorkPackage,B15)=0,COUNTIF(PartnerN°,C15)=0,D15=\"\",COUNTIF(CountryALL,E15)=0,ISNUMBER(F15)=FALSE,ISNUMBER(I15)=FALSE,ISNUMBER(L15)=FALSE,ISNUMBER(O15)=FALSE,IF(ISNUMBER(F15)=TRUE,F15=INT(F15*10)/10=FALSE),IF(ISNUMBER(I15)=TRUE,I15=INT(I15*10)/10=FALSE),IF(ISNUMBER(L15)=TRUE,L15=INT(L15*10)/10=FALSE),IF(ISNUMBER(O15)=TRUE,O15=INT(O15*10)/10=FALSE)),\"Error\",\"\")","v":"#ERROR!"}]
[null,"Preparation","P10",{"$f":"IFERROR(IF(VLOOKUP(C15,PartnerN°Ref,2,FALSE)=0,\"\",VLOOKUP(C15,PartnerN°Ref,2,FALSE)),\"\")","v":"#ERROR!"},{"$f":"IFERROR(IF(OR(VLOOKUP(C15,PartnerN°Ref,4,FALSE)=\"Country not found\",VLOOKUP(C15,PartnerN°Ref,3,FALSE)=0),\"\",VLOOKUP(C15,PartnerN°Ref,3,FALSE)),\"\")","v":"#ERROR!"},1.0,{"$f":"IF(T23=\"Error\",0,INDEX(Rates,MATCH(E23,CountryALL,0),MATCH($F$11,Category,0)))","v":"#ERROR!"},0,26.0,{"$f":"IF(T23=\"Error\",0,INDEX(Rates,MATCH(E23,CountryALL,0),MATCH($I$11,Category,0)))","v":"#ERROR!"},0,5.0,{"$f":"IF(T23=\"Error\",0,INDEX(Rates,MATCH(E23,CountryALL,0),MATCH($L$11,Category,0)))","v":"#ERROR!"},0,0.0,{"$f":"IF(T23=\"Error\",0,INDEX(Rates,MATCH(E23,CountryALL,0),MATCH($O$11,Category,0)))","v":"#ERROR!"},0,"#ERROR!","#ERROR!",{"$f":"IF(OR(COUNTIF(WorkPackage,B15)=0,COUNTIF(PartnerN°,C15)=0,D15=\"\",COUNTIF(CountryALL,E15)=0,ISNUMBER(F15)=FALSE,ISNUMBER(I15)=FALSE,ISNUMBER(L15)=FALSE,ISNUMBER(O15)=FALSE,IF(ISNUMBER(F15)=TRUE,F15=INT(F15*10)/10=FALSE),IF(ISNUMBER(I15)=TRUE,I15=INT(I15*10)/10=FALSE),IF(ISNUMBER(L15)=TRUE,L15=INT(L15*10)/10=FALSE),IF(ISNUMBER(O15)=TRUE,O15=INT(O15*10)/10=FALSE)),\"Error\",\"\")","v":"#ERROR!"}]
[null,"Preparation","P11",{"$f":"IFERROR(IF(VLOOKUP(C15,PartnerN°Ref,2,FALSE)=0,\"\",VLOOKUP(C15,PartnerN°Ref,2,FALSE)),\"\")","v":"#ERROR!"},{"$f":"IFERROR(IF(OR(VLOOKUP(C15,PartnerN°Ref,4,FALSE)=\"Country not found\",VLOOKUP(C15,PartnerN°Ref,3,FALSE)=0),\"\",VLOOKUP(C15,PartnerN°Ref,3,FALSE)),\"\")","v":"#ERROR!"},12.0,{"$f":"IF(T24=\"Error\",0,INDEX(Rates,MATCH(E24,CountryALL,0),MATCH($F$11,Category,0)))","v":"#ERROR!"},0,67.0,{"$f":"IF(T24=\"Error\",0,INDEX(Rates,MATCH(E24,CountryALL,0),MATCH($I$11,Category,0)))","v":"#ERROR!"},0,10.0,{"$f":"IF(T24=\"Error\",0,INDEX(Rates,MATCH(E24,CountryALL,0),MATCH($L$11,Category,0)))","v":"#ERROR!"},0,0.0,{"$f":"IF(T24=\"Error\",0,INDEX(Rates,MATCH(E24,CountryALL,0),MATCH($O$11,Category,0)))","v":"#ERROR!"},0,"#ERROR!","#ERROR!",{"$f":"IF(OR(COUNTIF(WorkPackage,B15)=0,COUNTIF(PartnerN°,C15)=0,D15=\"\",COUNTIF(CountryALL,E15)=0,ISNUMBER(F15)=FALSE,ISNUMBER(I15)=FALSE,ISNUMBER(L15)=FALSE,ISNUMBER(O15)=FALSE,IF(ISNUMBER(F15)=TRUE,F15=INT(F15*10)/10=FALSE),IF(ISNUMBER(I15)=TRUE,I15=INT(I15*10)/10=FALSE),IF(ISNUMBER(L15)=TRUE,L15=INT(L15*10)/10=FALSE),IF(ISNUMBER(O15)=TRUE,O15=INT(O15*10)/10=FALSE)),\"Error\",\"\")","v":"#ERROR!"}]
[null,"Preparation","P12",{"$f":"IFERROR(IF(VLOOKUP(C15,PartnerN°Ref,2,FALSE)=0,\"\",VLOOKUP(C15,PartnerN°Ref,2,FALSE)),\"\")","v":"#ERROR!"},{"$f":"IFERROR(IF(OR(VLOOKUP(C15,PartnerN°Ref,4,FALSE)=\"Country not found\",VLOOKUP(C15,PartnerN°Ref,3,FALSE)=0),\"\",VLOOKUP(C15,PartnerN°Ref,3,FALSE)),\"\")","v":"#ERROR!"},7.0,{"$f":"IF(T25=\"Error\",0,INDEX(Rates,MATCH(E25,CountryALL,0),MATCH($F$11,Category,0)))","v":"#ERROR!"},0,25.0,{"$f":"IF(T25=\"Error\",0,INDEX(Rates,MATCH(E25,CountryALL,0),MATCH($I$11,Category,0)))","v":"#ERROR!"},0,0.0,{"$f":"IF(T25=\"Error\",0,INDEX(Rates,MATCH(E25,CountryALL,0),MATCH($L$11,Category,0)))","v":"#ERROR!"},0,0.0,{"$f":"IF(T25=\"Error\",0,INDEX(Rates,MATCH(E25,CountryALL,0),MATCH($O$11,Category,0)))","v":"#ERROR!"},0,"#ERROR!","#ERROR!",{"$f":"IF(OR(COUNTIF(WorkPackage,B15)=0,COUNTIF(PartnerN°,C15)=0,D15=\"\",COUNTIF(CountryALL,E15)=0,ISNUMBER(F15)=FALSE,ISNUMBER(I15)=FALSE,ISNUMBER(L15)=FALSE,ISNUMBER(O15)=FALSE,IF(ISNUMBER(F15)=TRUE,F15=INT(F15*10)/10=FALSE),IF(ISNUMBER(I15)=TRUE,I15=INT(I15*10)/10=FALSE),IF(ISNUMBER(L15)=TRUE,L15=INT(L15*10)/10=FALSE),IF(ISNUMBER(O15)=TRUE,O15=INT(O15*10)/10=FALSE)),\"Error\",\"\")","v":"#ERROR!"}]
[null,"Development","P1",{"$f":"IFERROR(IF(VLOOKUP(C15,PartnerN°Ref,2,FALSE)=0,\"\",VLOOKUP(C15,PartnerN°Ref,2,FALSE)),\"\")","v":"#ERROR!"},{"$f":"IFERROR(IF(OR(VLOOKUP(C15,PartnerN°Ref,4,FALSE)=\"Country not found\",VLOOKUP(C15,PartnerN°Ref,3,FALSE)=0),\"\",VLOOKUP(C15,PartnerN°Ref,3,FALSE)),\"\")","v":"#ERROR!"},4.0,{"$f":"IF(T26=\"Error\",0,INDEX(Rates,MATCH(E26,CountryALL,0),MATCH($F$11,Category,0)))","v":"#ERROR!"},0,62.0,{"$f":"IF(T26=\"Error\",0,INDEX(Rates,MATCH(E26,CountryALL,0),MATCH($I$11,Category,0)))","v":"#ERROR!"},0,25.0,{"$f":"IF(T26=\"Error\",0,INDEX(Rates,MATCH(E26,CountryALL,0),MATCH($L$11,Category,0)))","v":"#ERROR!"},0,0.0,{"$f":"IF(T26=\"Error\",0,INDEX(Rates,MATCH(E26,CountryALL,0),MATCH($O$11,Category,0)))","v":"#ERROR!"},0,"#ERROR!","#ERROR!",{"$f":"IF(OR(COUNTIF(WorkPackage,B15)=0,COUNTIF(PartnerN°,C15)=0,D15=\"\",COUNTIF(CountryALL,E15)=0,ISNUMBER(F15)=FALSE,ISNUMBER(I15)=FALSE,ISNUMBER(L15)=FALSE,ISNUMBER(O15)=FALSE,IF(ISNUMBER(F15)=TRUE,F15=INT(F15*10)/10=FALSE),IF(ISNUMBER(I15)=TRUE,I15=INT(I15*10)/10=FALSE),IF(ISNUMBER(L15)=TRUE,L15=INT(L15*10)/10=FALSE),IF(ISNUMBER(O15)=TRUE,O15=INT(O15*10)/10=FALSE)),\"Error\",\"\")","v":"#ERROR!"}]
[null,"Development","P2",{"$f":"IFERROR(IF(VLOOKUP(C15,PartnerN°Ref,2,FALSE)=0,\"\",VLOOKUP(C15,PartnerN°Ref,2,FALSE)),\"\")","v":"#ERROR!"},{"$f":"IFERROR(IF(OR(VLOOKUP(C15,PartnerN°Ref,4,FALSE)=\"Country not found\",VLOOKUP(C15,PartnerN°Ref,3,FALSE)=0),\"\",VLOOKUP(C15,PartnerN°Ref,3,FALSE)),\"\")","v":"#ERROR!"},13.0,{"$f":"IF(T27=\"Error\",0,INDEX(Rates,MATCH(E27,CountryALL,0),MATCH($F$11,Category,0)))","v":"#ERROR!"},0,69.0,{"$f":"IF(T27=\"Error\",0,INDEX(Rates,MATCH(E27,CountryALL,0),MATCH($I$11,Category,0)))","v":"#ERROR!"},0,16.0,{"$f":"IF(T27=\"Error\",0,INDEX(Rates,MATCH(E27,CountryALL,0),MATCH($L$11,Category,0)))","v":"#ERROR!"},0,0.0,{"$f":"IF(T27=\"Error\",0,INDEX(Rates,MATCH(E27,CountryALL,0),MATCH($O$11,Category,0)))","v":"#ERROR!"},0,"#ERROR!","#ERROR!",{"$f":"IF(OR(COUNTIF(WorkPackage,B15)=0,COUNTIF(PartnerN°,C15)=0,D15=\"\",COUNTIF(CountryALL,E15)=0,ISNUMBER(F15)=FALSE,ISNUMBER(I15)=FALSE,ISNUMBER(L15)=FALSE,ISNUMBER(O15)=FALSE,IF(ISNUMBER(F15)=TRUE,F15=INT(F15*10)/10=FALSE),IF(ISNUMBER(I15)=TRUE,I15=INT(I15*10)/10=FALSE),IF(ISNUMBER(L15)=TRUE,L15=INT(L15*10)/10=FALSE),IF(ISNUMBER(O15)=TRUE,O15=INT(O15*10)/10=FALSE)),\"Error\",\"\")","v":"#ERROR!"}]
[null,"Development","P3",{"$f":"IFERROR(IF(VLOOKUP(C15,PartnerN°Ref,2,FALSE)=0,\"\",VLOOKUP(C15,PartnerN°Ref,2,FALSE)),\"\")","v":"#ERROR!"},{"$f":"IFERROR(IF(OR(VLOOKUP(C15,PartnerN°Ref,4,FALSE)=\"Country not found\",VLOOKUP(C15,PartnerN°Ref,3,FALSE)=0),\"\",VLOOKUP(C15,PartnerN°Ref,3,FALSE)),\"\")","v":"#ERROR!"},3.0,{"$f":"IF(T28=\"Error\",0,INDEX(Rates,MATCH(E28,CountryALL,0),MATCH($F$11,Category,0)))","v":"#ERROR!"},0,34.0,{"$f":"IF(T28=\"Error\",0,INDEX(Rates,MATCH(E28,CountryALL,0),MATCH($I$11,Category,0)))","v":"#ERROR!"},0,10.0,{"$f":"IF(T28=\"Error\",0,INDEX(Rates,MATCH(E28,CountryALL,0),MATCH($L$11,Category,0)))","v":"#ERROR!"},0,0.0,{"$f":"IF(T28=\"Error\",0,INDEX(Rates,MATCH(E28,CountryALL,0),MATCH($O$11,Category,0)))","v":"#ERROR!"},0,"#ERROR!","#ERROR!",{"$f":"IF(OR(COUNTIF(WorkPackage,B15)=0,COUNTIF(PartnerN°,C15)=0,D15=\"\",COUNTIF(CountryALL,E15)=0,ISNUMBER(F15)=FALSE,ISNUMBER(I15)=FALSE,ISNUMBER(L15)=FALSE,ISNUMBER(O15)=FALSE,IF(ISNUMBER(F15)=TRUE,F15=INT(F15*10)/10=FALSE),IF(ISNUMBER(I15)=TRUE,I15=INT(I15*10)/10=FALSE),IF(ISNUMBER(L15)=TRUE,L15=INT(L15*10)/10=FALSE),IF(ISNUMBER(O15)=TRUE,O15=INT(O15*10)/10=FALSE)),\"Error\",\"\")","v":"#ERROR!"}]
[null,"Development","P4",{"$f":"IFERROR(IF(VLOOKUP(C15,PartnerN°Ref,2,FALSE)=0,\"\",VLOOKUP(C15,PartnerN°Ref,2,FALSE)),\"\")","v":"#ERROR!"},{"$f":"IFERROR(IF(OR(VLOOKUP(C15,PartnerN°Ref,4,FALSE)=\"Country not found\",VLOOKUP(C15,PartnerN°Ref,3,FALSE)=0),\"\",VLOOKUP(C15,PartnerN°Ref,3,FALSE)),\"\")","v":"#ERROR!"},28.0,{"$f":"IF(T29=\"Error\",0,INDEX(Rates,MATCH(E29,CountryALL,0),MATCH($F$11,Category,0)))","v":"#ERROR!"},0,144.0,{"$f":"IF(T29=\"Error\",0,INDEX(Rates,MATCH(E29,CountryALL,0),MATCH($I$11,Category,0)))","v":"#ERROR!"},0,61.0,{"$f":"IF(T29=\"Error\",0,INDEX(Rates,MATCH(E29,CountryALL,0),MATCH($L$11,Category,0)))","v":"#ERROR!"},0,0.0,{"$f":"IF(T29=\"Error\",0,INDEX(Rates,MATCH(E29,CountryALL,0),MATCH($O$11,Category,0)))","v":"#ERROR!"},0,"#ERROR!","#ERROR!",{"$f":"IF(OR(COUNTIF(WorkPackage,B15)=0,COUNTIF(PartnerN°,C15)=0,D15=\"\",COUNTIF(CountryALL,E15)=0,ISNUMBER(F15)=FALSE,ISNUMBER(I15)=FALSE,ISNUMBER(L15)=FALSE,ISNUMBER(O15)=FALSE,IF(ISNUMBER(F15)=TRUE,F15=INT(F15*10)/10=FALSE),IF(ISNUMBER(I15)=TRUE,I15=INT(I15*10)/10=FALSE),IF(ISNUMBER(L15)=TRUE,L15=INT(L15*10)/10=FALSE),IF(ISNUMBER(O15)=TRUE,O15=INT(O15*10)/10=FALSE)),\"Error\",\"\")","v":"#ERROR!"}]
[null,"Development","P5",{"$f":"IFERROR(IF(VLOOKUP(C15,PartnerN°Ref,2,FALSE)=0,\"\",VLOOKUP(C15,PartnerN°Ref,2,FALSE)),\"\")","v":"#ERROR!"},{"$f":"IFERROR(IF(OR(VLOOKUP(C15,PartnerN°Ref,4,FALSE)=\"Country not found\",VLOOKUP(C15,PartnerN°Ref,3,FALSE)=0),\"\",VLOOKUP(C15,PartnerN°Ref,3,FALSE)),\"\")","v":"#ERROR!"},15.0,{"$f":"IF(T30=\"Error\",0,INDEX(Rates,MATCH(E30,CountryALL,0),MATCH($F$11,Category,0)))","v":"#ERROR!"},0,119.0,{"$f":"IF(T30=\"Error\",0,INDEX(Rates,MATCH(E30,CountryALL,0),MATCH($I$11,Category,0)))","v":"#ERROR!"},0,63.0,{"$f":"IF(T30=\"Error\",0,INDEX(Rates,MATCH(E30,CountryALL,0),MATCH($L$11,Category,0)))","v":"#ERROR!"},0,0.0,{"$f":"IF(T30=\"Error\",0,INDEX(Rates,MATCH(E30,CountryALL,0),MATCH($O$11,Category,0)))","v":"#ERROR!"},0,"#ERROR!","#ERROR!",{"$f":"IF(OR(COUNTIF(WorkPackage,B15)=0,COUNTIF(PartnerN°,C15)=0,D15=\"\",COUNTIF(CountryALL,E15)=0,ISNUMBER(F15)=FALSE,ISNUMBER(I15)=FALSE,ISNUMBER(L15)=FALSE,ISNUMBER(O15)=FALSE,IF(ISNUMBER(F15)=TRUE,F15=INT(F15*10)/10=FALSE),IF(ISNUMBER(I15)=TRUE,I15=INT(I15*10)/10=FALSE),IF(ISNUMBER(L15)=TRUE,L15=INT(L15*10)/10=FALSE),IF(ISNUMBER(O15)=TRUE,O15=INT(O15*10)/10=FALSE)),\"Error\",\"\")","v":"#ERROR!"}]
[null,"Development","P6",{"$f":"IFERROR(IF(VLOOKUP(C15,PartnerN°Ref,2,FALSE)=0,\"\",VLOOKUP(C15,PartnerN°Ref,2,FALSE)),\"\")","v":"#ERROR!"},{"$f":"IFERROR(IF(OR(VLOOKUP(C15,PartnerN°Ref,4,FALSE)=\"Country not found\",VLOOKUP(C15,PartnerN°Ref,3,FALSE)=0),\"\",VLOOKUP(C15,PartnerN°Ref,3,FALSE)),\"\")","v":"#ERROR!"},17.0,{"$f":"IF(T31=\"Error\",0,INDEX(Rates,MATCH(E31,CountryALL,0),MATCH($F$11,Category,0)))","v":"#ERROR!"},0,130.0,{"$f":"IF(T31=\"Error\",0,INDEX(Rates,MATCH(E31,CountryALL,0),MATCH($I$11,Category,0)))","v":"#ERROR!"},0,63.0,{"$f":"IF(T31=\"Error\",0,INDEX(Rates,MATCH(E31,CountryALL,0),MATCH($L$11,Category,0)))","v":"#ERROR!"},0,0.0,{"$f":"IF(T31=\"Error\",0,INDEX(Rates,MATCH(E31,CountryALL,0),MATCH($O$11,Category,0)))","v":"#ERROR!"},0,"#ERROR!","#ERROR!",{"$f":"IF(OR(COUNTIF(WorkPackage,B15)=0,COUNTIF(PartnerN°,C15)=0,D15=\"\",COUNTIF(CountryALL,E15)=0,ISNUMBER(F15)=FALSE,ISNUMBER(I15)=FALSE,ISNUMBER(L15)=FALSE,ISNUMBER(O15)=FALSE,IF(ISNUMBER(F15)=TRUE,F15=INT(F15*10)/10=FALSE),IF(ISNUMBER(I15)=TRUE,I15=INT(I15*10)/10=FALSE),IF(ISNUMBER(L15)=TRUE,L15=INT(L15*10)/10=FALSE),IF(ISNUMBER(O15)=TRUE,O15=INT(O15*10)/10=FALSE)),\"Error\",\"\")","v":"#ERROR!"}]
[null,"Development","P7",{"$f":"IFERROR(IF(VLOOKUP(C15,PartnerN°Ref,2,FALSE)=0,\"\",VLOOKUP(C15,PartnerN°Ref,2,FALSE)),\"\")","v":"#ERROR!"},{"$f":"IFERROR(IF(OR(VLOOKUP(C15,PartnerN°Ref,4,FALSE)=\"Country not found\",VLOOKUP(C15,PartnerN°Ref,3,FALSE)=0),\"\",VLOOKUP(C15,PartnerN°Ref,3,FALSE)),\"\")","v":"#ERROR!"},15.0,{"$f":"IF(T32=\"Error\",0,INDEX(Rates,MATCH(E32,CountryALL,0),MATCH($F$11,Category,0)))","v":"#ERROR!"},0,119.0,{"$f":"IF(T32=\"Error\",0,INDEX(Rates,MATCH(E32,CountryALL,0),MATCH($I$11,Category,0)))","v":"#ERROR!"},0,63.0,{"$f":"IF(T32=\"Error\",0,INDEX(Rates,MATCH(E32,CountryALL,0),MATCH($L$11,Category,0)))","v":"#ERROR!"},0,0.0,{"$f":"IF(T32=\"Error\",0,INDEX(Rates,MATCH(E32,CountryALL,0),MATCH($O$11,Category,0)))","v":"#ERROR!"},0,"#ERROR!","#ERROR!",{"$f":"IF(OR(COUNTIF(WorkPackage,B15)=0,COUNTIF(PartnerN°,C15)=0,D15=\"\",COUNTIF(CountryALL,E15)=0,ISNUMBER(F15)=FALSE,ISNUMBER(I15)=FALSE,ISNUMBER(L15)=FALSE,ISNUMBER(O15)=FALSE,IF(ISNUMBER(F15)=TRUE,F15=INT(F15*10)/10=FALSE),IF(ISNUMBER(I15)=TRUE,I15=INT(I15*10)/10=FALSE),IF(ISNUMBER(L15)=TRUE,L15=INT(L15*10)/10=FALSE),IF(ISNUMBER(O15)=TRUE,O15=INT(O15*10)/10=FALSE)),\"Error\",\"\")","v":"#ERROR!"}]
[null,"Development","P8",{"$f":"IFERROR(IF(VLOOKUP(C15,PartnerN°Ref,2,FALSE)=0,\"\",VLOOKUP(C15,PartnerN°Ref,2,FALSE)),\"\")","v":"#ERROR!"},{"$f":"IFERROR(IF(OR(VLOOKUP(C15,PartnerN°Ref,4,FALSE)=\"Country not found\",VLOOKUP(C15,PartnerN°Ref,3,FALSE)=0),\"\",VLOOKUP(C15,PartnerN°Ref,3,FALSE)),\"\")","v":"#ERROR!"},15.0,{"$f":"IF(T33=\"Error\",0,INDEX(Rates,MATCH(E33,CountryALL,0),MATCH($F$11,Category,0)))","v":"#ERROR!"},0,119.0,{"$f":"IF(T33=\"Error\",0,INDEX(Rates,MATCH(E33,CountryALL,0),MATCH($I$11,Category,0)))","v":"#ERROR!"},0,63.0,{"$f":"IF(T33=\"Error\",0,INDEX(Rates,MATCH(E33,CountryALL,0),MATCH($L$11,Category,0)))","v":"#ERROR!"},0,0.0,{"$f":"IF(T33=\"Error\",0,INDEX(Rates,MATCH(E33,CountryALL,0),MATCH($O$11,Category,0)))","v":"#ERROR!"},0,"#ERROR!","#ERROR!",{"$f":"IF(OR(COUNTIF(WorkPackage,B15)=0,COUNTIF(PartnerN°,C15)=0,D15=\"\",COUNTIF(CountryALL,E15)=0,ISNUMBER(F15)=FALSE,ISNUMBER(I15)=FALSE,ISNUMBER(L15)=FALSE,ISNUMBER(O15)=FALSE,IF(ISNUMBER(F15)=TRUE,F15=INT(F15*10)/10=FALSE),IF(ISNUMBER(I15)=TRUE,I15=INT(I15*10)/10=FALSE),IF(ISNUMBER(L15)=TRUE,L15=INT(L15*10)/10=FALSE),IF(ISNUMBER(O15)=TRUE,O15=INT(O15*10)/10=FALSE)),\"Error\",\"\")","v":"#ERROR!"}]
[null,"Development","P9",{"$f":"IFERROR(IF(VLOOKUP(C15,PartnerN°Ref,2,FALSE)=0,\"\",VLOOKUP(C15,PartnerN°Ref,2,FALSE)),\"\")","v":"#ERROR!"},{"$f":"IFERROR(IF(OR(VLOOKUP(C15,PartnerN°Ref,4,FALSE)=\"Country not found\",VLOOKUP(C15,PartnerN°Ref,3,FALSE)=0),\"\",VLOOKUP(C15,PartnerN°Ref,3,FALSE)),\"\")","v":"#ERROR!"},18.0,{"$f":"IF(T34=\"Error\",0,INDEX(Rates,MATCH(E34,CountryALL,0),MATCH($F$11,Category,0)))","v":"#ERROR!"},0,129.0,{"$f":"IF(T34=\"Error\",0,INDEX(Rates,MATCH(E34,CountryALL,0),MATCH($I$11,Category,0)))","v":"#ERROR!"},0,68.0,{"$f":"IF(T34=\"Error\",0,INDEX(Rates,MATCH(E34,CountryALL,0),MATCH($L$11,Category,0)))","v":"#ERROR!"},0,0.0,{"$f":"IF(T34=\"Error\",0,INDEX(Rates,MATCH(E34,CountryALL,0),MATCH($O$11,Category,0)))","v":"#ERROR!"},0,"#ERROR!","#ERROR!",{"$f":"IF(OR(COUNTIF(WorkPackage,B15)=0,COUNTIF(PartnerN°,C15)=0,D15=\"\",COUNTIF(CountryALL,E15)=0,ISNUMBER(F15)=FALSE,ISNUMBER(I15)=FALSE,ISNUMBER(L15)=FALSE,ISNUMBER(O15)=FALSE,IF(ISNUMBER(F15)=TRUE,F15=INT(F15*10)/10=FALSE),IF(ISNUMBER(I15)=TRUE,I15=INT(I15*10)/10=FALSE),IF(ISNUMBER(L15)=TRUE,L15=INT(L15*10)/10=FALSE),IF(ISNUMBER(O15)=TRUE,O15=INT(O15*10)/10=FALSE)),\"Error\",\"\")","v":"#ERROR!"}]
[null,"Development","P10",{"$f":"IFERROR(IF(VLOOKUP(C15,PartnerN°Ref,2,FALSE)=0,\"\",VLOOKUP(C15,PartnerN°Ref,2,FALSE)),\"\")","v":"#ERROR!"},{"$f":"IFERROR(IF(OR(VLOOKUP(C15,PartnerN°Ref,4,FALSE)=\"Country not found\",VLOOKUP(C15,PartnerN°Ref,3,FALSE)=0),\"\",VLOOKUP(C15,PartnerN°Ref,3,FALSE)),\"\")","v":"#ERROR!"},15.0,{"$f":"IF(T35=\"Error\",0,INDEX(Rates,MATCH(E35,CountryALL,0),MATCH($F$11,Category,0)))","v":"#ERROR!"},0,119.0,{"$f":"IF(T35=\"Error\",0,INDEX(Rates,MATCH(E35,CountryALL,0),MATCH($I$11,Category,0)))","v":"#ERROR!"},0,63.0,{"$f":"IF(T35=\"Error\",0,INDEX(Rates,MATCH(E35,CountryALL,0),MATCH($L$11,Category,0)))","v":"#ERROR!"},0,0.0,{"$f":"IF(T35=\"Error\",0,INDEX(Rates,MATCH(E35,CountryALL,0),MATCH($O$11,Category,0)))","v":"#ERROR!"},0,"#ERROR!","#ERROR!",{"$f":"IF(OR(COUNTIF(WorkPackage,B15)=0,COUNTIF(PartnerN°,C15)=0,D15=\"\",COUNTIF(CountryALL,E15)=0,ISNUMBER(F15)=FALSE,ISNUMBER(I15)=FALSE,ISNUMBER(L15)=FALSE,ISNUMBER(O15)=FALSE,IF(ISNUMBER(F15)=TRUE,F15=INT(F15*10)/10=FALSE),IF(ISNUMBER(I15)=TRUE,I15=INT(I15*10)/10=FALSE),IF(ISNUMBER(L15)=TRUE,L15=INT(L15*10)/10=FALSE),IF(ISNUMBER(O15)=TRUE,O15=INT(O15*10)/10=FALSE)),\"Error\",\"\")","v":"#ERROR!"}]
[null,"Development","P11",{"$f":"IFERROR(IF(VLOOKUP(C15,PartnerN°Ref,2,FALSE)=0,\"\",VLOOKUP(C15,PartnerN°Ref,2,FALSE)),\"\")","v":"#ERROR!"},{"$f":"IFERROR(IF(OR(VLOOKUP(C15,PartnerN°Ref,4,FALSE)=\"Country not found\",VLOOKUP(C15,PartnerN°Ref,3,FALSE)=0),\"\",VLOOKUP(C15,PartnerN°Ref,3,FALSE)),\"\")","v":"#ERROR!"},22.0,{"$f":"IF(T36=\"Error\",0,INDEX(Rates,MATCH(E36,CountryALL,0),MATCH($F$11,Category,0)))","v":"#ERROR!"},0,159.0,{"$f":"IF(T36=\"Error\",0,INDEX(Rates,MATCH(E36,CountryALL,0),MATCH($I$11,Category,0)))","v":"#ERROR!"},0,73.0,{"$f":"IF(T36=\"Error\",0,INDEX(Rates,MATCH(E36,CountryALL,0),MATCH($L$11,Category,0)))","v":"#ERROR!"},0,0.0,{"$f":"IF(T36=\"Error\",0,INDEX(Rates,MATCH(E36,CountryALL,0),MATCH($O$11,Category,0)))","v":"#ERROR!"},0,"#ERROR!","#ERROR!",{"$f":"IF(OR(COUNTIF(WorkPackage,B15)=0,COUNTIF(PartnerN°,C15)=0,D15=\"\",COUNTIF(CountryALL,E15)=0,ISNUMBER(F15)=FALSE,ISNUMBER(I15)=FALSE,ISNUMBER(L15)=FALSE,ISNUMBER(O15)=FALSE,IF(ISNUMBER(F15)=TRUE,F15=INT(F15*10)/10=FALSE),IF(ISNUMBER(I15)=TRUE,I15=INT(I15*10)/10=FALSE),IF(ISNUMBER(L15)=TRUE,L15=INT(L15*10)/10=FALSE),IF(ISNUMBER(O15)=TRUE,O15=INT(O15*10)/10=FALSE)),\"Error\",\"\")","v":"#ERROR!"}]
[null,"Development","P12",{"$f":"IFERROR(IF(VLOOKUP(C15,PartnerN°Ref,2,FALSE)=0,\"\",VLOOKUP(C15,PartnerN°Ref,2,FALSE)),\"\")","v":"#ERROR!"},{"$f":"IFERROR(IF(OR(VLOOKUP(C15,PartnerN°Ref,4,FALSE)=\"Country not found\",VLOOKUP(C15,PartnerN°Ref,3,FALSE)=0),\"\",VLOOKUP(C15,PartnerN°Ref,3,FALSE)),\"\")","v":"#ERROR!"},8.0,{"$f":"IF(T37=\"Error\",0,INDEX(Rates,MATCH(E37,CountryALL,0),MATCH($F$11,Category,0)))","v":"#ERROR!"},0,88.0,{"$f":"IF(T37=\"Error\",0,INDEX(Rates,MATCH(E37,CountryALL,0),MATCH($I$11,Category,0)))","v":"#ERROR!"},0,35.0,{"$f":"IF(T37=\"Error\",0,INDEX(Rates,MATCH(E37,CountryALL,0),MATCH($L$11,Category,0)))","v":"#ERROR!"},0,0.0,{"$f":"IF(T37=\"Error\",0,INDEX(Rates,MATCH(E37,CountryALL,0),MATCH($O$11,Category,0)))","v":"#ERROR!"},0,"#ERROR!","#ERROR!",{"$f":"IF(OR(COUNTIF(WorkPackage,B15)=0,COUNTIF(PartnerN°,C15)=0,D15=\"\",COUNTIF(CountryALL,E15)=0,ISNUMBER(F15)=FALSE,ISNUMBER(I15)=FALSE,ISNUMBER(L15)=FALSE,ISNUMBER(O15)=FALSE,IF(ISNUMBER(F15)=TRUE,F15=INT(F15*10)/10=FALSE),IF(ISNUMBER(I15)=TRUE,I15=INT(I15*10)/10=FALSE),IF(ISNUMBER(L15)=TRUE,L15=INT(L15*10)/10=FALSE),IF(ISNUMBER(O15)=TRUE,O15=INT(O15*10)/10=FALSE)),\"Error\",\"\")","v":"#ERROR!"}]
[null,"Quality Plan","P1",{"$f":"IFERROR(IF(VLOOKUP(C15,PartnerN°Ref,2,FALSE)=0,\"\",VLOOKUP(C15,PartnerN°Ref,2,FALSE)),\"\")","v":"#ERROR!"},{"$f":"IFERROR(IF(OR(VLOOKUP(C15,PartnerN°Ref,4,FALSE)=\"Country not found\",VLOOKUP(C15,PartnerN°Ref,3,FALSE)=0),\"\",VLOOKUP(C15,PartnerN°Ref,3,FALSE)),\"\")","v":"#ERROR!"},0.0,{"$f":"IF(T38=\"Error\",0,INDEX(Rates,MATCH(E38,CountryALL,0),MATCH($F$11,Category,0)))","v":"#ERROR!"},0,16.0,{"$f":"IF(T38=\"Error\",0,INDEX(Rates,MATCH(E38,CountryALL,0),MATCH($I$11,Category,0)))","v":"#ERROR!"},0,0.0,{"$f":"IF(T38=\"Error\",0,INDEX(Rates,MATCH(E38,CountryALL,0),MATCH($L$11,Category,0)))","v":"#ERROR!"},0,0.0,{"$f":"IF(T38=\"Error\",0,INDEX(Rates,MATCH(E38,CountryALL,0),MATCH($O$11,Category,0)))","v":"#ERROR!"},0,"#ERROR!","#ERROR!",{"$f":"IF(OR(COUNTIF(WorkPackage,B15)=0,COUNTIF(PartnerN°,C15)=0,D15=\"\",COUNTIF(CountryALL,E15)=0,ISNUMBER(F15)=FALSE,ISNUMBER(I15)=FALSE,ISNUMBER(L15)=FALSE,ISNUMBER(O15)=FALSE,IF(ISNUMBER(F15)=TRUE,F15=INT(F15*10)/10=FALSE),IF(ISNUMBER(I15)=TRUE,I15=INT(I15*10)/10=FALSE),IF(ISNUMBER(L15)=TRUE,L15=INT(L15*10)/10=FALSE),IF(ISNUMBER(O15)=TRUE,O15=INT(O15*10)/10=FALSE)),\"Error\",\"\")","v":"#ERROR!"}]
[null,"Quality Plan","P2",{"$f":"IFERROR(IF(VLOOKUP(C15,PartnerN°Ref,2,FALSE)=0,\"\",VLOOKUP(C15,PartnerN°Ref,2,FALSE)),\"\")","v":"#ERROR!"},{"$f":"IFERROR(IF(OR(VLOOKUP(C15,PartnerN°Ref,4,FALSE)=\"Country not found\",VLOOKUP(C15,PartnerN°Ref,3,FALSE)=0),\"\",VLOOKUP(C15,PartnerN°Ref,3,FALSE)),\"\")","v":"#ERROR!"},2.0,{"$f":"IF(T39=\"Error\",0,INDEX(Rates,MATCH(E39,CountryALL,0),MATCH($F$11,Category,0)))","v":"#ERROR!"},0,10.0,{"$f":"IF(T39=\"Error\",0,INDEX(Rates,MATCH(E39,CountryALL,0),MATCH($I$11,Category,0)))","v":"#ERROR!"},0,0.0,{"$f":"IF(T39=\"Error\",0,INDEX(Rates,MATCH(E39,CountryALL,0),MATCH($L$11,Category,0)))","v":"#ERROR!"},0,0.0,{"$f":"IF(T39=\"Error\",0,INDEX(Rates,MATCH(E39,CountryALL,0),MATCH($O$11,Category,0)))","v":"#ERROR!"},0,"#ERROR!","#ERROR!",{"$f":"IF(OR(COUNTIF(WorkPackage,B15)=0,COUNTIF(PartnerN°,C15)=0,D15=\"\",COUNTIF(CountryALL,E15)=0,ISNUMBER(F15)=FALSE,ISNUMBER(I15)=FALSE,ISNUMBER(L15)=FALSE,ISNUMBER(O15)=FALSE,IF(ISNUMBER(F15)=TRUE,F15=INT(F15*10)/10=FALSE),IF(ISNUMBER(I15)=TRUE,I15=INT(I15*10)/10=FALSE),IF(ISNUMBER(L15)=TRUE,L15=INT(L15*10)/10=FALSE),IF(ISNUMBER(O15)=TRUE,O15=INT(O15*10)/10=FALSE)),\"Error\",\"\")","v":"#ERROR!"}]
[null,"Quality Plan","P3",{"$f":"IFERROR(IF(VLOOKUP(C15,PartnerN°Ref,2,FALSE)=0,\"\",VLOOKUP(C15,PartnerN°Ref,2,FALSE)),\"\")","v":"#ERROR!"},{"$f":"IFERROR(IF(OR(VLOOKUP(C15,PartnerN°Ref,4,FALSE)=\"Country not found\",VLOOKUP(C15,PartnerN°Ref,3,FALSE)=0),\"\",VLOOKUP(C15,PartnerN°Ref,3,FALSE)),\"\")","v":"#ERROR!"},16.0,{"$f":"IF(T40=\"Error\",0,INDEX(Rates,MATCH(E40,CountryALL,0),MATCH($F$11,Category,0)))","v":"#ERROR!"},0,82.0,{"$f":"IF(T40=\"Error\",0,INDEX(Rates,MATCH(E40,CountryALL,0),MATCH($I$11,Category,0)))","v":"#ERROR!"},0,0.0,{"$f":"IF(T40=\"Error\",0,INDEX(Rates,MATCH(E40,CountryALL,0),MATCH($L$11,Category,0)))","v":"#ERROR!"},0,7.0,{"$f":"IF(T40=\"Error\",0,INDEX(Rates,MATCH(E40,CountryALL,0),MATCH($O$11,Category,0)))","v":"#ERROR!"},0,"#ERROR!","#ERROR!",{"$f":"IF(OR(COUNTIF(WorkPackage,B15)=0,COUNTIF(PartnerN°,C15)=0,D15=\"\",COUNTIF(CountryALL,E15)=0,ISNUMBER(F15)=FALSE,ISNUMBER(I15)=FALSE,ISNUMBER(L15)=FALSE,ISNUMBER(O15)=FALSE,IF(ISNUMBER(F15)=TRUE,F15=INT(F15*10)/10=FALSE),IF(ISNUMBER(I15)=TRUE,I15=INT(I15*10)/10=FALSE),IF(ISNUMBER(L15)=TRUE,L15=INT(L15*10)/10=FALSE),IF(ISNUMBER(O15)=TRUE,O15=INT(O15*10)/10=FALSE)),\"Error\",\"\")","v":"#ERROR!"}]
[null,"Quality Plan","P4",{"$f":"IFERROR(IF(VLOOKUP(C15,PartnerN°Ref,2,FALSE)=0,\"\",VLOOKUP(C15,PartnerN°Ref,2,FALSE)),\"\")","v":"#ERROR!"},{"$f":"IFERROR(IF(OR(VLOOKUP(C15,PartnerN°Ref,4,FALSE)=\"Country not found\",VLOOKUP(C15,PartnerN°Ref,3,FALSE)=0),\"\",VLOOKUP(C15,PartnerN°Ref,3,FALSE)),\"\")","v":"#ERROR!"},2.0,{"$f":"IF(T41=\"Error\",0,INDEX(Rates,MATCH(E41,CountryALL,0),MATCH($F$11,Category,0)))","v":"#ERROR!"},0,10.0,{"$f":"IF(T41=\"Error\",0,INDEX(Rates,MATCH(E41,CountryALL,0),MATCH($I$11,Category,0)))","v":"#ERROR!"},0,0.0,{"$f":"IF(T41=\"Error\",0,INDEX(Rates,MATCH(E41,CountryALL,0),MATCH($L$11,Category,0)))","v":"#ERROR!"},0,0.0,{"$f":"IF(T41=\"Error\",0,INDEX(Rates,MATCH(E41,CountryALL,0),MATCH($O$11,Category,0)))","v":"#ERROR!"},0,"#ERROR!","#ERROR!",{"$f":"IF(OR(COUNTIF(WorkPackage,B15)=0,COUNTIF(PartnerN°,C15)=0,D15=\"\",COUNTIF(CountryALL,E15)=0,ISNUMBER(F15)=FALSE,ISNUMBER(I15)=FALSE,ISNUMBER(L15)=FALSE,ISNUMBER(O15)=FALSE,IF(ISNUMBER(F15)=TRUE,F15=INT(F15*10)/10=FALSE),IF(ISNUMBER(I15)=TRUE,I15=INT(I15*10)/10=FALSE),IF(ISNUMBER(L15)=TRUE,L15=INT(L15*10)/10=FALSE),IF(ISNUMBER(O15)=TRUE,O15=INT(O15*10)/10=FALSE)),\"Error\",\"\")","v":"#ERROR!"}]
[null,"Quality Plan","P5",{"$f":"IFERROR(IF(VLOOKUP(C15,PartnerN°Ref,2,FALSE)=0,\"\",VLOOKUP(C15,PartnerN°Ref,2,FALSE)),\"\")","v":"#ERROR!"},{"$f":"IFERROR(IF(OR(VLOOKUP(C15,PartnerN°Ref,4,FALSE)=\"Country not found\",VLOOKUP(C15,PartnerN°Ref,3,FALSE)=0),\"\",VLOOKUP(C15,PartnerN°Ref,3,FALSE)),\"\")","v":"#ERROR!"},2.0,{"$f":"IF(T42=\"Error\",0,INDEX(Rates,MATCH(E42,CountryALL,0),MATCH($F$11,Category,0)))","v":"#ERROR!"},0,14.0,{"$f":"IF(T42=\"Error\",0,INDEX(Rates,MATCH(E42,CountryALL,0),MATCH($I$11,Category,0)))","v":"#ERROR!"},0,0.0,{"$f":"IF(T42=\"Error\",0,INDEX(Rates,MATCH(E42,CountryALL,0),MATCH($L$11,Category,0)))","v":"#ERROR!"},0,0.0,{"$f":"IF(T42=\"Error\",0,INDEX(Rates,MATCH(E42,CountryALL,0),MATCH($O$11,Category,0)))","v":"#ERROR!"},0,"#ERROR!","#ERROR!",{"$f":"IF(OR(COUNTIF(WorkPackage,B15)=0,COUNTIF(PartnerN°,C15)=0,D15=\"\",COUNTIF(CountryALL,E15)=0,ISNUMBER(F15)=FALSE,ISNUMBER(I15)=FALSE,ISNUMBER(L15)=FALSE,ISNUMBER(O15)=FALSE,IF(ISNUMBER(F15)=TRUE,F15=INT(F15*10)/10=FALSE),IF(ISNUMBER(I15)=TRUE,I15=INT(I15*10)/10=FALSE),IF(ISNUMBER(L15)=TRUE,L15=INT(L15*10)/10=FALSE),IF(ISNUMBER(O15)=TRUE,O15=INT(O15*10)/10=FALSE)),\"Error\",\"\")","v":"#ERROR!"}]
[null,"Quality Plan","P6",{"$f":"IFERROR(IF(VLOOKUP(C15,PartnerN°Ref,2,FALSE)=0,\"\",VLOOKUP(C15,PartnerN°Ref,2,FALSE)),\"\")","v":"#ERROR!"},{"$f":"IFERROR(IF(OR(VLOOKUP(C15,PartnerN°Ref,4,FALSE)=\"Country not found\",VLOOKUP(C15,PartnerN°Ref,3,FALSE)=0),\"\",VLOOKUP(C15,PartnerN°Ref,3,FALSE)),\"\")","v":"#ERROR!"},2.0,{"$f":"IF(T43=\"Error\",0,INDEX(Rates,MATCH(E43,CountryALL,0),MATCH($F$11,Category,0)))","v":"#ERROR!"},0,16.0,{"$f":"IF(T43=\"Error\",0,INDEX(Rates,MATCH(E43,CountryALL,0),MATCH($I$11,Category,0)))","v":"#ERROR!"},0,0.0,{"$f":"IF(T43=\"Error\",0,INDEX(Rates,MATCH(E43,CountryALL,0),MATCH($L$11,Category,0)))","v":"#ERROR!"},0,0.0,{"$f":"IF(T43=\"Error\",0,INDEX(Rates,MATCH(E43,CountryALL,0),MATCH($O$11,Category,0)))","v":"#ERROR!"},0,"#ERROR!","#ERROR!",{"$f":"IF(OR(COUNTIF(WorkPackage,B15)=0,COUNTIF(PartnerN°,C15)=0,D15=\"\",COUNTIF(CountryALL,E15)=0,ISNUMBER(F15)=FALSE,ISNUMBER(I15)=FALSE,ISNUMBER(L15)=FALSE,ISNUMBER(O15)=FALSE,IF(ISNUMBER(F15)=TRUE,F15=INT(F15*10)/10=FALSE),IF(ISNUMBER(I15)=TRUE,I15=INT(I15*10)/10=FALSE),IF(ISNUMBER(L15)=TRUE,L15=INT(L15*10)/10=FALSE),IF(ISNUMBER(O15)=TRUE,O15=INT(O15*10)/10=FALSE)),\"Error\",\"\")","v":"#ERROR!"}]
[null,"Quality Plan","P7",{"$f":"IFERROR(IF(VLOOKUP(C15,PartnerN°Ref,2,FALSE)=0,\"\",VLOOKUP(C15,PartnerN°Ref,2,FALSE)),\"\")","v":"#ERROR!"},{"$f":"IFERROR(IF(OR(VLOOKUP(C15,PartnerN°Ref,4,FALSE)=\"Country not found\",VLOOKUP(C15,PartnerN°Ref,3,FALSE)=0),\"\",VLOOKUP(C15,PartnerN°Ref,3,FALSE)),\"\")","v":"#ERROR!"},2.0,{"$f":"IF(T44=\"Error\",0,INDEX(Rates,MATCH(E44,CountryALL,0),MATCH($F$11,Category,0)))","v":"#ERROR!"},0,16.0,{"$f":"IF(T44=\"Error\",0,INDEX(Rates,MATCH(E44,CountryALL,0),MATCH($I$11,Category,0)))","v":"#ERROR!"},0,0.0,{"$f":"IF(T44=\"Error\",0,INDEX(Rates,MATCH(E44,CountryALL,0),MATCH($L$11,Category,0)))","v":"#ERROR!"},0,0.0,{"$f":"IF(T44=\"Error\",0,INDEX(Rates,MATCH(E44,CountryALL,0),MATCH($O$11,Category,0)))","v":"#ERROR!"},0,"#ERROR!","#ERROR!",{"$f":"IF(OR(COUNTIF(WorkPackage,B15)=0,COUNTIF(PartnerN°,C15)=0,D15=\"\",COUNTIF(CountryALL,E15)=0,ISNUMBER(F15)=FALSE,ISNUMBER(I15)=FALSE,ISNUMBER(L15)=FALSE,ISNUMBER(O15)=FALSE,IF(ISNUMBER(F15)=TRUE,F15=INT(F15*10)/10=FALSE),IF(ISNUMBER(I15)=TRUE,I15=INT(I15*10)/10=FALSE),IF(ISNUMBER(L15)=TRUE,L15=INT(L15*10)/10=FALSE),IF(ISNUMBER(O15)=TRUE,O15=INT(O15*10)/10=FALSE)),\"Error\",\"\")","v":"#ERROR!"}]
[null,"Quality Plan","P8",{"$f":"IFERROR(IF(VLOOKUP(C15,PartnerN°Ref,2,FALSE)=0,\"\",VLOOKUP(C15,PartnerN°Ref,2,FALSE)),\"\")","v":"#ERROR!"},{"$f":"IFERROR(IF(OR(VLOOKUP(C15,PartnerN°Ref,4,FALSE)=\"Country not found\",VLOOKUP(C15,PartnerN°Ref,3,FALSE)=0),\"\",VLOOKUP(C15,PartnerN°Ref,3,FALSE)),\"\")","v":"#ERROR!"},2.0,{"$f":"IF(T45=\"Error\",0,INDEX(Rates,MATCH(E45,CountryALL,0),MATCH($F$11,Category,0)))","v":"#ERROR!"},0,16.0,{"$f":"IF(T45=\"Error\",0,INDEX(Rates,MATCH(E45,CountryALL,0),MATCH($I$11,Category,0)))","v":"#ERROR!"},0,0.0,{"$f":"IF(T45=\"Error\",0,INDEX(Rates,MATCH(E45,CountryALL,0),MATCH($L$11,Category,0)))","v":"#ERROR!"},0,0.0,{"$f":"IF(T45=\"Error\",0,INDEX(Rates,MATCH(E45,CountryALL,0),MATCH($O$11,Category,0)))","v":"#ERROR!"},0,"#ERROR!","#ERROR!",{"$f":"IF(OR(COUNTIF(WorkPackage,B15)=0,COUNTIF(PartnerN°,C15)=0,D15=\"\",COUNTIF(CountryALL,E15)=0,ISNUMBER(F15)=FALSE,ISNUMBER(I15)=FALSE,ISNUMBER(L15)=FALSE,ISNUMBER(O15)=FALSE,IF(ISNUMBER(F15)=TRUE,F15=INT(F15*10)/10=FALSE),IF(ISNUMBER(I15)=TRUE,I15=INT(I15*10)/10=FALSE),IF(ISNUMBER(L15)=TRUE,L15=INT(L15*10)/10=FALSE),IF(ISNUMBER(O15)=TRUE,O15=INT(O15*10)/10=FALSE)),\"Error\",\"\")","v":"#ERROR!"}]
[null,"Quality Plan","P9",{"$f":"IFERROR(IF(VLOOKUP(C15,PartnerN°Ref,2,FALSE)=0,\"\",VLOOKUP(C15,PartnerN°Ref,2,FALSE)),\"\")","v":"#ERROR!"},{"$f":"IFERROR(IF(OR(VLOOKUP(C15,PartnerN°Ref,4,FALSE)=\"Country not found\",VLOOKUP(C15,PartnerN°Ref,3,FALSE)=0),\"\",VLOOKUP(C15,PartnerN°Ref,3,FALSE)),\"\")","v":"#ERROR!"},2.0,{"$f":"IF(T46=\"Error\",0,INDEX(Rates,MATCH(E46,CountryALL,0),MATCH($F$11,Category,0)))","v":"#ERROR!"},0,16.0,{"$f":"IF(T46=\"Error\",0,INDEX(Rates,MATCH(E46,CountryALL,0),MATCH($I$11,Category,0)))","v":"#ERROR!"},0,0.0,{"$f":"IF(T46=\"Error\",0,INDEX(Rates,MATCH(E46,CountryALL,0),MATCH($L$11,Category,0)))","v":"#ERROR!"},0,0.0,{"$f":"IF(T46=\"Error\",0,INDEX(Rates,MATCH(E46,CountryALL,0),MATCH($O$11,Category,0)))","v":"#ERROR!"},0,"#ERROR!","#ERROR!",{"$f":"IF(OR(COUNTIF(WorkPackage,B15)=0,COUNTIF(PartnerN°,C15)=0,D15=\"\",COUNTIF(CountryALL,E15)=0,ISNUMBER(F15)=FALSE,ISNUMBER(I15)=FALSE,ISNUMBER(L15)=FALSE,ISNUMBER(O15)=FALSE,IF(ISNUMBER(F15)=TRUE,F15=INT(F15*10)/10=FALSE),IF(ISNUMBER(I15)=TRUE,I15=INT(I15*10)/10=FALSE),IF(ISNUMBER(L15)=TRUE,L15=INT(L15*10)/10=FALSE),IF(ISNUMBER(O15)=TRUE,O15=INT(O15*10)/10=FALSE)),\"Error\",\"\")","v":"#ERROR!"}]
[null,"Quality Plan","P10",{"$f":"IFERROR(IF(VLOOKUP(C15,PartnerN°Ref,2,FALSE)=0,\"\",VLOOKUP(C15,PartnerN°Ref,2,FALSE)),\"\")","v":"#ERROR!"},{"$f":"IFERROR(IF(OR(VLOOKUP(C15,PartnerN°Ref,4,FALSE)=\"Country not found\",VLOOKUP(C15,PartnerN°Ref,3,FALSE)=0),\"\",VLOOKUP(C15,PartnerN°Ref,3,FALSE)),\"\")","v":"#ERROR!"},5.0,{"$f":"IF(T47=\"Error\",0,INDEX(Rates,MATCH(E47,CountryALL,0),MATCH($F$11,Category,0)))","v":"#ERROR!"},0,44.0,{"$f":"IF(T47=\"Error\",0,INDEX(Rates,MATCH(E47,CountryALL,0),MATCH($I$11,Category,0)))","v":"#ERROR!"},0,0.0,{"$f":"IF(T47=\"Error\",0,INDEX(Rates,MATCH(E47,CountryALL,0),MATCH($L$11,Category,0)))","v":"#ERROR!"},0,7.0,{"$f":"IF(T47=\"Error\",0,INDEX(Rates,MATCH(E47,CountryALL,0),MATCH($O$11,Category,0)))","v":"#ERROR!"},0,"#ERROR!","#ERROR!",{"$f":"IF(OR(COUNTIF(WorkPackage,B15)=0,COUNTIF(PartnerN°,C15)=0,D15=\"\",COUNTIF(CountryALL,E15)=0,ISNUMBER(F15)=FALSE,ISNUMBER(I15)=FALSE,ISNUMBER(L15)=FALSE,ISNUMBER(O15)=FALSE,IF(ISNUMBER(F15)=TRUE,F15=INT(F15*10)/10=FALSE),IF(ISNUMBER(I15)=TRUE,I15=INT(I15*10)/10=FALSE),IF(ISNUMBER(L15)=TRUE,L15=INT(L15*10)/10=FALSE),IF(ISNUMBER(O15)=TRUE,O15=INT(O15*10)/10=FALSE)),\"Error\",\"\")","v":"#ERROR!"}]
[null,"Quality Plan","P11",{"$f":"IFERROR(IF(VLOOKUP(C15,PartnerN°Ref,2,FALSE)=0,\"\",VLOOKUP(C15,PartnerN°Ref,2,FALSE)),\"\")","v":"#ERROR!"},{"$f":"IFERROR(IF(OR(VLOOKUP(C15,PartnerN°Ref,4,FALSE)=\"Country not found\",VLOOKUP(C15,PartnerN°Ref,3,FALSE)=0),\"\",VLOOKUP(C15,PartnerN°Ref,3,FALSE)),\"\")","v":"#ERROR!"},2.0,{"$f":"IF(T48=\"Error\",0,INDEX(Rates,MATCH(E48,CountryALL,0),MATCH($F$11,Category,0)))","v":"#ERROR!"},0,16.0,{"$f":"IF(T48=\"Error\",0,INDEX(Rates,MATCH(E48,CountryALL,0),MATCH($I$11,Category,0)))","v":"#ERROR!"},0,0.0,{"$f":"IF(T48=\"Error\",0,INDEX(Rates,MATCH(E48,CountryALL,0),MATCH($L$11,Category,0)))","v":"#ERROR!"},0,0.0,{"$f":"IF(T48=\"Error\",0,INDEX(Rates,MATCH(E48,CountryALL,0),MATCH($O$11,Category,0)))","v":"#ERROR!"},0,"#ERROR!","#ERROR!",{"$f":"IF(OR(COUNTIF(WorkPackage,B15)=0,COUNTIF(PartnerN°,C15)=0,D15=\"\",COUNTIF(CountryALL,E15)=0,ISNUMBER(F15)=FALSE,ISNUMBER(I15)=FALSE,ISNUMBER(L15)=FALSE,ISNUMBER(O15)=FALSE,IF(ISNUMBER(F15)=TRUE,F15=INT(F15*10)/10=FALSE),IF(ISNUMBER(I15)=TRUE,I15=INT(I15*10)/10=FALSE),IF(ISNUMBER(L15)=TRUE,L15=INT(L15*10)/10=FALSE),IF(ISNUMBER(O15)=TRUE,O15=INT(O15*10)/10=FALSE)),\"Error\",\"\")","v":"#ERROR!"}]
[null,"Quality Plan","P12",{"$f":"IFERROR(IF(VLOOKUP(C15,PartnerN°Ref,2,FALSE)=0,\"\",VLOOKUP(C15,PartnerN°Ref,2,FALSE)),\"\")","v":"#ERROR!"},{"$f":"IFERROR(IF(OR(VLOOKUP(C15,PartnerN°Ref,4,FALSE)=\"Country not found\",VLOOKUP(C15,PartnerN°Ref,3,FALSE)=0),\"\",VLOOKUP(C15,PartnerN°Ref,3,FALSE)),\"\")","v":"#ERROR!"},2.0,{"$f":"IF(T49=\"Error\",0,INDEX(Rates,MATCH(E49,CountryALL,0),MATCH($F$11,Category,0)))","v":"#ERROR!"},0,16.0,{"$f":"IF(T49=\"Error\",0,INDEX(Rates,MATCH(E49,CountryALL,0),MATCH($I$11,Category,0)))","v":"#ERROR!"},0,0.0,{"$f":"IF(T49=\"Error\",0,INDEX(Rates,MATCH(E49,CountryALL,0),MATCH($L$11,Category,0)))","v":"#ERROR!"},0,0.0,{"$f":"IF(T49=\"Error\",0,INDEX(Rates,MATCH(E49,CountryALL,0),MATCH($O$11,Category,0)))","v":"#ERROR!"},0,"#ERROR!","#ERROR!",{"$f":"IF(OR(COUNTIF(WorkPackage,B15)=0,COUNTIF(PartnerN°,C15)=0,D15=\"\",COUNTIF(CountryALL,E15)=0,ISNUMBER(F15)=FALSE,ISNUMBER(I15)=FALSE,ISNUMBER(L15)=FALSE,ISNUMBER(O15)=FALSE,IF(ISNUMBER(F15)=TRUE,F15=INT(F15*10)/10=FALSE),IF(ISNUMBER(I15)=TRUE,I15=INT(I15*10)/10=FALSE),IF(ISNUMBER(L15)=TRUE,L15=INT(L15*10)/10=FALSE),IF(ISNUMBER(O15)=TRUE,O15=INT(O15*10)/10=FALSE)),\"Error\",\"\")","v":"#ERROR!"}]
[null,"Dissemination & Exploitation","P1",{"$f":"IFERROR(IF(VLOOKUP(C15,PartnerN°Ref,2,FALSE)=0,\"\",VLOOKUP(C15,PartnerN°Ref,2,FALSE)),\"\")","v":"#ERROR!"},{"$f":"IFERROR(IF(OR(VLOOKUP(C15,PartnerN°Ref,4,FALSE)=\"Country not found\",VLOOKUP(C15,PartnerN°Ref,3,FALSE)=0),\"\",VLOOKUP(C15,PartnerN°Ref,3,FALSE)),\"\")","v":"#ERROR!"},2.0,{"$f":"IF(T50=\"Error\",0,INDEX(Rates,MATCH(E50,CountryALL,0),MATCH($F$11,Category,0)))","v":"#ERROR!"},0,29.0,{"$f":"IF(T50=\"Error\",0,INDEX(Rates,MATCH(E50,CountryALL,0),MATCH($I$11,Category,0)))","v":"#ERROR!"},0,7.0,{"$f":"IF(T50=\"Error\",0,INDEX(Rates,MATCH(E50,CountryALL,0),MATCH($L$11,Category,0)))","v":"#ERROR!"},0,0.0,{"$f":"IF(T50=\"Error\",0,INDEX(Rates,MATCH(E50,CountryALL,0),MATCH($O$11,Category,0)))","v":"#ERROR!"},0,"#ERROR!","#ERROR!",{"$f":"IF(OR(COUNTIF(WorkPackage,B15)=0,COUNTIF(PartnerN°,C15)=0,D15=\"\",COUNTIF(CountryALL,E15)=0,ISNUMBER(F15)=FALSE,ISNUMBER(I15)=FALSE,ISNUMBER(L15)=FALSE,ISNUMBER(O15)=FALSE,IF(ISNUMBER(F15)=TRUE,F15=INT(F15*10)/10=FALSE),IF(ISNUMBER(I15)=TRUE,I15=INT(I15*10)/10=FALSE),IF(ISNUMBER(L15)=TRUE,L15=INT(L15*10)/10=FALSE),IF(ISNUMBER(O15)=TRUE,O15=INT(O15*10)/10=FALSE)),\"Error\",\"\")","v":"#ERROR!"}]
[null,"Dissemination & Exploitation","P2",{"$f":"IFERROR(IF(VLOOKUP(C15,PartnerN°Ref,2,FALSE)=0,\"\",VLOOKUP(C15,PartnerN°Ref,2,FALSE)),\"\")","v":"#ERROR!"},{"$f":"IFERROR(IF(OR(VLOOKUP(C15,PartnerN°Ref,4,FALSE)=\"Country not found\",VLOOKUP(C15,PartnerN°Ref,3,FALSE)=0),\"\",VLOOKUP(C15,PartnerN°Ref,3,FALSE)),\"\")","v":"#ERROR!"},2.0,{"$f":"IF(T51=\"Error\",0,INDEX(Rates,MATCH(E51,CountryALL,0),MATCH($F$11,Category,0)))","v":"#ERROR!"},0,5.0,{"$f":"IF(T51=\"Error\",0,INDEX(Rates,MATCH(E51,CountryALL,0),MATCH($I$11,Category,0)))","v":"#ERROR!"},0,0.0,{"$f":"IF(T51=\"Error\",0,INDEX(Rates,MATCH(E51,CountryALL,0),MATCH($L$11,Category,0)))","v":"#ERROR!"},0,0.0,{"$f":"IF(T51=\"Error\",0,INDEX(Rates,MATCH(E51,CountryALL,0),MATCH($O$11,Category,0)))","v":"#ERROR!"},0,"#ERROR!","#ERROR!",{"$f":"IF(OR(COUNTIF(WorkPackage,B15)=0,COUNTIF(PartnerN°,C15)=0,D15=\"\",COUNTIF(CountryALL,E15)=0,ISNUMBER(F15)=FALSE,ISNUMBER(I15)=FALSE,ISNUMBER(L15)=FALSE,ISNUMBER(O15)=FALSE,IF(ISNUMBER(F15)=TRUE,F15=INT(F15*10)/10=FALSE),IF(ISNUMBER(I15)=TRUE,I15=INT(I15*10)/10=FALSE),IF(ISNUMBER(L15)=TRUE,L15=INT(L15*10)/10=FALSE),IF(ISNUMBER(O15)=TRUE,O15=INT(O15*10)/10=FALSE)),\"Error\",\"\")","v":"#ERROR!"}]
[null,"Dissemination & Exploitation","P3",{"$f":"IFERROR(IF(VLOOKUP(C15,PartnerN°Ref,2,FALSE)=0,\"\",VLOOKUP(C15,PartnerN°Ref,2,FALSE)),\"\")","v":"#ERROR!"},{"$f":"IFERROR(IF(OR(VLOOKUP(C15,PartnerN°Ref,4,FALSE)=\"Country not found\",VLOOKUP(C15,PartnerN°Ref,3,FALSE)=0),\"\",VLOOKUP(C15,PartnerN°Ref,3,FALSE)),\"\")","v":"#ERROR!"},2.0,{"$f":"IF(T52=\"Error\",0,INDEX(Rates,MATCH(E52,CountryALL,0),MATCH($F$11,Category,0)))","v":"#ERROR!"},0,5.0,{"$f":"IF(T52=\"Error\",0,INDEX(Rates,MATCH(E52,CountryALL,0),MATCH($I$11,Category,0)))","v":"#ERROR!"},0,0.0,{"$f":"IF(T52=\"Error\",0,INDEX(Rates,MATCH(E52,CountryALL,0),MATCH($L$11,Category,0)))","v":"#ERROR!"},0,0.0,{"$f":"IF(T52=\"Error\",0,INDEX(Rates,MATCH(E52,CountryALL,0),MATCH($O$11,Category,0)))","v":"#ERROR!"},0,"#ERROR!","#ERROR!",{"$f":"IF(OR(COUNTIF(WorkPackage,B15)=0,COUNTIF(PartnerN°,C15)=0,D15=\"\",COUNTIF(CountryALL,E15)=0,ISNUMBER(F15)=FALSE,ISNUMBER(I15)=FALSE,ISNUMBER(L15)=FALSE,ISNUMBER(O15)=FALSE,IF(ISNUMBER(F15)=TRUE,F15=INT(F15*10)/10=FALSE),IF(ISNUMBER(I15)=TRUE,I15=INT(I15*10)/10=FALSE),IF(ISNUMBER(L15)=TRUE,L15=INT(L15*10)/10=FALSE),IF(ISNUMBER(O15)=TRUE,O15=INT(O15*10)/10=FALSE)),\"Error\",\"\")","v":"#ERROR!"}]
[null,"Dissemination & Exploitation","P4",{"$f":"IFERROR(IF(VLOOKUP(C15,PartnerN°Ref,2,FALSE)=0,\"\",VLOOKUP(C15,PartnerN°Ref,2,FALSE)),\"\")","v":"#ERROR!"},{"$f":"IFERROR(IF(OR(VLOOKUP(C15,PartnerN°Ref,4,FALSE)=\"Country not found\",VLOOKUP(C15,PartnerN°Ref,3,FALSE)=0),\"\",VLOOKUP(C15,PartnerN°Ref,3,FALSE)),\"\")","v":"#ERROR!"},2.0,{"$f":"IF(T53=\"Error\",0,INDEX(Rates,MATCH(E53,CountryALL,0),MATCH($F$11,Category,0)))","v":"#ERROR!"},0,5.0,{"$f":"IF(T53=\"Error\",0,INDEX(Rates,MATCH(E53,CountryALL,0),MATCH($I$11,Category,0)))","v":"#ERROR!"},0,0.0,{"$f":"IF(T53=\"Error\",0,INDEX(Rates,MATCH(E53,CountryALL,0),MATCH($L$11,Category,0)))","v":"#ERROR!"},0,0.0,{"$f":"IF(T53=\"Error\",0,INDEX(Rates,MATCH(E53,CountryALL,0),MATCH($O$11,Category,0)))","v":"#ERROR!"},0,"#ERROR!","#ERROR!",{"$f":"IF(OR(COUNTIF(WorkPackage,B15)=0,COUNTIF(PartnerN°,C15)=0,D15=\"\",COUNTIF(CountryALL,E15)=0,ISNUMBER(F15)=FALSE,ISNUMBER(I15)=FALSE,ISNUMBER(L15)=FALSE,ISNUMBER(O15)=FALSE,IF(ISNUMBER(F15)=TRUE,F15=INT(F15*10)/10=FALSE),IF(ISNUMBER(I15)=TRUE,I15=INT(I15*10)/10=FALSE),IF(ISNUMBER(L15)=TRUE,L15=INT(L15*10)/10=FALSE),IF(ISNUMBER(O15)=TRUE,O15=INT(O15*10)/10=FALSE)),\"Error\",\"\")","v":"#ERROR!"}]
[null,"Dissemination & Exploitation","P5",{"$f":"IFERROR(IF(VLOOKUP(C15,PartnerN°Ref,2,FALSE)=0,\"\",VLOOKUP(C15,PartnerN°Ref,2,FALSE)),\"\")","v":"#ERROR!"},{"$f":"IFERROR(IF(OR(VLOOKUP(C15,PartnerN°Ref,4,FALSE)=\"Country not found\",VLOOKUP(C15,PartnerN°Ref,3,FALSE)=0),\"\",VLOOKUP(C15,PartnerN°Ref,3,FALSE)),\"\")","v":"#ERROR!"},5.0,{"$f":"IF(T54=\"Error\",0,INDEX(Rates,MATCH(E54,CountryALL,0),MATCH($F$11,Category,0)))","v":"#ERROR!"},0,58.0,{"$f":"IF(T54=\"Error\",0,INDEX(Rates,MATCH(E54,CountryALL,0),MATCH($I$11,Category,0)))","v":"#ERROR!"},0,0.0,{"$f":"IF(T54=\"Error\",0,INDEX(Rates,MATCH(E54,CountryALL,0),MATCH($L$11,Category,0)))","v":"#ERROR!"},0,0.0,{"$f":"IF(T54=\"Error\",0,INDEX(Rates,MATCH(E54,CountryALL,0),MATCH($O$11,Category,0)))","v":"#ERROR!"},0,"#ERROR!","#ERROR!",{"$f":"IF(OR(COUNTIF(WorkPackage,B15)=0,COUNTIF(PartnerN°,C15)=0,D15=\"\",COUNTIF(CountryALL,E15)=0,ISNUMBER(F15)=FALSE,ISNUMBER(I15)=FALSE,ISNUMBER(L15)=FALSE,ISNUMBER(O15)=FALSE,IF(ISNUMBER(F15)=TRUE,F15=INT(F15*10)/10=FALSE),IF(ISNUMBER(I15)=TRUE,I15=INT(I15*10)/10=FALSE),IF(ISNUMBER(L15)=TRUE,L15=INT(L15*10)/10=FALSE),IF(ISNUMBER(O15)=TRUE,O15=INT(O15*10)/10=FALSE)),\"Error\",\"\")","v":"#ERROR!"}]
[null,"Dissemination & Exploitation","P6",{"$f":"IFERROR(IF(VLOOKUP(C15,PartnerN°Ref,2,FALSE)=0,\"\",VLOOKUP(C15,PartnerN°Ref,2,FALSE)),\"\")","v":"#ERROR!"},{"$f":"IFERROR(IF(OR(VLOOKUP(C15,PartnerN°Ref,4,FALSE)=\"Country not found\",VLOOKUP(C15,PartnerN°Ref,3,FALSE)=0),\"\",VLOOKUP(C15,PartnerN°Ref,3,FALSE)),\"\")","v":"#ERROR!"},5.0,{"$f":"IF(T55=\"Error\",0,INDEX(Rates,MATCH(E55,CountryALL,0),MATCH($F$11,Category,0)))","v":"#ERROR!"},0,58.0,{"$f":"IF(T55=\"Error\",0,INDEX(Rates,MATCH(E55,CountryALL,0),MATCH($I$11,Category,0)))","v":"#ERROR!"},0,0.0,{"$f":"IF(T55=\"Error\",0,INDEX(Rates,MATCH(E55,CountryALL,0),MATCH($L$11,Category,0)))","v":"#ERROR!"},0,0.0,{"$f":"IF(T55=\"Error\",0,INDEX(Rates,MATCH(E55,CountryALL,0),MATCH($O$11,Category,0)))","v":"#ERROR!"},0,"#ERROR!","#ERROR!",{"$f":"IF(OR(COUNTIF(WorkPackage,B15)=0,COUNTIF(PartnerN°,C15)=0,D15=\"\",COUNTIF(CountryALL,E15)=0,ISNUMBER(F15)=FALSE,ISNUMBER(I15)=FALSE,ISNUMBER(L15)=FALSE,ISNUMBER(O15)=FALSE,IF(ISNUMBER(F15)=TRUE,F15=INT(F15*10)/10=FALSE),IF(ISNUMBER(I15)=TRUE,I15=INT(I15*10)/10=FALSE),IF(ISNUMBER(L15)=TRUE,L15=INT(L15*10)/10=FALSE),IF(ISNUMBER(O15)=TRUE,O15=INT(O15*10)/10=FALSE)),\"Error\",\"\")","v":"#ERROR!"}]
[null,"Dissemination & Exploitation","P7",{"$f":"IFERROR(IF(VLOOKUP(C15,PartnerN°Ref,2,FALSE)=0,\"\",VLOOKUP(C15,PartnerN°Ref,2,FALSE)),\"\")","v":"#ERROR!"},{"$f":"IFERROR(IF(OR(VLOOKUP(C15,PartnerN°Ref,4,FALSE)=\"Country not found\",VLOOKUP(C15,PartnerN°Ref,3,FALSE)=0),\"\",VLOOKUP(C15,PartnerN°Ref,3,FALSE)),\"\")","v":"#ERROR!"},16.0,{"$f":"IF(T56=\"Error\",0,INDEX(Rates,MATCH(E56,CountryALL,0),MATCH($F$11,Category,0)))","v":"#ERROR!"},0,114.0,{"$f":"IF(T56=\"Error\",0,INDEX(Rates,MATCH(E56,CountryALL,0),MATCH($I$11,Category,0)))","v":"#ERROR!"},0,10.0,{"$f":"IF(T56=\"Error\",0,INDEX(Rates,MATCH(E56,CountryALL,0),MATCH($L$11,Category,0)))","v":"#ERROR!"},0,0.0,{"$f":"IF(T56=\"Error\",0,INDEX(Rates,MATCH(E56,CountryALL,0),MATCH($O$11,Category,0)))","v":"#ERROR!"},0,"#ERROR!","#ERROR!",{"$f":"IF(OR(COUNTIF(WorkPackage,B15)=0,COUNTIF(PartnerN°,C15)=0,D15=\"\",COUNTIF(CountryALL,E15)=0,ISNUMBER(F15)=FALSE,ISNUMBER(I15)=FALSE,ISNUMBER(L15)=FALSE,ISNUMBER(O15)=FALSE,IF(ISNUMBER(F15)=TRUE,F15=INT(F15*10)/10=FALSE),IF(ISNUMBER(I15)=TRUE,I15=INT(I15*10)/10=FALSE),IF(ISNUMBER(L15)=TRUE,L15=INT(L15*10)/10=FALSE),IF(ISNUMBER(O15)=TRUE,O15=INT(O15*10)/10=FALSE)),\"Error\",\"\")","v":"#ERROR!"}]
[null,"Dissemination & Exploitation","P8",{"$f":"IFERROR(IF(VLOOKUP(C15,PartnerN°Ref,2,FALSE)=0,\"\",VLOOKUP(C15,PartnerN°Ref,2,FALSE)),\"\")","v":"#ERROR!"},{"$f":"IFERROR(IF(OR(VLOOKUP(C15,PartnerN°Ref,4,FALSE)=\"Country not found\",VLOOKUP(C15,PartnerN°Ref,3,FALSE)=0),\"\",VLOOKUP(C15,PartnerN°Ref,3,FALSE)),\"\")","v":"#ERROR!"},5.0,{"$f":"IF(T57=\"Error\",0,INDEX(Rates,MATCH(E57,CountryALL,0),MATCH($F$11,Category,0)))","v":"#ERROR!"},0,58.0,{"$f":"IF(T57=\"Error\",0,INDEX(Rates,MATCH(E57,CountryALL,0),MATCH($I$11,Category,0)))","v":"#ERROR!"},0,0.0,{"$f":"IF(T57=\"Error\",0,INDEX(Rates,MATCH(E57,CountryALL,0),MATCH($L$11,Category,0)))","v":"#ERROR!"},0,0.0,{"$f":"IF(T57=\"Error\",0,INDEX(Rates,MATCH(E57,CountryALL,0),MATCH($O$11,Category,0)))","v":"#ERROR!"},0,"#ERROR!","#ERROR!",{"$f":"IF(OR(COUNTIF(WorkPackage,B15)=0,COUNTIF(PartnerN°,C15)=0,D15=\"\",COUNTIF(CountryALL,E15)=0,ISNUMBER(F15)=FALSE,ISNUMBER(I15)=FALSE,ISNUMBER(L15)=FALSE,ISNUMBER(O15)=FALSE,IF(ISNUMBER(F15)=TRUE,F15=INT(F15*10)/10=FALSE),IF(ISNUMBER(I15)=TRUE,I15=INT(I15*10)/10=FALSE),IF(ISNUMBER(L15)=TRUE,L15=INT(L15*10)/10=FALSE),IF(ISNUMBER(O15)=TRUE,O15=INT(O15*10)/10=FALSE)),\"Error\",\"\")","v":"#ERROR!"}]
[null,"Dissemination & Exploitation","P9",{"$f":"IFERROR(IF(VLOOKUP(C15,PartnerN°Ref,2,FALSE)=0,\"\",VLOOKUP(C15,PartnerN°Ref,2,FALSE)),\"\")","v":"#ERROR!"},{"$f":"IFERROR(IF(OR(VLOOKUP(C15,PartnerN°Ref,4,FALSE)=\"Country not found\",VLOOKUP(C15,PartnerN°Ref,3,FALSE)=0),\"\",VLOOKUP(C15,PartnerN°Ref,3,FALSE)),\"\")","v":"#ERROR!"},5.0,{"$f":"IF(T58=\"Error\",0,INDEX(Rates,MATCH(E58,CountryALL,0),MATCH($F$11,Category,0)))","v":"#ERROR!"},0,58.0,{"$f":"IF(T58=\"Error\",0,INDEX(Rates,MATCH(E58,CountryALL,0),MATCH($I$11,Category,0)))","v":"#ERROR!"},0,0.0,{"$f":"IF(T58=\"Error\",0,INDEX(Rates,MATCH(E58,CountryALL,0),MATCH($L$11,Category,0)))","v":"#ERROR!"},0,0.0,{"$f":"IF(T58=\"Error\",0,INDEX(Rates,MATCH(E58,CountryALL,0),MATCH($O$11,Category,0)))","v":"#ERROR!"},0,"#ERROR!","#ERROR!",{"$f":"IF(OR(COUNTIF(WorkPackage,B15)=0,COUNTIF(PartnerN°,C15)=0,D15=\"\",COUNTIF(CountryALL,E15)=0,ISNUMBER(F15)=FALSE,ISNUMBER(I15)=FALSE,ISNUMBER(L15)=FALSE,ISNUMBER(O15)=FALSE,IF(ISNUMBER(F15)=TRUE,F15=INT(F15*10)/10=FALSE),IF(ISNUMBER(I15)=TRUE,I15=INT(I15*10)/10=FALSE),IF(ISNUMBER(L15)=TRUE,L15=INT(L15*10)/10=FALSE),IF(ISNUMBER(O15)=TRUE,O15=INT(O15*10)/10=FALSE)),\"Error\",\"\")","v":"#ERROR!"}]
[null,"Dissemination & Exploitation","P10",{"$f":"IFERROR(IF(VLOOKUP(C15,PartnerN°Ref,2,FALSE)=0,\"\",VLOOKUP(C15,PartnerN°Ref,2,FALSE)),\"\")","v":"#ERROR!"},{"$f":"IFERROR(IF(OR(VLOOKUP(C15,PartnerN°Ref,4,FALSE)=\"Country not found\",VLOOKUP(C15,PartnerN°Ref,3,FALSE)=0),\"\",VLOOKUP(C15,PartnerN°Ref,3,FALSE)),\"\")","v":"#ERROR!"},5.0,{"$f":"IF(T59=\"Error\",0,INDEX(Rates,MATCH(E59,CountryALL,0),MATCH($F$11,Category,0)))","v":"#ERROR!"},0,58.0,{"$f":"IF(T59=\"Error\",0,INDEX(Rates,MATCH(E59,CountryALL,0),MATCH($I$11,Category,0)))","v":"#ERROR!"},0,0.0,{"$f":"IF(T59=\"Error\",0,INDEX(Rates,MATCH(E59,CountryALL,0),MATCH($L$11,Category,0)))","v":"#ERROR!"},0,0.0,{"$f":"IF(T59=\"Error\",0,INDEX(Rates,MATCH(E59,CountryALL,0),MATCH($O$11,Category,0)))","v":"#ERROR!"},0,"#ERROR!","#ERROR!",{"$f":"IF(OR(COUNTIF(WorkPackage,B15)=0,COUNTIF(PartnerN°,C15)=0,D15=\"\",COUNTIF(CountryALL,E15)=0,ISNUMBER(F15)=FALSE,ISNUMBER(I15)=FALSE,ISNUMBER(L15)=FALSE,ISNUMBER(O15)=FALSE,IF(ISNUMBER(F15)=TRUE,F15=INT(F15*10)/10=FALSE),IF(ISNUMBER(I15)=TRUE,I15=INT(I15*10)/10=FALSE),IF(ISNUMBER(L15)=TRUE,L15=INT(L15*10)/10=FALSE),IF(ISNUMBER(O15)=TRUE,O15=INT(O15*10)/10=FALSE)),\"Error\",\"\")","v":"#ERROR!"}]
[null,"Dissemination & Exploitation","P11",{"$f":"IFERROR(IF(VLOOKUP(C15,PartnerN°Ref,2,FALSE)=0,\"\",VLOOKUP(C15,PartnerN°Ref,2,FALSE)),\"\")","v":"#ERROR!"},{"$f":"IFERROR(IF(OR(VLOOKUP(C15,PartnerN°Ref,4,FALSE)=\"Country not found\",VLOOKUP(C15,PartnerN°Ref,3,FALSE)=0),\"\",VLOOKUP(C15,PartnerN°Ref,3,FALSE)),\"\")","v":"#ERROR!"},5.0,{"$f":"IF(T60=\"Error\",0,INDEX(Rates,MATCH(E60,CountryALL,0),MATCH($F$11,Category,0)))","v":"#ERROR!"},0,58.0,{"$f":"IF(T60=\"Error\",0,INDEX(Rates,MATCH(E60,CountryALL,0),MATCH($I$11,Category,0)))","v":"#ERROR!"},0,0.0,{"$f":"IF(T60=\"Error\",0,INDEX(Rates,MATCH(E60,CountryALL,0),MATCH($L$11,Category,0)))","v":"#ERROR!"},0,0.0,{"$f":"IF(T60=\"Error\",0,INDEX(Rates,MATCH(E60,CountryALL,0),MATCH($O$11,Category,0)))","v":"#ERROR!"},0,"#ERROR!","#ERROR!",{"$f":"IF(OR(COUNTIF(WorkPackage,B15)=0,COUNTIF(PartnerN°,C15)=0,D15=\"\",COUNTIF(CountryALL,E15)=0,ISNUMBER(F15)=FALSE,ISNUMBER(I15)=FALSE,ISNUMBER(L15)=FALSE,ISNUMBER(O15)=FALSE,IF(ISNUMBER(F15)=TRUE,F15=INT(F15*10)/10=FALSE),IF(ISNUMBER(I15)=TRUE,I15=INT(I15*10)/10=FALSE),IF(ISNUMBER(L15)=TRUE,L15=INT(L15*10)/10=FALSE),IF(ISNUMBER(O15)=TRUE,O15=INT(O15*10)/10=FALSE)),\"Error\",\"\")","v":"#ERROR!"}]
[null,"Dissemination & Exploitation","P12",{"$f":"IFERROR(IF(VLOOKUP(C15,PartnerN°Ref,2,FALSE)=0,\"\",VLOOKUP(C15,PartnerN°Ref,2,FALSE)),\"\")","v":"#ERROR!"},{"$f":"IFERROR(IF(OR(VLOOKUP(C15,PartnerN°Ref,4,FALSE)=\"Country not found\",VLOOKUP(C15,PartnerN°Ref,3,FALSE)=0),\"\",VLOOKUP(C15,PartnerN°Ref,3,FALSE)),\"\")","v":"#ERROR!"},3.0,{"$f":"IF(T61=\"Error\",0,INDEX(Rates,MATCH(E61,CountryALL,0),MATCH($F$11,Category,0)))","v":"#ERROR!"},0,58.0,{"$f":"IF(T61=\"Error\",0,INDEX(Rates,MATCH(E61,CountryALL,0),MATCH($I$11,Category,0)))","v":"#ERROR!"},0,0.0,{"$f":"IF(T61=\"Error\",0,INDEX(Rates,MATCH(E61,CountryALL,0),MATCH($L$11,Category,0)))","v":"#ERROR!"},0,0.0,{"$f":"IF(T61=\"Error\",0,INDEX(Rates,MATCH(E61,CountryALL,0),MATCH($O$11,Category,0)))","v":"#ERROR!"},0,"#ERROR!","#ERROR!",{"$f":"IF(OR(COUNTIF(WorkPackage,B15)=0,COUNTIF(PartnerN°,C15)=0,D15=\"\",COUNTIF(CountryALL,E15)=0,ISNUMBER(F15)=FALSE,ISNUMBER(I15)=FALSE,ISNUMBER(L15)=FALSE,ISNUMBER(O15)=FALSE,IF(ISNUMBER(F15)=TRUE,F15=INT(F15*10)/10=FALSE),IF(ISNUMBER(I15)=TRUE,I15=INT(I15*10)/10=FALSE),IF(ISNUMBER(L15)=TRUE,L15=INT(L15*10)/10=FALSE),IF(ISNUMBER(O15)=TRUE,O15=INT(O15*10)/10=FALSE)),\"Error\",\"\")","v":"#ERROR!"}]
[null,"Management","P1",{"$f":"IFERROR(IF(VLOOKUP(C15,PartnerN°Ref,2,FALSE)=0,\"\",VLOOKUP(C15,PartnerN°Ref,2,FALSE)),\"\")","v":"#ERROR!"},{"$f":"IFERROR(IF(OR(VLOOKUP(C15,PartnerN°Ref,4,FALSE)=\"Country not found\",VLOOKUP(C15,PartnerN°Ref,3,FALSE)=0),\"\",VLOOKUP(C15,PartnerN°Ref,3,FALSE)),\"\")","v":"#ERROR!"},16.0,{"$f":"IF(T62=\"Error\",0,INDEX(Rates,MATCH(E62,CountryALL,0),MATCH($F$11,Category,0)))","v":"#ERROR!"},0,65.0,{"$f":"IF(T62=\"Error\",0,INDEX(Rates,MATCH(E62,CountryALL,0),MATCH($I$11,Category,0)))","v":"#ERROR!"},0,0.0,{"$f":"IF(T62=\"Error\",0,INDEX(Rates,MATCH(E62,CountryALL,0),MATCH($L$11,Category,0)))","v":"#ERROR!"},0,43.0,{"$f":"IF(T62=\"Error\",0,INDEX(Rates,MATCH(E62,CountryALL,0),MATCH($O$11,Category,0)))","v":"#ERROR!"},0,"#ERROR!","#ERROR!",{"$f":"IF(OR(COUNTIF(WorkPackage,B15)=0,COUNTIF(PartnerN°,C15)=0,D15=\"\",COUNTIF(CountryALL,E15)=0,ISNUMBER(F15)=FALSE,ISNUMBER(I15)=FALSE,ISNUMBER(L15)=FALSE,ISNUMBER(O15)=FALSE,IF(ISNUMBER(F15)=TRUE,F15=INT(F15*10)/10=FALSE),IF(ISNUMBER(I15)=TRUE,I15=INT(I15*10)/10=FALSE),IF(ISNUMBER(L15)=TRUE,L15=INT(L15*10)/10=FALSE),IF(ISNUMBER(O15)=TRUE,O15=INT(O15*10)/10=FALSE)),\"Error\",\"\")","v":"#ERROR!"}]
[null,"Management","P2",{"$f":"IFERROR(IF(VLOOKUP(C15,PartnerN°Ref,2,FALSE)=0,\"\",VLOOKUP(C15,PartnerN°Ref,2,FALSE)),\"\")","v":"#ERROR!"},{"$f":"IFERROR(IF(OR(VLOOKUP(C15,PartnerN°Ref,4,FALSE)=\"Country not found\",VLOOKUP(C15,PartnerN°Ref,3,FALSE)=0),\"\",VLOOKUP(C15,PartnerN°Ref,3,FALSE)),\"\")","v":"#ERROR!"},8.0,{"$f":"IF(T63=\"Error\",0,INDEX(Rates,MATCH(E63,CountryALL,0),MATCH($F$11,Category,0)))","v":"#ERROR!"},0,25.0,{"$f":"IF(T63=\"Error\",0,INDEX(Rates,MATCH(E63,CountryALL,0),MATCH($I$11,Category,0)))","v":"#ERROR!"},0,0.0,{"$f":"IF(T63=\"Error\",0,INDEX(Rates,MATCH(E63,CountryALL,0),MATCH($L$11,Category,0)))","v":"#ERROR!"},0,26.0,{"$f":"IF(T63=\"Error\",0,INDEX(Rates,MATCH(E63,CountryALL,0),MATCH($O$11,Category,0)))","v":"#ERROR!"},0,"#ERROR!","#ERROR!",{"$f":"IF(OR(COUNTIF(WorkPackage,B15)=0,COUNTIF(PartnerN°,C15)=0,D15=\"\",COUNTIF(CountryALL,E15)=0,ISNUMBER(F15)=FALSE,ISNUMBER(I15)=FALSE,ISNUMBER(L15)=FALSE,ISNUMBER(O15)=FALSE,IF(ISNUMBER(F15)=TRUE,F15=INT(F15*10)/10=FALSE),IF(ISNUMBER(I15)=TRUE,I15=INT(I15*10)/10=FALSE),IF(ISNUMBER(L15)=TRUE,L15=INT(L15*10)/10=FALSE),IF(ISNUMBER(O15)=TRUE,O15=INT(O15*10)/10=FALSE)),\"Error\",\"\")","v":"#ERROR!"}]
[null,"Management","P3",{"$f":"IFERROR(IF(VLOOKUP(C15,PartnerN°Ref,2,FALSE)=0,\"\",VLOOKUP(C15,PartnerN°Ref,2,FALSE)),\"\")","v":"#ERROR!"},{"$f":"IFERROR(IF(OR(VLOOKUP(C15,PartnerN°Ref,4,FALSE)=\"Country not found\",VLOOKUP(C15,PartnerN°Ref,3,FALSE)=0),\"\",VLOOKUP(C15,PartnerN°Ref,3,FALSE)),\"\")","v":"#ERROR!"},11.0,{"$f":"IF(T64=\"Error\",0,INDEX(Rates,MATCH(E64,CountryALL,0),MATCH($F$11,Category,0)))","v":"#ERROR!"},0,25.0,{"$f":"IF(T64=\"Error\",0,INDEX(Rates,MATCH(E64,CountryALL,0),MATCH($I$11,Category,0)))","v":"#ERROR!"},0,0.0,{"$f":"IF(T64=\"Error\",0,INDEX(Rates,MATCH(E64,CountryALL,0),MATCH($L$11,Category,0)))","v":"#ERROR!"},0,18.0,{"$f":"IF(T64=\"Error\",0,INDEX(Rates,MATCH(E64,CountryALL,0),MATCH($O$11,Category,0)))","v":"#ERROR!"},0,"#ERROR!","#ERROR!",{"$f":"IF(OR(COUNTIF(WorkPackage,B15)=0,COUNTIF(PartnerN°,C15)=0,D15=\"\",COUNTIF(CountryALL,E15)=0,ISNUMBER(F15)=FALSE,ISNUMBER(I15)=FALSE,ISNUMBER(L15)=FALSE,ISNUMBER(O15)=FALSE,IF(ISNUMBER(F15)=TRUE,F15=INT(F15*10)/10=FALSE),IF(ISNUMBER(I15)=TRUE,I15=INT(I15*10)/10=FALSE),IF(ISNUMBER(L15)=TRUE,L15=INT(L15*10)/10=FALSE),IF(ISNUMBER(O15)=TRUE,O15=INT(O15*10)/10=FALSE)),\"Error\",\"\")","v":"#ERROR!"}]
[null,"Management","P4",{"$f":"IFERROR(IF(VLOOKUP(C15,PartnerN°Ref,2,FALSE)=0,\"\",VLOOKUP(C15,PartnerN°Ref,2,FALSE)),\"\")","v":"#ERROR!"},{"$f":"IFERROR(IF(OR(VLOOKUP(C15,PartnerN°Ref,4,FALSE)=\"Country not found\",VLOOKUP(C15,PartnerN°Ref,3,FALSE)=0),\"\",VLOOKUP(C15,PartnerN°Ref,3,FALSE)),\"\")","v":"#ERROR!"},11.0,{"$f":"IF(T65=\"Error\",0,INDEX(Rates,MATCH(E65,CountryALL,0),MATCH($F$11,Category,0)))","v":"#ERROR!"},0,25.0,{"$f":"IF(T65=\"Error\",0,INDEX(Rates,MATCH(E65,CountryALL,0),MATCH($I$11,Category,0)))","v":"#ERROR!"},0,0.0,{"$f":"IF(T65=\"Error\",0,INDEX(Rates,MATCH(E65,CountryALL,0),MATCH($L$11,Category,0)))","v":"#ERROR!"},0,18.0,{"$f":"IF(T65=\"Error\",0,INDEX(Rates,MATCH(E65,CountryALL,0),MATCH($O$11,Category,0)))","v":"#ERROR!"},0,"#ERROR!","#ERROR!",{"$f":"IF(OR(COUNTIF(WorkPackage,B15)=0,COUNTIF(PartnerN°,C15)=0,D15=\"\",COUNTIF(CountryALL,E15)=0,ISNUMBER(F15)=FALSE,ISNUMBER(I15)=FALSE,ISNUMBER(L15)=FALSE,ISNUMBER(O15)=FALSE,IF(ISNUMBER(F15)=TRUE,F15=INT(F15*10)/10=FALSE),IF(ISNUMBER(I15)=TRUE,I15=INT(I15*10)/10=FALSE),IF(ISNUMBER(L15)=TRUE,L15=INT(L15*10)/10=FALSE),IF(ISNUMBER(O15)=TRUE,O15=INT(O15*10)/10=FALSE)),\"Error\",\"\")","v":"#ERROR!"}]
[null,"Management","P5",{"$f":"IFERROR(IF(VLOOKUP(C15,PartnerN°Ref,2,FALSE)=0,\"\",VLOOKUP(C15,PartnerN°Ref,2,FALSE)),\"\")","v":"#ERROR!"},{"$f":"IFERROR(IF(OR(VLOOKUP(C15,PartnerN°Ref,4,FALSE)=\"Country not found\",VLOOKUP(C15,PartnerN°Ref,3,FALSE)=0),\"\",VLOOKUP(C15,PartnerN°Ref,3,FALSE)),\"\")","v":"#ERROR!"},11.0,{"$f":"IF(T66=\"Error\",0,INDEX(Rates,MATCH(E66,CountryALL,0),MATCH($F$11,Category,0)))","v":"#ERROR!"},0,25.0,{"$f":"IF(T66=\"Error\",0,INDEX(Rates,MATCH(E66,CountryALL,0),MATCH($I$11,Category,0)))","v":"#ERROR!"},0,0.0,{"$f":"IF(T66=\"Error\",0,INDEX(Rates,MATCH(E66,CountryALL,0),MATCH($L$11,Category,0)))","v":"#ERROR!"},0,28.0,{"$f":"IF(T66=\"Error\",0,INDEX(Rates,MATCH(E66,CountryALL,0),MATCH($O$11,Category,0)))","v":"#ERROR!"},0,"#ERROR!","#ERROR!",{"$f":"IF(OR(COUNTIF(WorkPackage,B15)=0,COUNTIF(PartnerN°,C15)=0,D15=\"\",COUNTIF(CountryALL,E15)=0,ISNUMBER(F15)=FALSE,ISNUMBER(I15)=FALSE,ISNUMBER(L15)=FALSE,ISNUMBER(O15)=FALSE,IF(ISNUMBER(F15)=TRUE,F15=INT(F15*10)/10=FALSE),IF(ISNUMBER(I15)=TRUE,I15=INT(I15*10)/10=FALSE),IF(ISNUMBER(L15)=TRUE,L15=INT(L15*10)/10=FALSE),IF(ISNUMBER(O15)=TRUE,O15=INT(O15*10)/10=FALSE)),\"Error\",\"\")","v":"#ERROR!"}]
[null,"Management","P6",{"$f":"IFERROR(IF(VLOOKUP(C15,PartnerN°Ref,2,FALSE)=0,\"\",VLOOKUP(C15,PartnerN°Ref,2,FALSE)),\"\")","v":"#ERROR!"},{"$f":"IFERROR(IF(OR(VLOOKUP(C15,PartnerN°Ref,4,FALSE)=\"Country not found\",VLOOKUP(C15,PartnerN°Ref,3,FALSE)=0),\"\",VLOOKUP(C15,PartnerN°Ref,3,FALSE)),\"\")","v":"#ERROR!"},11.0,{"$f":"IF(T67=\"Error\",0,INDEX(Rates,MATCH(E67,CountryALL,0),MATCH($F$11,Category,0)))","v":"#ERROR!"},0,25.0,{"$f":"IF(T67=\"Error\",0,INDEX(Rates,MATCH(E67,CountryALL,0),MATCH($I$11,Category,0)))","v":"#ERROR!"},0,0.0,{"$f":"IF(T67=\"Error\",0,INDEX(Rates,MATCH(E67,CountryALL,0),MATCH($L$11,Category,0)))","v":"#ERROR!"},0,28.0,{"$f":"IF(T67=\"Error\",0,INDEX(Rates,MATCH(E67,CountryALL,0),MATCH($O$11,Category,0)))","v":"#ERROR!"},0,"#ERROR!","#ERROR!",{"$f":"IF(OR(COUNTIF(WorkPackage,B15)=0,COUNTIF(PartnerN°,C15)=0,D15=\"\",COUNTIF(CountryALL,E15)=0,ISNUMBER(F15)=FALSE,ISNUMBER(I15)=FALSE,ISNUMBER(L15)=FALSE,ISNUMBER(O15)=FALSE,IF(ISNUMBER(F15)=TRUE,F15=INT(F15*10)/10=FALSE),IF(ISNUMBER(I15)=TRUE,I15=INT(I15*10)/10=FALSE),IF(ISNUMBER(L15)=TRUE,L15=INT(L15*10)/10=FALSE),IF(ISNUMBER(O15)=TRUE,O15=INT(O15*10)/10=FALSE)),\"Error\",\"\")","v":"#ERROR!"}]
[null,"Management","P7",{"$f":"IFERROR(IF(VLOOKUP(C15,PartnerN°Ref,2,FALSE)=0,\"\",VLOOKUP(C15,PartnerN°Ref,2,FALSE)),\"\")","v":"#ERROR!"},{"$f":"IFERROR(IF(OR(VLOOKUP(C15,PartnerN°Ref,4,FALSE)=\"Country not found\",VLOOKUP(C15,PartnerN°Ref,3,FALSE)=0),\"\",VLOOKUP(C15,PartnerN°Ref,3,FALSE)),\"\")","v":"#ERROR!"},11.0,{"$f":"IF(T68=\"Error\",0,INDEX(Rates,MATCH(E68,CountryALL,0),MATCH($F$11,Category,0)))","v":"#ERROR!"},0,25.0,{"$f":"IF(T68=\"Error\",0,INDEX(Rates,MATCH(E68,CountryALL,0),MATCH($I$11,Category,0)))","v":"#ERROR!"},0,0.0,{"$f":"IF(T68=\"Error\",0,INDEX(Rates,MATCH(E68,CountryALL,0),MATCH($L$11,Category,0)))","v":"#ERROR!"},0,28.0,{"$f":"IF(T68=\"Error\",0,INDEX(Rates,MATCH(E68,CountryALL,0),MATCH($O$11,Category,0)))","v":"#ERROR!"},0,"#ERROR!","#ERROR!",{"$f":"IF(OR(COUNTIF(WorkPackage,B15)=0,COUNTIF(PartnerN°,C15)=0,D15=\"\",COUNTIF(CountryALL,E15)=0,ISNUMBER(F15)=FALSE,ISNUMBER(I15)=FALSE,ISNUMBER(L15)=FALSE,ISNUMBER(O15)=FALSE,IF(ISNUMBER(F15)=TRUE,F15=INT(F15*10)/10=FALSE),IF(ISNUMBER(I15)=TRUE,I15=INT(I15*10)/10=FALSE),IF(ISNUMBER(L15)=TRUE,L15=INT(L15*10)/10=FALSE),IF(ISNUMBER(O15)=TRUE,O15=INT(O15*10)/10=FALSE)),\"Error\",\"\")","v":"#ERROR!"}]
[null,"Management","P8",{"$f":"IFERROR(IF(VLOOKUP(C15,PartnerN°Ref,2,FALSE)=0,\"\",VLOOKUP(C15,PartnerN°Ref,2,FALSE)),\"\")","v":"#ERROR!"},{"$f":"IFERROR(IF(OR(VLOOKUP(C15,PartnerN°Ref,4,FALSE)=\"Country not found\",VLOOKUP(C15,PartnerN°Ref,3,FALSE)=0),\"\",VLOOKUP(C15,PartnerN°Ref,3,FALSE)),\"\")","v":"#ERROR!"},13.0,{"$f":"IF(T69=\"Error\",0,INDEX(Rates,MATCH(E69,CountryALL,0),MATCH($F$11,Category,0)))","v":"#ERROR!"},0,25.0,{"$f":"IF(T69=\"Error\",0,INDEX(Rates,MATCH(E69,CountryALL,0),MATCH($I$11,Category,0)))","v":"#ERROR!"},0,0.0,{"$f":"IF(T69=\"Error\",0,INDEX(Rates,MATCH(E69,CountryALL,0),MATCH($L$11,Category,0)))","v":"#ERROR!"},0,33.0,{"$f":"IF(T69=\"Error\",0,INDEX(Rates,MATCH(E69,CountryALL,0),MATCH($O$11,Category,0)))","v":"#ERROR!"},0,"#ERROR!","#ERROR!",{"$f":"IF(OR(COUNTIF(WorkPackage,B15)=0,COUNTIF(PartnerN°,C15)=0,D15=\"\",COUNTIF(CountryALL,E15)=0,ISNUMBER(F15)=FALSE,ISNUMBER(I15)=FALSE,ISNUMBER(L15)=FALSE,ISNUMBER(O15)=FALSE,IF(ISNUMBER(F15)=TRUE,F15=INT(F15*10)/10=FALSE),IF(ISNUMBER(I15)=TRUE,I15=INT(I15*10)/10=FALSE),IF(ISNUMBER(L15)=TRUE,L15=INT(L15*10)/10=FALSE),IF(ISNUMBER(O15)=TRUE,O15=INT(O15*10)/10=FALSE)),\"Error\",\"\")","v":"#ERROR!"}]
[null,"Management","P9",{"$f":"IFERROR(IF(VLOOKUP(C15,PartnerN°Ref,2,FALSE)=0,\"\",VLOOKUP(C15,PartnerN°Ref,2,FALSE)),\"\")","v":"#ERROR!"},{"$f":"IFERROR(IF(OR(VLOOKUP(C15,PartnerN°Ref,4,FALSE)=\"Country not found\",VLOOKUP(C15,PartnerN°Ref,3,FALSE)=0),\"\",VLOOKUP(C15,PartnerN°Ref,3,FALSE)),\"\")","v":"#ERROR!"},18.0,{"$f":"IF(T70=\"Error\",0,INDEX(Rates,MATCH(E70,CountryALL,0),MATCH($F$11,Category,0)))","v":"#ERROR!"},0,33.0,{"$f":"IF(T70=\"Error\",0,INDEX(Rates,MATCH(E70,CountryALL,0),MATCH($I$11,Category,0)))","v":"#ERROR!"},0,0.0,{"$f":"IF(T70=\"Error\",0,INDEX(Rates,MATCH(E70,CountryALL,0),MATCH($L$11,Category,0)))","v":"#ERROR!"},0,28.0,{"$f":"IF(T70=\"Error\",0,INDEX(Rates,MATCH(E70,CountryALL,0),MATCH($O$11,Category,0)))","v":"#ERROR!"},0,"#ERROR!","#ERROR!",{"$f":"IF(OR(COUNTIF(WorkPackage,B15)=0,COUNTIF(PartnerN°,C15)=0,D15=\"\",COUNTIF(CountryALL,E15)=0,ISNUMBER(F15)=FALSE,ISNUMBER(I15)=FALSE,ISNUMBER(L15)=FALSE,ISNUMBER(O15)=FALSE,IF(ISNUMBER(F15)=TRUE,F15=INT(F15*10)/10=FALSE),IF(ISNUMBER(I15)=TRUE,I15=INT(I15*10)/10=FALSE),IF(ISNUMBER(L15)=TRUE,L15=INT(L15*10)/10=FALSE),IF(ISNUMBER(O15)=TRUE,O15=INT(O15*10)/10=FALSE)),\"Error\",\"\")","v":"#ERROR!"}]
[null,"Management","P10",{"$f":"IFERROR(IF(VLOOKUP(C15,PartnerN°Ref,2,FALSE)=0,\"\",VLOOKUP(C15,PartnerN°Ref,2,FALSE)),\"\")","v":"#ERROR!"},{"$f":"IFERROR(IF(OR(VLOOKUP(C15,PartnerN°Ref,4,FALSE)=\"Country not found\",VLOOKUP(C15,PartnerN°Ref,3,FALSE)=0),\"\",VLOOKUP(C15,PartnerN°Ref,3,FALSE)),\"\")","v":"#ERROR!"},11.0,{"$f":"IF(T71=\"Error\",0,INDEX(Rates,MATCH(E71,CountryALL,0),MATCH($F$11,Category,0)))","v":"#ERROR!"},0,25.0,{"$f":"IF(T71=\"Error\",0,INDEX(Rates,MATCH(E71,CountryALL,0),MATCH($I$11,Category,0)))","v":"#ERROR!"},0,0.0,{"$f":"IF(T71=\"Error\",0,INDEX(Rates,MATCH(E71,CountryALL,0),MATCH($L$11,Category,0)))","v":"#ERROR!"},0,28.0,{"$f":"IF(T71=\"Error\",0,INDEX(Rates,MATCH(E71,CountryALL,0),MATCH($O$11,Category,0)))","v":"#ERROR!"},0,"#ERROR!","#ERROR!",{"$f":"IF(OR(COUNTIF(WorkPackage,B15)=0,COUNTIF(PartnerN°,C15)=0,D15=\"\",COUNTIF(CountryALL,E15)=0,ISNUMBER(F15)=FALSE,ISNUMBER(I15)=FALSE,ISNUMBER(L15)=FALSE,ISNUMBER(O15)=FALSE,IF(ISNUMBER(F15)=TRUE,F15=INT(F15*10)/10=FALSE),IF(ISNUMBER(I15)=TRUE,I15=INT(I15*10)/10=FALSE),IF(ISNUMBER(L15)=TRUE,L15=INT(L15*10)/10=FALSE),IF(ISNUMBER(O15)=TRUE,O15=INT(O15*10)/10=FALSE)),\"Error\",\"\")","v":"#ERROR!"}]
[null,"Management","P11",{"$f":"IFERROR(IF(VLOOKUP(C15,PartnerN°Ref,2,FALSE)=0,\"\",VLOOKUP(C15,PartnerN°Ref,2,FALSE)),\"\")","v":"#ERROR!"},{"$f":"IFERROR(IF(OR(VLOOKUP(C15,PartnerN°Ref,4,FALSE)=\"Country not found\",VLOOKUP(C15,PartnerN°Ref,3,FALSE)=0),\"\",VLOOKUP(C15,PartnerN°Ref,3,FALSE)),\"\")","v":"#ERROR!"},11.0,{"$f":"IF(T72=\"Error\",0,INDEX(Rates,MATCH(E72,CountryALL,0),MATCH($F$11,Category,0)))","v":"#ERROR!"},0,25.0,{"$f":"IF(T72=\"Error\",0,INDEX(Rates,MATCH(E72,CountryALL,0),MATCH($I$11,Category,0)))","v":"#ERROR!"},0,0.0,{"$f":"IF(T72=\"Error\",0,INDEX(Rates,MATCH(E72,CountryALL,0),MATCH($L$11,Category,0)))","v":"#ERROR!"},0,28.0,{"$f":"IF(T72=\"Error\",0,INDEX(Rates,MATCH(E72,CountryALL,0),MATCH($O$11,Category,0)))","v":"#ERROR!"},0,"#ERROR!","#ERROR!",{"$f":"IF(OR(COUNTIF(WorkPackage,B15)=0,COUNTIF(PartnerN°,C15)=0,D15=\"\",COUNTIF(CountryALL,E15)=0,ISNUMBER(F15)=FALSE,ISNUMBER(I15)=FALSE,ISNUMBER(L15)=FALSE,ISNUMBER(O15)=FALSE,IF(ISNUMBER(F15)=TRUE,F15=INT(F15*10)/10=FALSE),IF(ISNUMBER(I15)=TRUE,I15=INT(I15*10)/10=FALSE),IF(ISNUMBER(L15)=TRUE,L15=INT(L15*10)/10=FALSE),IF(ISNUMBER(O15)=TRUE,O15=INT(O15*10)/10=FALSE)),\"Error\",\"\")","v":"#ERROR!"}]
[null,"Management","P12",{"$f":"IFERROR(IF(VLOOKUP(C15,PartnerN°Ref,2,FALSE)=0,\"\",VLOOKUP(C15,PartnerN°Ref,2,FALSE)),\"\")","v":"#ERROR!"},{"$f":"IFERROR(IF(OR(VLOOKUP(C15,PartnerN°Ref,4,FALSE)=\"Country not found\",VLOOKUP(C15,PartnerN°Ref,3,FALSE)=0),\"\",VLOOKUP(C15,PartnerN°Ref,3,FALSE)),\"\")","v":"#ERROR!"},11.0,{"$f":"IF(T73=\"Error\",0,INDEX(Rates,MATCH(E73,CountryALL,0),MATCH($F$11,Category,0)))","v":"#ERROR!"},0,25.0,{"$f":"IF(T73=\"Error\",0,INDEX(Rates,MATCH(E73,CountryALL,0),MATCH($I$11,Category,0)))","v":"#ERROR!"},0,0.0,{"$f":"IF(T73=\"Error\",0,INDEX(Rates,MATCH(E73,CountryALL,0),MATCH($L$11,Category,0)))","v":"#ERROR!"},0,28.0,{"$f":"IF(T73=\"Error\",0,INDEX(Rates,MATCH(E73,CountryALL,0),MATCH($O$11,Category,0)))","v":"#ERROR!"},0,"#ERROR!","#ERROR!",{"$f":"IF(OR(COUNTIF(WorkPackage,B15)=0,COUNTIF(PartnerN°,C15)=0,D15=\"\",COUNTIF(CountryALL,E15)=0,ISNUMBER(F15)=FALSE,ISNUMBER(I15)=FALSE,ISNUMBER(L15)=FALSE,ISNUMBER(O15)=FALSE,IF(ISNUMBER(F15)=TRUE,F15=INT(F15*10)/10=FALSE),IF(ISNUMBER(I15)=TRUE,I15=INT(I15*10)/10=FALSE),IF(ISNUMBER(L15)=TRUE,L15=INT(L15*10)/10=FALSE),IF(ISNUMBER(O15)=TRUE,O15=INT(O15*10)/10=FALSE)),\"Error\",\"\")","v":"#ERROR!"}]

{"sheet":" 2-3-6. Travel&Costs of Stay","index":3,"n_rows":118,"n_cols":18,"rows_kept":118,"cut":false,"hidden":false,"merged":[[4,1,4,2],[5,1,5,2],[5,4,6,4],[5,5,6,5],[6,1,6,2],[7,1,7,2],[7,4,8,4],[7,5,8,5],[8,1,8,2],[9,1,9,2],[1,1,1,17],[2,1,2,17],[3,1,3,2],[3,4,4,4],[3,5,4,5],[3,11,3,13],[4,11,10,13]]}
[]
[null,"2-3. Travel Costs & Costs of Stay"]
[]
[null,"Travel Costs Student (EUR)",null,{"$f":"SUMIF(G:G,\"Student\",O:O)","v":0},{"$f":"D4+D5","v":0},{"$f":"SUMIFS(H:H,G:G,\"Student\",R:R,\"<>Error\")","v":0},null,null,null,null,null,"Exceptional Costs for Expensive Travel"]
[null,"Costs of Stay Student (EUR)",null,{"$f":"SUMIF(G:G,\"Student\",P:P)","v":0},null,null,null,null,null,null,null,"Exceptional costs for expensive travel - including the use of cleaner, lower carbon emission means of transport - can be claimed if for a specific travel, the unit cost amount covers less than 65% of the actual (/real) cost. In such a case, you can claim financial support up to a maximum of 80% of the actual (/real) cost for that travel. If exceptional costs are claimed, please indicate the total estimated cost for the travel(s) concerned. An amount corresponding to 80% of the estimated cost will be automatically calculated and will replace the respective unit cost for the travel(s) concerned. Please note that the need for exceptional costs has to be justified under Section E.3 of the \"Detailed Description of the Project\"."]
[null,"Travel Costs Staff (EUR)",null,{"$f":"SUMIF(G:G,\"Staff\",O:O)","v":"#ERROR!"},{"$f":"D6+D7","v":"#ERROR!"},{"$f":"SUMIFS(H:H,G:G,\"Staff\",R:R,\"<>Error\")","v":292}]
[null,"Costs of Stay Staff (EUR)",null,{"$f":"SUMIF(G:G,\"Staff\",P:P)","v":"#ERROR!"}]
[null,"Total Travel Costs (EUR)",null,{"$f":"SUM(O:O)","v":"#ERROR!"},{"$f":"D8+D9","v":"#ERROR!"},{"$f":"F4+F6","v":292}]
[null,"Total Costs of Stay (EUR)",null,{"$f":"SUM(P:P)","v":"#ERROR!"}]
[null,"Exceptional Cost for Expensive Travel (EUR)",null,{"$f":"SUM(N:N)","v":0}]
[]
[null,"Work\nPackage","Partner \nN°","Name of Partner\n(to encode in overview sheet)","Country\n(to encode in overview sheet)","City of Departure","Student/\nStaff","Number of \nParticipants","City of Destination","Travel Distance","Number of \ndays (per participant)","Please confirm here below if you wish to base the calculation of travel costs on exceptional costs rather than on unit costs.","Estimated Actual Cost of Travel (EUR)","Exceptional Cost for Expensive Travel (EUR)","Travel \nCosts based on Unit Costs\n(EUR)","Costs of\nStay\n(EUR)","Total \n(EUR)","Check\nData\nEncoding"]
[null,null,null,{"$f":"IFERROR(IF(VLOOKUP(C13,PartnerN°Ref,2,FALSE)=0,\"\",VLOOKUP(C13,PartnerN°Ref,2,FALSE)),\"\")","v":"#ERROR!"},{"$f":"IFERROR(IF(OR(VLOOKUP(C13,PartnerN°Ref,4,FALSE)=\"Country not found\",VLOOKUP(C13,PartnerN°Ref,3,FALSE)=0),\"\",VLOOKUP(C13,PartnerN°Ref,3,FALSE)),\"\")","v":"#ERROR!"},null,null,0.0,null,null,null,null,null,{"$f":"IF(AND(M13>0,L13<>\"\"),IF(M13>(ROUND( (ROUND(ROUND(H13,0)*(VLOOKUP(J13,TravelCosts,2,FALSE)),2))/0.65,2)),ROUND(M13*0.8,2),\"covered by unit cost\"),0)","v":0},{"$f":"IF(OR(AND(L13<>\"\",M13>0,ISNUMBER(N13)),R13=\"Error\"),0,ROUND(ROUND(H13,0)*(VLOOKUP(J13,TravelCosts,2,FALSE)),2))","v":"#ERROR!"},{"$f":"IF(R13=\"Error\",0,IF(AND(G13=\"Staff\",K13>0,K13<15),(120*K13)*H13,IF(AND(G13=\"Staff\",K13>14,K13<61),(1680+((K13-14)*70))*H13,IF(AND(G13=\"Staff\",K13>60,K13<91),(4900+((K13-60)*50))*H13,IF(AND(G13=\"Student\",K13>0,K13<15),(55*K13)*H13,IF(AND(G13=\"Student\",K13>14,K13<91),(770+((K13-14)*40))*H13,0))))))","v":"#ERROR!"},{"$f":"IFERROR(N13+O13+P13,O13+P13)","v":"#ERROR!"},{"$f":"IF(OR(COUNTIF(WorkPackage,B13)=0,COUNTIF(PartnerN°,C13)=0,D13=\"\",COUNTIF(CountryALL,E13)=0,F13=\"\",COUNTIF(Category2,G13)=0,ISNUMBER(H13)=FALSE,H13<=0,I13=\"\",COUNTIF(TravelBands,J13)=0,ISNUMBER(K13)=FALSE,OR(K13<0,K13>90),IF(ISNUMBER(H13)=TRUE,H13=INT(H13*1)/1=FALSE),IF(ISNUMBER(K13)=TRUE,K13=INT(K13*1)/1=FALSE),AND(L13<>\"\",M13=0),AND(L13=\"\",M13>0),ISNUMBER(N13)=FALSE ),\"Error\",\"\")","v":"#ERROR!"}]
[null,"Preparation","P1",{"$f":"IFERROR(IF(VLOOKUP(C13,PartnerN°Ref,2,FALSE)=0,\"\",VLOOKUP(C13,PartnerN°Ref,2,FALSE)),\"\")","v":"#ERROR!"},{"$f":"IFERROR(IF(OR(VLOOKUP(C13,PartnerN°Ref,4,FALSE)=\"Country not found\",VLOOKUP(C13,PartnerN°Ref,3,FALSE)=0),\"\",VLOOKUP(C13,PartnerN°Ref,3,FALSE)),\"\")","v":"#ERROR!"},"Rome","Staff",3.0,"Turku","2000 KM and 2999 KM",5.0,null,null,{"$f":"IF(AND(M14>0,L14<>\"\"),IF(M14>(ROUND( (ROUND(ROUND(H14,0)*(VLOOKUP(J14,TravelCosts,2,FALSE)),2))/0.65,2)),ROUND(M14*0.8,2),\"covered by unit cost\"),0)","v":0},{"$f":"IF(OR(AND(L14<>\"\",M14>0,ISNUMBER(N14)),R14=\"Error\"),0,ROUND(ROUND(H14,0)*(VLOOKUP(J14,TravelCosts,2,FALSE)),2))","v":"#ERROR!"},"#ERROR!","#ERROR!",{"$f":"IF(OR(COUNTIF(WorkPackage,B13)=0,COUNTIF(PartnerN°,C13)=0,D13=\"\",COUNTIF(CountryALL,E13)=0,F13=\"\",COUNTIF(Category2,G13)=0,ISNUMBER(H13)=FALSE,H13<=0,I13=\"\",COUNTIF(TravelBands,J13)=0,ISNUMBER(K13)=FALSE,OR(K13<0,K13>90),IF(ISNUMBER(H13)=TRUE,H13=INT(H13*1)/1=FALSE),IF(ISNUMBER(K13)=TRUE,K13=INT(K13*1)/1=FALSE),AND(L13<>\"\",M13=0),AND(L13=\"\",M13>0),ISNUMBER(N13)=FALSE ),\"Error\",\"\")","v":"#ERROR!"}]
[null,"Preparation","P3",{"$f":"IFERROR(IF(VLOOKUP(C15,PartnerN°Ref,2,FALSE)=0,\"\",VLOOKUP(C15,PartnerN°Ref,2,FALSE)),\"\")","v":"#ERROR!"},{"$f":"IFERROR(IF(OR(VLOOKUP(C15,PartnerN°Ref,4,FALSE)=\"Country not found\",VLOOKUP(C15,PartnerN°Ref,3,FALSE)=0),\"\",VLOOKUP(C15,PartnerN°Ref,3,FALSE)),\"\")","v":"#ERROR!"},"Lisbon","Staff",3.0,"Turku","3000 KM and 3999 KM",5.0,null,null,{"$f":"IF(AND(M15>0,L15<>\"\"),IF(M15>(ROUND( (ROUND(ROUND(H15,0)*(VLOOKUP(J15,TravelCosts,2,FALSE)),2))/0.65,2)),ROUND(M15*0.8,2),\"covered by unit cost\"),0)","v":0},{"$f":"IF(OR(AND(L15<>\"\",M15>0,ISNUMBER(N15)),R15=\"Error\"),0,ROUND(ROUND(H15,0)*(VLOOKUP(J15,TravelCosts,2,FALSE)),2))","v":"#ERROR!"},"#ERROR!","#ERROR!",{"$f":"IF(OR(COUNTIF(WorkPackage,B13)=0,COUNTIF(PartnerN°,C13)=0,D13=\"\",COUNTIF(CountryALL,E13)=0,F13=\"\",COUNTIF(Category2,G13)=0,ISNUMBER(H13)=FALSE,H13<=0,I13=\"\",COUNTIF(TravelBands,J13)=0,ISNUMBER(K13)=FALSE,OR(K13<0,K13>90),IF(ISNUMBER(H13)=TRUE,H13=INT(H13*1)/1=FALSE),IF(ISNUMBER(K13)=TRUE,K13=INT(K13*1)/1=FALSE),AND(L13<>\"\",M13=0),AND(L13=\"\",M13>0),ISNUMBER(N13)=FALSE ),\"Error\",\"\")","v":"#ERROR!"}]
[null,"Preparation","P4",{"$f":"IFERROR(IF(VLOOKUP(C15,PartnerN°Ref,2,FALSE)=0,\"\",VLOOKUP(C15,PartnerN°Ref,2,FALSE)),\"\")","v":"#ERROR!"},{"$f":"IFERROR(IF(OR(VLOOKUP(C15,PartnerN°Ref,4,FALSE)=\"Country not found\",VLOOKUP(C15,PartnerN°Ref,3,FALSE)=0),\"\",VLOOKUP(C15,PartnerN°Ref,3,FALSE)),\"\")","v":"#ERROR!"},"Alexandrooulus","Staff",3.0,"Turku","2000 KM and 2999 KM",5.0,null,null,{"$f":"IF(AND(M16>0,L16<>\"\"),IF(M16>(ROUND( (ROUND(ROUND(H16,0)*(VLOOKUP(J16,TravelCosts,2,FALSE)),2))/0.65,2)),ROUND(M16*0.8,2),\"covered by unit cost\"),0)","v":0},{"$f":"IF(OR(AND(L16<>\"\",M16>0,ISNUMBER(N16)),R16=\"Error\"),0,ROUND(ROUND(H16,0)*(VLOOKUP(J16,TravelCosts,2,FALSE)),2))","v":"#ERROR!"},"#ERROR!","#ERROR!",{"$f":"IF(OR(COUNTIF(WorkPackage,B13)=0,COUNTIF(PartnerN°,C13)=0,D13=\"\",COUNTIF(CountryALL,E13)=0,F13=\"\",COUNTIF(Category2,G13)=0,ISNUMBER(H13)=FALSE,H13<=0,I13=\"\",COUNTIF(TravelBands,J13)=0,ISNUMBER(K13)=FALSE,OR(K13<0,K13>90),IF(ISNUMBER(H13)=TRUE,H13=INT(H13*1)/1=FALSE),IF(ISNUMBER(K13)=TRUE,K13=INT(K13*1)/1=FALSE),AND(L13<>\"\",M13=0),AND(L13=\"\",M13>0),ISNUMBER(N13)=FALSE ),\"Error\",\"\")","v":"#ERROR!"}]
[null,"Preparation","P5",{"$f":"IFERROR(IF(VLOOKUP(C15,PartnerN°Ref,2,FALSE)=0,\"\",VLOOKUP(C15,PartnerN°Ref,2,FALSE)),\"\")","v":"#ERROR!"},{"$f":"IFERROR(IF(OR(VLOOKUP(C15,PartnerN°Ref,4,FALSE)=\"Country not found\",VLOOKUP(C15,PartnerN°Ref,3,FALSE)=0),\"\",VLOOKUP(C15,PartnerN°Ref,3,FALSE)),\"\")","v":"#ERROR!"},"Qazvin","Staff",3.0,"Turku","3000 KM and 3999 KM",5.0,null,null,{"$f":"IF(AND(M17>0,L17<>\"\"),IF(M17>(ROUND( (ROUND(ROUND(H17,0)*(VLOOKUP(J17,TravelCosts,2,FALSE)),2))/0.65,2)),ROUND(M17*0.8,2),\"covered by unit cost\"),0)","v":0},{"$f":"IF(OR(AND(L17<>\"\",M17>0,ISNUMBER(N17)),R17=\"Error\"),0,ROUND(ROUND(H17,0)*(VLOOKUP(J17,TravelCosts,2,FALSE)),2))","v":"#ERROR!"},"#ERROR!","#ERROR!",{"$f":"IF(OR(COUNTIF(WorkPackage,B13)=0,COUNTIF(PartnerN°,C13)=0,D13=\"\",COUNTIF(CountryALL,E13)=0,F13=\"\",COUNTIF(Category2,G13)=0,ISNUMBER(H13)=FALSE,H13<=0,I13=\"\",COUNTIF(TravelBands,J13)=0,ISNUMBER(K13)=FALSE,OR(K13<0,K13>90),IF(ISNUMBER(H13)=TRUE,H13=INT(H13*1)/1=FALSE),IF(ISNUMBER(K13)=TRUE,K13=INT(K13*1)/1=FALSE),AND(L13<>\"\",M13=0),AND(L13=\"\",M13>0),ISNUMBER(N13)=FALSE ),\"Error\",\"\")","v":"#ERROR!"}]
[null,"Preparation","P6",{"$f":"IFERROR(IF(VLOOKUP(C15,PartnerN°Ref,2,FALSE)=0,\"\",VLOOKUP(C15,PartnerN°Ref,2,FALSE)),\"\")","v":"#ERROR!"},{"$f":"IFERROR(IF(OR(VLOOKUP(C15,PartnerN°Ref,4,FALSE)=\"Country not found\",VLOOKUP(C15,PartnerN°Ref,3,FALSE)=0),\"\",VLOOKUP(C15,PartnerN°Ref,3,FALSE)),\"\")","v":"#ERROR!"},"Zahedan ","Staff",3.0,"Turku","4000 KM and 7999 KM",5.0,null,null,{"$f":"IF(AND(M18>0,L18<>\"\"),IF(M18>(ROUND( (ROUND(ROUND(H18,0)*(VLOOKUP(J18,TravelCosts,2,FALSE)),2))/0.65,2)),ROUND(M18*0.8,2),\"covered by unit cost\"),0)","v":0},{"$f":"IF(OR(AND(L18<>\"\",M18>0,ISNUMBER(N18)),R18=\"Error\"),0,ROUND(ROUND(H18,0)*(VLOOKUP(J18,TravelCosts,2,FALSE)),2))","v":"#ERROR!"},"#ERROR!","#ERROR!",{"$f":"IF(OR(COUNTIF(WorkPackage,B13)=0,COUNTIF(PartnerN°,C13)=0,D13=\"\",COUNTIF(CountryALL,E13)=0,F13=\"\",COUNTIF(Category2,G13)=0,ISNUMBER(H13)=FALSE,H13<=0,I13=\"\",COUNTIF(TravelBands,J13)=0,ISNUMBER(K13)=FALSE,OR(K13<0,K13>90),IF(ISNUMBER(H13)=TRUE,H13=INT(H13*1)/1=FALSE),IF(ISNUMBER(K13)=TRUE,K13=INT(K13*1)/1=FALSE),AND(L13<>\"\",M13=0),AND(L13=\"\",M13>0),ISNUMBER(N13)=FALSE ),\"Error\",\"\")","v":"#ERROR!"}]
[null,"Preparation","P7",{"$f":"IFERROR(IF(VLOOKUP(C15,PartnerN°Ref,2,FALSE)=0,\"\",VLOOKUP(C15,PartnerN°Ref,2,FALSE)),\"\")","v":"#ERROR!"},{"$f":"IFERROR(IF(OR(VLOOKUP(C15,PartnerN°Ref,4,FALSE)=\"Country not found\",VLOOKUP(C15,PartnerN°Ref,3,FALSE)=0),\"\",VLOOKUP(C15,PartnerN°Ref,3,FALSE)),\"\")","v":"#ERROR!"},"Shiraz","Staff",3.0,"Turku","4000 KM and 7999 KM",5.0,null,null,{"$f":"IF(AND(M19>0,L19<>\"\"),IF(M19>(ROUND( (ROUND(ROUND(H19,0)*(VLOOKUP(J19,TravelCosts,2,FALSE)),2))/0.65,2)),ROUND(M19*0.8,2),\"covered by unit cost\"),0)","v":0},{"$f":"IF(OR(AND(L19<>\"\",M19>0,ISNUMBER(N19)),R19=\"Error\"),0,ROUND(ROUND(H19,0)*(VLOOKUP(J19,TravelCosts,2,FALSE)),2))","v":"#ERROR!"},"#ERROR!","#ERROR!",{"$f":"IF(OR(COUNTIF(WorkPackage,B13)=0,COUNTIF(PartnerN°,C13)=0,D13=\"\",COUNTIF(CountryALL,E13)=0,F13=\"\",COUNTIF(Category2,G13)=0,ISNUMBER(H13)=FALSE,H13<=0,I13=\"\",COUNTIF(TravelBands,J13)=0,ISNUMBER(K13)=FALSE,OR(K13<0,K13>90),IF(ISNUMBER(H13)=TRUE,H13=INT(H13*1)/1=FALSE),IF(ISNUMBER(K13)=TRUE,K13=INT(K13*1)/1=FALSE),AND(L13<>\"\",M13=0),AND(L13=\"\",M13>0),ISNUMBER(N13)=FALSE ),\"Error\",\"\")","v":"#ERROR!"}]
[null,"Preparation","P8",{"$f":"IFERROR(IF(VLOOKUP(C15,PartnerN°Ref,2,FALSE)=0,\"\",VLOOKUP(C15,PartnerN°Ref,2,FALSE)),\"\")","v":"#ERROR!"},{"$f":"IFERROR(IF(OR(VLOOKUP(C15,PartnerN°Ref,4,FALSE)=\"Country not found\",VLOOKUP(C15,PartnerN°Ref,3,FALSE)=0),\"\",VLOOKUP(C15,PartnerN°Ref,3,FALSE)),\"\")","v":"#ERROR!"},"Isfahan ","Staff",3.0,"Turku","3000 KM and 3999 KM",5.0,null,null,{"$f":"IF(AND(M20>0,L20<>\"\"),IF(M20>(ROUND( (ROUND(ROUND(H20,0)*(VLOOKUP(J20,TravelCosts,2,FALSE)),2))/0.65,2)),ROUND(M20*0.8,2),\"covered by unit cost\"),0)","v":0},{"$f":"IF(OR(AND(L20<>\"\",M20>0,ISNUMBER(N20)),R20=\"Error\"),0,ROUND(ROUND(H20,0)*(VLOOKUP(J20,TravelCosts,2,FALSE)),2))","v":"#ERROR!"},"#ERROR!","#ERROR!",{"$f":"IF(OR(COUNTIF(WorkPackage,B13)=0,COUNTIF(PartnerN°,C13)=0,D13=\"\",COUNTIF(CountryALL,E13)=0,F13=\"\",COUNTIF(Category2,G13)=0,ISNUMBER(H13)=FALSE,H13<=0,I13=\"\",COUNTIF(TravelBands,J13)=0,ISNUMBER(K13)=FALSE,OR(K13<0,K13>90),IF(ISNUMBER(H13)=TRUE,H13=INT(H13*1)/1=FALSE),IF(ISNUMBER(K13)=TRUE,K13=INT(K13*1)/1=FALSE),AND(L13<>\"\",M13=0),AND(L13=\"\",M13>0),ISNUMBER(N13)=FALSE ),\"Error\",\"\")","v":"#ERROR!"}]
[null,"Preparation","P9",{"$f":"IFERROR(IF(VLOOKUP(C15,PartnerN°Ref,2,FALSE)=0,\"\",VLOOKUP(C15,PartnerN°Ref,2,FALSE)),\"\")","v":"#ERROR!"},{"$f":"IFERROR(IF(OR(VLOOKUP(C15,PartnerN°Ref,4,FALSE)=\"Country not found\",VLOOKUP(C15,PartnerN°Ref,3,FALSE)=0),\"\",VLOOKUP(C15,PartnerN°Ref,3,FALSE)),\"\")","v":"#ERROR!"},"Tehran ","Staff",3.0,"Turku","3000 KM and 3999 KM",5.0,null,null,{"$f":"IF(AND(M21>0,L21<>\"\"),IF(M21>(ROUND( (ROUND(ROUND(H21,0)*(VLOOKUP(J21,TravelCosts,2,FALSE)),2))/0.65,2)),ROUND(M21*0.8,2),\"covered by unit cost\"),0)","v":0},{"$f":"IF(OR(AND(L21<>\"\",M21>0,ISNUMBER(N21)),R21=\"Error\"),0,ROUND(ROUND(H21,0)*(VLOOKUP(J21,TravelCosts,2,FALSE)),2))","v":"#ERROR!"},"#ERROR!","#ERROR!",{"$f":"IF(OR(COUNTIF(WorkPackage,B13)=0,COUNTIF(PartnerN°,C13)=0,D13=\"\",COUNTIF(CountryALL,E13)=0,F13=\"\",COUNTIF(Category2,G13)=0,ISNUMBER(H13)=FALSE,H13<=0,I13=\"\",COUNTIF(TravelBands,J13)=0,ISNUMBER(K13)=FALSE,OR(K13<0,K13>90),IF(ISNUMBER(H13)=TRUE,H13=INT(H13*1)/1=FALSE),IF(ISNUMBER(K13)=TRUE,K13=INT(K13*1)/1=FALSE),AND(L13<>\"\",M13=0),AND(L13=\"\",M13>0),ISNUMBER(N13)=FALSE ),\"Error\",\"\")","v":"#ERROR!"}]
[null,"Preparation","P10",{"$f":"IFERROR(IF(VLOOKUP(C15,PartnerN°Ref,2,FALSE)=0,\"\",VLOOKUP(C15,PartnerN°Ref,2,FALSE)),\"\")","v":"#ERROR!"},{"$f":"IFERROR(IF(OR(VLOOKUP(C15,PartnerN°Ref,4,FALSE)=\"Country not found\",VLOOKUP(C15,PartnerN°Ref,3,FALSE)=0),\"\",VLOOKUP(C15,PartnerN°Ref,3,FALSE)),\"\")","v":"#ERROR!"},"Ahvaz","Staff",3.0,"Turku","3000 KM and 3999 KM",5.0,null,null,{"$f":"IF(AND(M22>0,L22<>\"\"),IF(M22>(ROUND( (ROUND(ROUND(H22,0)*(VLOOKUP(J22,TravelCosts,2,FALSE)),2))/0.65,2)),ROUND(M22*0.8,2),\"covered by unit cost\"),0)","v":0},{"$f":"IF(OR(AND(L22<>\"\",M22>0,ISNUMBER(N22)),R22=\"Error\"),0,ROUND(ROUND(H22,0)*(VLOOKUP(J22,TravelCosts,2,FALSE)),2))","v":"#ERROR!"},"#ERROR!","#ERROR!",{"$f":"IF(OR(COUNTIF(WorkPackage,B13)=0,COUNTIF(PartnerN°,C13)=0,D13=\"\",COUNTIF(CountryALL,E13)=0,F13=\"\",COUNTIF(Category2,G13)=0,ISNUMBER(H13)=FALSE,H13<=0,I13=\"\",COUNTIF(TravelBands,J13)=0,ISNUMBER(K13)=FALSE,OR(K13<0,K13>90),IF(ISNUMBER(H13)=TRUE,H13=INT(H13*1)/1=FALSE),IF(ISNUMBER(K13)=TRUE,K13=INT(K13*1)/1=FALSE),AND(L13<>\"\",M13=0),AND(L13=\"\",M13>0),ISNUMBER(N13)=FALSE ),\"Error\",\"\")","v":"#ERROR!"}]
[null,"Preparation","P11",{"$f":"IFERROR(IF(VLOOKUP(C15,PartnerN°Ref,2,FALSE)=0,\"\",VLOOKUP(C15,PartnerN°Ref,2,FALSE)),\"\")","v":"#ERROR!"},{"$f":"IFERROR(IF(OR(VLOOKUP(C15,PartnerN°Ref,4,FALSE)=\"Country not found\",VLOOKUP(C15,PartnerN°Ref,3,FALSE)=0),\"\",VLOOKUP(C15,PartnerN°Ref,3,FALSE)),\"\")","v":"#ERROR!"},"Tehran ","Staff",3.0,"Turku","3000 KM and 3999 KM",5.0,null,null,{"$f":"IF(AND(M23>0,L23<>\"\"),IF(M23>(ROUND( (ROUND(ROUND(H23,0)*(VLOOKUP(J23,TravelCosts,2,FALSE)),2))/0.65,2)),ROUND(M23*0.8,2),\"covered by unit cost\"),0)","v":0},{"$f":"IF(OR(AND(L23<>\"\",M23>0,ISNUMBER(N23)),R23=\"Error\"),0,ROUND(ROUND(H23,0)*(VLOOKUP(J23,TravelCosts,2,FALSE)),2))","v":"#ERROR!"},"#ERROR!","#ERROR!",{"$f":"IF(OR(COUNTIF(WorkPackage,B13)=0,COUNTIF(PartnerN°,C13)=0,D13=\"\",COUNTIF(CountryALL,E13)=0,F13=\"\",COUNTIF(Category2,G13)=0,ISNUMBER(H13)=FALSE,H13<=0,I13=\"\",COUNTIF(TravelBands,J13)=0,ISNUMBER(K13)=FALSE,OR(K13<0,K13>90),IF(ISNUMBER(H13)=TRUE,H13=INT(H13*1)/1=FALSE),IF(ISNUMBER(K13)=TRUE,K13=INT(K13*1)/1=FALSE),AND(L13<>\"\",M13=0),AND(L13=\"\",M13>0),ISNUMBER(N13)=FALSE ),\"Error\",\"\")","v":"#ERROR!"}]
[null,"Preparation","P12",{"$f":"IFERROR(IF(VLOOKUP(C15,PartnerN°Ref,2,FALSE)=0,\"\",VLOOKUP(C15,PartnerN°Ref,2,FALSE)),\"\")","v":"#ERROR!"},{"$f":"IFERROR(IF(OR(VLOOKUP(C15,PartnerN°Ref,4,FALSE)=\"Country not found\",VLOOKUP(C15,PartnerN°Ref,3,FALSE)=0),\"\",VLOOKUP(C15,PartnerN°Ref,3,FALSE)),\"\")","v":"#ERROR!"},"Tehran ","Staff",3.0,"Turku","3000 KM and 3999 KM",5.0,null,null,{"$f":"IF(AND(M24>0,L24<>\"\"),IF(M24>(ROUND( (ROUND(ROUND(H24,0)*(VLOOKUP(J24,TravelCosts,2,FALSE)),2))/0.65,2)),ROUND(M24*0.8,2),\"covered by unit cost\"),0)","v":0},{"$f":"IF(OR(AND(L24<>\"\",M24>0,ISNUMBER(N24)),R24=\"Error\"),0,ROUND(ROUND(H24,0)*(VLOOKUP(J24,TravelCosts,2,FALSE)),2))","v":"#ERROR!"},"#ERROR!","#ERROR!",{"$f":"IF(OR(COUNTIF(WorkPackage,B13)=0,COUNTIF(PartnerN°,C13)=0,D13=\"\",COUNTIF(CountryALL,E13)=0,F13=\"\",COUNTIF(Category2,G13)=0,ISNUMBER(H13)=FALSE,H13<=0,I13=\"\",COUNTIF(TravelBands,J13)=0,ISNUMBER(K13)=FALSE,OR(K13<0,K13>90),IF(ISNUMBER(H13)=TRUE,H13=INT(H13*1)/1=FALSE),IF(ISNUMBER(K13)=TRUE,K13=INT(K13*1)/1=FALSE),AND(L13<>\"\",M13=0),AND(L13=\"\",M13>0),ISNUMBER(N13)=FALSE ),\"Error\",\"\")","v":"#ERROR!"}]
[null,"Development","P1",{"$f":"IFERROR(IF(VLOOKUP(C15,PartnerN°Ref,2,FALSE)=0,\"\",VLOOKUP(C15,PartnerN°Ref,2,FALSE)),\"\")","v":"#ERROR!"},{"$f":"IFERROR(IF(OR(VLOOKUP(C15,PartnerN°Ref,4,FALSE)=\"Country not found\",VLOOKUP(C15,PartnerN°Ref,3,FALSE)=0),\"\",VLOOKUP(C15,PartnerN°Ref,3,FALSE)),\"\")","v":"#ERROR!"},"Rome ","Staff",3.0,"Isfahan ","3000 KM and 3999 KM",5.0,null,null,{"$f":"IF(AND(M25>0,L25<>\"\"),IF(M25>(ROUND( (ROUND(ROUND(H25,0)*(VLOOKUP(J25,TravelCosts,2,FALSE)),2))/0.65,2)),ROUND(M25*0.8,2),\"covered by unit cost\"),0)","v":0},{"$f":"IF(OR(AND(L25<>\"\",M25>0,ISNUMBER(N25)),R25=\"Error\"),0,ROUND(ROUND(H25,0)*(VLOOKUP(J25,TravelCosts,2,FALSE)),2))","v":"#ERROR!"},"#ERROR!","#ERROR!",{"$f":"IF(OR(COUNTIF(WorkPackage,B13)=0,COUNTIF(PartnerN°,C13)=0,D13=\"\",COUNTIF(CountryALL,E13)=0,F13=\"\",COUNTIF(Category2,G13)=0,ISNUMBER(H13)=FALSE,H13<=0,I13=\"\",COUNTIF(TravelBands,J13)=0,ISNUMBER(K13)=FALSE,OR(K13<0,K13>90),IF(ISNUMBER(H13)=TRUE,H13=INT(H13*1)/1=FALSE),IF(ISNUMBER(K13)=TRUE,K13=INT(K13*1)/1=FALSE),AND(L13<>\"\",M13=0),AND(L13=\"\",M13>0),ISNUMBER(N13)=FALSE ),\"Error\",\"\")","v":"#ERROR!"}]
[null,"Development","P2",{"$f":"IFERROR(IF(VLOOKUP(C15,PartnerN°Ref,2,FALSE)=0,\"\",VLOOKUP(C15,PartnerN°Ref,2,FALSE)),\"\")","v":"#ERROR!"},{"$f":"IFERROR(IF(OR(VLOOKUP(C15,PartnerN°Ref,4,FALSE)=\"Country not found\",VLOOKUP(C15,PartnerN°Ref,3,FALSE)=0),\"\",VLOOKUP(C15,PartnerN°Ref,3,FALSE)),\"\")","v":"#ERROR!"},"Turku","Staff",3.0,"Isfahan ","3000 KM and 3999 KM",5.0,null,null,{"$f":"IF(AND(M26>0,L26<>\"\"),IF(M26>(ROUND( (ROUND(ROUND(H26,0)*(VLOOKUP(J26,TravelCosts,2,FALSE)),2))/0.65,2)),ROUND(M26*0.8,2),\"covered by unit cost\"),0)","v":0},{"$f":"IF(OR(AND(L26<>\"\",M26>0,ISNUMBER(N26)),R26=\"Error\"),0,ROUND(ROUND(H26,0)*(VLOOKUP(J26,TravelCosts,2,FALSE)),2))","v":"#ERROR!"},"#ERROR!","#ERROR!",{"$f":"IF(OR(COUNTIF(WorkPackage,B13)=0,COUNTIF(PartnerN°,C13)=0,D13=\"\",COUNTIF(CountryALL,E13)=0,F13=\"\",COUNTIF(Category2,G13)=0,ISNUMBER(H13)=FALSE,H13<=0,I13=\"\",COUNTIF(TravelBands,J13)=0,ISNUMBER(K13)=FALSE,OR(K13<0,K13>90),IF(ISNUMBER(H13)=TRUE,H13=INT(H13*1)/1=FALSE),IF(ISNUMBER(K13)=TRUE,K13=INT(K13*1)/1=FALSE),AND(L13<>\"\",M13=0),AND(L13=\"\",M13>0),ISNUMBER(N13)=FALSE ),\"Error\",\"\")","v":"#ERROR!"}]
[null,"Development","P3",{"$f":"IFERROR(IF(VLOOKUP(C15,PartnerN°Ref,2,FALSE)=0,\"\",VLOOKUP(C15,PartnerN°Ref,2,FALSE)),\"\")","v":"#ERROR!"},{"$f":"IFERROR(IF(OR(VLOOKUP(C15,PartnerN°Ref,4,FALSE)=\"Country not found\",VLOOKUP(C15,PartnerN°Ref,3,FALSE)=0),\"\",VLOOKUP(C15,PartnerN°Ref,3,FALSE)),\"\")","v":"#ERROR!"},"Lisbon ","Staff",3.0,"Isfahan ","4000 KM and 7999 KM",5.0,null,null,{"$f":"IF(AND(M27>0,L27<>\"\"),IF(M27>(ROUND( (ROUND(ROUND(H27,0)*(VLOOKUP(J27,TravelCosts,2,FALSE)),2))/0.65,2)),ROUND(M27*0.8,2),\"covered by unit cost\"),0)","v":0},{"$f":"IF(OR(AND(L27<>\"\",M27>0,ISNUMBER(N27)),R27=\"Error\"),0,ROUND(ROUND(H27,0)*(VLOOKUP(J27,TravelCosts,2,FALSE)),2))","v":"#ERROR!"},"#ERROR!","#ERROR!",{"$f":"IF(OR(COUNTIF(WorkPackage,B13)=0,COUNTIF(PartnerN°,C13)=0,D13=\"\",COUNTIF(CountryALL,E13)=0,F13=\"\",COUNTIF(Category2,G13)=0,ISNUMBER(H13)=FALSE,H13<=0,I13=\"\",COUNTIF(TravelBands,J13)=0,ISNUMBER(K13)=FALSE,OR(K13<0,K13>90),IF(ISNUMBER(H13)=TRUE,H13=INT(H13*1)/1=FALSE),IF(ISNUMBER(K13)=TRUE,K13=INT(K13*1)/1=FALSE),AND(L13<>\"\",M13=0),AND(L13=\"\",M13>0),ISNUMBER(N13)=FALSE ),\"Error\",\"\")","v":"#ERROR!"}]
[null,"Development","P4",{"$f":"IFERROR(IF(VLOOKUP(C15,PartnerN°Ref,2,FALSE)=0,\"\",VLOOKUP(C15,PartnerN°Ref,2,FALSE)),\"\")","v":"#ERROR!"},{"$f":"IFERROR(IF(OR(VLOOKUP(C15,PartnerN°Ref,4,FALSE)=\"Country not found\",VLOOKUP(C15,PartnerN°Ref,3,FALSE)=0),\"\",VLOOKUP(C15,PartnerN°Ref,3,FALSE)),\"\")","v":"#ERROR!"},"Alexandropoulos ","Staff",3.0,"Isfahan ","2000 KM and 2999 KM",5.0,null,null,{"$f":"IF(AND(M28>0,L28<>\"\"),IF(M28>(ROUND( (ROUND(ROUND(H28,0)*(VLOOKUP(J28,TravelCosts,2,FALSE)),2))/0.65,2)),ROUND(M28*0.8,2),\"covered by unit cost\"),0)","v":0},{"$f":"IF(OR(AND(L28<>\"\",M28>0,ISNUMBER(N28)),R28=\"Error\"),0,ROUND(ROUND(H28,0)*(VLOOKUP(J28,TravelCosts,2,FALSE)),2))","v":"#ERROR!"},"#ERROR!","#ERROR!",{"$f":"IF(OR(COUNTIF(WorkPackage,B13)=0,COUNTIF(PartnerN°,C13)=0,D13=\"\",COUNTIF(CountryALL,E13)=0,F13=\"\",COUNTIF(Category2,G13)=0,ISNUMBER(H13)=FALSE,H13<=0,I13=\"\",COUNTIF(TravelBands,J13)=0,ISNUMBER(K13)=FALSE,OR(K13<0,K13>90),IF(ISNUMBER(H13)=TRUE,H13=INT(H13*1)/1=FALSE),IF(ISNUMBER(K13)=TRUE,K13=INT(K13*1)/1=FALSE),AND(L13<>\"\",M13=0),AND(L13=\"\",M13>0),ISNUMBER(N13)=FALSE ),\"Error\",\"\")","v":"#ERROR!"}]
[null,"Development","P5",{"$f":"IFERROR(IF(VLOOKUP(C15,PartnerN°Ref,2,FALSE)=0,\"\",VLOOKUP(C15,PartnerN°Ref,2,FALSE)),\"\")","v":"#ERROR!"},{"$f":"IFERROR(IF(OR(VLOOKUP(C15,PartnerN°Ref,4,FALSE)=\"Country not found\",VLOOKUP(C15,PartnerN°Ref,3,FALSE)=0),\"\",VLOOKUP(C15,PartnerN°Ref,3,FALSE)),\"\")","v":"#ERROR!"},"Qazvin","Staff",3.0,"Isfahan ","100 KM and 499 KM",5.0,null,null,{"$f":"IF(AND(M29>0,L29<>\"\"),IF(M29>(ROUND( (ROUND(ROUND(H29,0)*(VLOOKUP(J29,TravelCosts,2,FALSE)),2))/0.65,2)),ROUND(M29*0.8,2),\"covered by unit cost\"),0)","v":0},{"$f":"IF(OR(AND(L29<>\"\",M29>0,ISNUMBER(N29)),R29=\"Error\"),0,ROUND(ROUND(H29,0)*(VLOOKUP(J29,TravelCosts,2,FALSE)),2))","v":"#ERROR!"},"#ERROR!","#ERROR!",{"$f":"IF(OR(COUNTIF(WorkPackage,B13)=0,COUNTIF(PartnerN°,C13)=0,D13=\"\",COUNTIF(CountryALL,E13)=0,F13=\"\",COUNTIF(Category2,G13)=0,ISNUMBER(H13)=FALSE,H13<=0,I13=\"\",COUNTIF(TravelBands,J13)=0,ISNUMBER(K13)=FALSE,OR(K13<0,K13>90),IF(ISNUMBER(H13)=TRUE,H13=INT(H13*1)/1=FALSE),IF(ISNUMBER(K13)=TRUE,K13=INT(K13*1)/1=FALSE),AND(L13<>\"\",M13=0),AND(L13=\"\",M13>0),ISNUMBER(N13)=FALSE ),\"Error\",\"\")","v":"#ERROR!"}]
[null,"Development","P6",{"$f":"IFERROR(IF(VLOOKUP(C15,PartnerN°Ref,2,FALSE)=0,\"\",VLOOKUP(C15,PartnerN°Ref,2,FALSE)),\"\")","v":"#ERROR!"},{"$f":"IFERROR(IF(OR(VLOOKUP(C15,PartnerN°Ref,4,FALSE)=\"Country not found\",VLOOKUP(C15,PartnerN°Ref,3,FALSE)=0),\"\",VLOOKUP(C15,PartnerN°Ref,3,FALSE)),\"\")","v":"#ERROR!"},"Zahedan ","Staff",3.0,"Isfahan ","500 KM and 1999 KM",5.0,null,null,{"$f":"IF(AND(M30>0,L30<>\"\"),IF(M30>(ROUND( (ROUND(ROUND(H30,0)*(VLOOKUP(J30,TravelCosts,2,FALSE)),2))/0.65,2)),ROUND(M30*0.8,2),\"covered by unit cost\"),0)","v":0},{"$f":"IF(OR(AND(L30<>\"\",M30>0,ISNUMBER(N30)),R30=\"Error\"),0,ROUND(ROUND(H30,0)*(VLOOKUP(J30,TravelCosts,2,FALSE)),2))","v":"#ERROR!"},"#ERROR!","#ERROR!",{"$f":"IF(OR(COUNTIF(WorkPackage,B13)=0,COUNTIF(PartnerN°,C13)=0,D13=\"\",COUNTIF(CountryALL,E13)=0,F13=\"\",COUNTIF(Category2,G13)=0,ISNUMBER(H13)=FALSE,H13<=0,I13=\"\",COUNTIF(TravelBands,J13)=0,ISNUMBER(K13)=FALSE,OR(K13<0,K13>90),IF(ISNUMBER(H13)=TRUE,H13=INT(H13*1)/1=FALSE),IF(ISNUMBER(K13)=TRUE,K13=INT(K13*1)/1=FALSE),AND(L13<>\"\",M13=0),AND(L13=\"\",M13>0),ISNUMBER(N13)=FALSE ),\"Error\",\"\")","v":"#ERROR!"}]
[null,"Development","P7",{"$f":"IFERROR(IF(VLOOKUP(C15,PartnerN°Ref,2,FALSE)=0,\"\",VLOOKUP(C15,PartnerN°Ref,2,FALSE)),\"\")","v":"#ERROR!"},{"$f":"IFERROR(IF(OR(VLOOKUP(C15,PartnerN°Ref,4,FALSE)=\"Country not found\",VLOOKUP(C15,PartnerN°Ref,3,FALSE)=0),\"\",VLOOKUP(C15,PartnerN°Ref,3,FALSE)),\"\")","v":"#ERROR!"},"Shiraz ","Staff",3.0,"Isfahan ","100 KM and 499 KM",5.0,null,null,{"$f":"IF(AND(M31>0,L31<>\"\"),IF(M31>(ROUND( (ROUND(ROUND(H31,0)*(VLOOKUP(J31,TravelCosts,2,FALSE)),2))/0.65,2)),ROUND(M31*0.8,2),\"covered by unit cost\"),0)","v":0},{"$f":"IF(OR(AND(L31<>\"\",M31>0,ISNUMBER(N31)),R31=\"Error\"),0,ROUND(ROUND(H31,0)*(VLOOKUP(J31,TravelCosts,2,FALSE)),2))","v":"#ERROR!"},"#ERROR!","#ERROR!",{"$f":"IF(OR(COUNTIF(WorkPackage,B13)=0,COUNTIF(PartnerN°,C13)=0,D13=\"\",COUNTIF(CountryALL,E13)=0,F13=\"\",COUNTIF(Category2,G13)=0,ISNUMBER(H13)=FALSE,H13<=0,I13=\"\",COUNTIF(TravelBands,J13)=0,ISNUMBER(K13)=FALSE,OR(K13<0,K13>90),IF(ISNUMBER(H13)=TRUE,H13=INT(H13*1)/1=FALSE),IF(ISNUMBER(K13)=TRUE,K13=INT(K13*1)/1=FALSE),AND(L13<>\"\",M13=0),AND(L13=\"\",M13>0),ISNUMBER(N13)=FALSE ),\"Error\",\"\")","v":"#ERROR!"}]
[null,"Development","P9",{"$f":"IFERROR(IF(VLOOKUP(C15,PartnerN°Ref,2,FALSE)=0,\"\",VLOOKUP(C15,PartnerN°Ref,2,FALSE)),\"\")","v":"#ERROR!"},{"$f":"IFERROR(IF(OR(VLOOKUP(C15,PartnerN°Ref,4,FALSE)=\"Country not found\",VLOOKUP(C15,PartnerN°Ref,3,FALSE)=0),\"\",VLOOKUP(C15,PartnerN°Ref,3,FALSE)),\"\")","v":"#ERROR!"},"Tehran ","Staff",3.0,"Isfahan ","100 KM and 499 KM",5.0,null,null,{"$f":"IF(AND(M32>0,L32<>\"\"),IF(M32>(ROUND( (ROUND(ROUND(H32,0)*(VLOOKUP(J32,TravelCosts,2,FALSE)),2))/0.65,2)),ROUND(M32*0.8,2),\"covered by unit cost\"),0)","v":0},{"$f":"IF(OR(AND(L32<>\"\",M32>0,ISNUMBER(N32)),R32=\"Error\"),0,ROUND(ROUND(H32,0)*(VLOOKUP(J32,TravelCosts,2,FALSE)),2))","v":"#ERROR!"},"#ERROR!","#ERROR!",{"$f":"IF(OR(COUNTIF(WorkPackage,B13)=0,COUNTIF(PartnerN°,C13)=0,D13=\"\",COUNTIF(CountryALL,E13)=0,F13=\"\",COUNTIF(Category2,G13)=0,ISNUMBER(H13)=FALSE,H13<=0,I13=\"\",COUNTIF(TravelBands,J13)=0,ISNUMBER(K13)=FALSE,OR(K13<0,K13>90),IF(ISNUMBER(H13)=TRUE,H13=INT(H13*1)/1=FALSE),IF(ISNUMBER(K13)=TRUE,K13=INT(K13*1)/1=FALSE),AND(L13<>\"\",M13=0),AND(L13=\"\",M13>0),ISNUMBER(N13)=FALSE ),\"Error\",\"\")","v":"#ERROR!"}]
[null,"Development","P10",{"$f":"IFERROR(IF(VLOOKUP(C15,PartnerN°Ref,2,FALSE)=0,\"\",VLOOKUP(C15,PartnerN°Ref,2,FALSE)),\"\")","v":"#ERROR!"},{"$f":"IFERROR(IF(OR(VLOOKUP(C15,PartnerN°Ref,4,FALSE)=\"Country not found\",VLOOKUP(C15,PartnerN°Ref,3,FALSE)=0),\"\",VLOOKUP(C15,PartnerN°Ref,3,FALSE)),\"\")","v":"#ERROR!"},"Ahavz","Staff",3.0,"Isfahan ","100 KM and 499 KM",5.0,null,null,{"$f":"IF(AND(M33>0,L33<>\"\"),IF(M33>(ROUND( (ROUND(ROUND(H33,0)*(VLOOKUP(J33,TravelCosts,2,FALSE)),2))/0.65,2)),ROUND(M33*0.8,2),\"covered by unit cost\"),0)","v":0},{"$f":"IF(OR(AND(L33<>\"\",M33>0,ISNUMBER(N33)),R33=\"Error\"),0,ROUND(ROUND(H33,0)*(VLOOKUP(J33,TravelCosts,2,FALSE)),2))","v":"#ERROR!"},"#ERROR!","#ERROR!",{"$f":"IF(OR(COUNTIF(WorkPackage,B13)=0,COUNTIF(PartnerN°,C13)=0,D13=\"\",COUNTIF(CountryALL,E13)=0,F13=\"\",COUNTIF(Category2,G13)=0,ISNUMBER(H13)=FALSE,H13<=0,I13=\"\",COUNTIF(TravelBands,J13)=0,ISNUMBER(K13)=FALSE,OR(K13<0,K13>90),IF(ISNUMBER(H13)=TRUE,H13=INT(H13*1)/1=FALSE),IF(ISNUMBER(K13)=TRUE,K13=INT(K13*1)/1=FALSE),AND(L13<>\"\",M13=0),AND(L13=\"\",M13>0),ISNUMBER(N13)=FALSE ),\"Error\",\"\")","v":"#ERROR!"}]
[null,"Development","P11",{"$f":"IFERROR(IF(VLOOKUP(C15,PartnerN°Ref,2,FALSE)=0,\"\",VLOOKUP(C15,PartnerN°Ref,2,FALSE)),\"\")","v":"#ERROR!"},{"$f":"IFERROR(IF(OR(VLOOKUP(C15,PartnerN°Ref,4,FALSE)=\"Country not found\",VLOOKUP(C15,PartnerN°Ref,3,FALSE)=0),\"\",VLOOKUP(C15,PartnerN°Ref,3,FALSE)),\"\")","v":"#ERROR!"},"Tehran ","Staff",3.0,"Isfahan ","100 KM and 499 KM",5.0,null,null,{"$f":"IF(AND(M34>0,L34<>\"\"),IF(M34>(ROUND( (ROUND(ROUND(H34,0)*(VLOOKUP(J34,TravelCosts,2,FALSE)),2))/0.65,2)),ROUND(M34*0.8,2),\"covered by unit cost\"),0)","v":0},{"$f":"IF(OR(AND(L34<>\"\",M34>0,ISNUMBER(N34)),R34=\"Error\"),0,ROUND(ROUND(H34,0)*(VLOOKUP(J34,TravelCosts,2,FALSE)),2))","v":"#ERROR!"},"#ERROR!","#ERROR!",{"$f":"IF(OR(COUNTIF(WorkPackage,B13)=0,COUNTIF(PartnerN°,C13)=0,D13=\"\",COUNTIF(CountryALL,E13)=0,F13=\"\",COUNTIF(Category2,G13)=0,ISNUMBER(H13)=FALSE,H13<=0,I13=\"\",COUNTIF(TravelBands,J13)=0,ISNUMBER(K13)=FALSE,OR(K13<0,K13>90),IF(ISNUMBER(H13)=TRUE,H13=INT(H13*1)/1=FALSE),IF(ISNUMBER(K13)=TRUE,K13=INT(K13*1)/1=FALSE),AND(L13<>\"\",M13=0),AND(L13=\"\",M13>0),ISNUMBER(N13)=FALSE ),\"Error\",\"\")","v":"#ERROR!"}]
[null,"Development","P12",{"$f":"IFERROR(IF(VLOOKUP(C15,PartnerN°Ref,2,FALSE)=0,\"\",VLOOKUP(C15,PartnerN°Ref,2,FALSE)),\"\")","v":"#ERROR!"},{"$f":"IFERROR(IF(OR(VLOOKUP(C15,PartnerN°Ref,4,FALSE)=\"Country not found\",VLOOKUP(C15,PartnerN°Ref,3,FALSE)=0),\"\",VLOOKUP(C15,PartnerN°Ref,3,FALSE)),\"\")","v":"#ERROR!"},"Tehran ","Staff",3.0,"Isfahan ","100 KM and 499 KM",5.0,null,null,{"$f":"IF(AND(M35>0,L35<>\"\"),IF(M35>(ROUND( (ROUND(ROUND(H35,0)*(VLOOKUP(J35,TravelCosts,2,FALSE)),2))/0.65,2)),ROUND(M35*0.8,2),\"covered by unit cost\"),0)","v":0},{"$f":"IF(OR(AND(L35<>\"\",M35>0,ISNUMBER(N35)),R35=\"Error\"),0,ROUND(ROUND(H35,0)*(VLOOKUP(J35,TravelCosts,2,FALSE)),2))","v":"#ERROR!"},"#ERROR!","#ERROR!",{"$f":"IF(OR(COUNTIF(WorkPackage,B13)=0,COUNTIF(PartnerN°,C13)=0,D13=\"\",COUNTIF(CountryALL,E13)=0,F13=\"\",COUNTIF(Category2,G13)=0,ISNUMBER(H13)=FALSE,H13<=0,I13=\"\",COUNTIF(TravelBands,J13)=0,ISNUMBER(K13)=FALSE,OR(K13<0,K13>90),IF(ISNUMBER(H13)=TRUE,H13=INT(H13*1)/1=FALSE),IF(ISNUMBER(K13)=TRUE,K13=INT(K13*1)/1=FALSE),AND(L13<>\"\",M13=0),AND(L13=\"\",M13>0),ISNUMBER(N13)=FALSE ),\"Error\",\"\")","v":"#ERROR!"}]
[null,"Development","P1",{"$f":"IFERROR(IF(VLOOKUP(C15,PartnerN°Ref,2,FALSE)=0,\"\",VLOOKUP(C15,PartnerN°Ref,2,FALSE)),\"\")","v":"#ERROR!"},{"$f":"IFERROR(IF(OR(VLOOKUP(C15,PartnerN°Ref,4,FALSE)=\"Country not found\",VLOOKUP(C15,PartnerN°Ref,3,FALSE)=0),\"\",VLOOKUP(C15,PartnerN°Ref,3,FALSE)),\"\")","v":"#ERROR!"},"Rome","Staff",2.0,"Turku","2000 KM and 2999 KM",7.0,null,null,{"$f":"IF(AND(M36>0,L36<>\"\"),IF(M36>(ROUND( (ROUND(ROUND(H36,0)*(VLOOKUP(J36,TravelCosts,2,FALSE)),2))/0.65,2)),ROUND(M36*0.8,2),\"covered by unit cost\"),0)","v":0},{"$f":"IF(OR(AND(L36<>\"\",M36>0,ISNUMBER(N36)),R36=\"Error\"),0,ROUND(ROUND(H36,0)*(VLOOKUP(J36,TravelCosts,2,FALSE)),2))","v":"#ERROR!"},"#ERROR!","#ERROR!",{"$f":"IF(OR(COUNTIF(WorkPackage,B13)=0,COUNTIF(PartnerN°,C13)=0,D13=\"\",COUNTIF(CountryALL,E13)=0,F13=\"\",COUNTIF(Category2,G13)=0,ISNUMBER(H13)=FALSE,H13<=0,I13=\"\",COUNTIF(TravelBands,J13)=0,ISNUMBER(K13)=FALSE,OR(K13<0,K13>90),IF(ISNUMBER(H13)=TRUE,H13=INT(H13*1)/1=FALSE),IF(ISNUMBER(K13)=TRUE,K13=INT(K13*1)/1=FALSE),AND(L13<>\"\",M13=0),AND(L13=\"\",M13>0),ISNUMBER(N13)=FALSE ),\"Error\",\"\")","v":"#ERROR!"}]
[null,"Development","P3",{"$f":"IFERROR(IF(VLOOKUP(C15,PartnerN°Ref,2,FALSE)=0,\"\",VLOOKUP(C15,PartnerN°Ref,2,FALSE)),\"\")","v":"#ERROR!"},{"$f":"IFERROR(IF(OR(VLOOKUP(C15,PartnerN°Ref,4,FALSE)=\"Country not found\",VLOOKUP(C15,PartnerN°Ref,3,FALSE)=0),\"\",VLOOKUP(C15,PartnerN°Ref,3,FALSE)),\"\")","v":"#ERROR!"},"Lisbon ","Staff",2.0,"Turku","3000 KM and 3999 KM",7.0,null,null,{"$f":"IF(AND(M37>0,L37<>\"\"),IF(M37>(ROUND( (ROUND(ROUND(H37,0)*(VLOOKUP(J37,TravelCosts,2,FALSE)),2))/0.65,2)),ROUND(M37*0.8,2),\"covered by unit cost\"),0)","v":0},{"$f":"IF(OR(AND(L37<>\"\",M37>0,ISNUMBER(N37)),R37=\"Error\"),0,ROUND(ROUND(H37,0)*(VLOOKUP(J37,TravelCosts,2,FALSE)),2))","v":"#ERROR!"},"#ERROR!","#ERROR!",{"$f":"IF(OR(COUNTIF(WorkPackage,B13)=0,COUNTIF(PartnerN°,C13)=0,D13=\"\",COUNTIF(CountryALL,E13)=0,F13=\"\",COUNTIF(Category2,G13)=0,ISNUMBER(H13)=FALSE,H13<=0,I13=\"\",COUNTIF(TravelBands,J13)=0,ISNUMBER(K13)=FALSE,OR(K13<0,K13>90),IF(ISNUMBER(H13)=TRUE,H13=INT(H13*1)/1=FALSE),IF(ISNUMBER(K13)=TRUE,K13=INT(K13*1)/1=FALSE),AND(L13<>\"\",M13=0),AND(L13=\"\",M13>0),ISNUMBER(N13)=FALSE ),\"Error\",\"\")","v":"#ERROR!"}]
[null,"Development","P4",{"$f":"IFERROR(IF(VLOOKUP(C15,PartnerN°Ref,2,FALSE)=0,\"\",VLOOKUP(C15,PartnerN°Ref,2,FALSE)),\"\")","v":"#ERROR!"},{"$f":"IFERROR(IF(OR(VLOOKUP(C15,PartnerN°Ref,4,FALSE)=\"Country not found\",VLOOKUP(C15,PartnerN°Ref,3,FALSE)=0),\"\",VLOOKUP(C15,PartnerN°Ref,3,FALSE)),\"\")","v":"#ERROR!"},"Alexandropoulos ","Staff",2.0,"Turku","2000 KM and 2999 KM",7.0,null,null,{"$f":"IF(AND(M38>0,L38<>\"\"),IF(M38>(ROUND( (ROUND(ROUND(H38,0)*(VLOOKUP(J38,TravelCosts,2,FALSE)),2))/0.65,2)),ROUND(M38*0.8,2),\"covered by unit cost\"),0)","v":0},{"$f":"IF(OR(AND(L38<>\"\",M38>0,ISNUMBER(N38)),R38=\"Error\"),0,ROUND(ROUND(H38,0)*(VLOOKUP(J38,TravelCosts,2,FALSE)),2))","v":"#ERROR!"},"#ERROR!","#ERROR!",{"$f":"IF(OR(COUNTIF(WorkPackage,B13)=0,COUNTIF(PartnerN°,C13)=0,D13=\"\",COUNTIF(CountryALL,E13)=0,F13=\"\",COUNTIF(Category2,G13)=0,ISNUMBER(H13)=FALSE,H13<=0,I13=\"\",COUNTIF(TravelBands,J13)=0,ISNUMBER(K13)=FALSE,OR(K13<0,K13>90),IF(ISNUMBER(H13)=TRUE,H13=INT(H13*1)/1=FALSE),IF(ISNUMBER(K13)=TRUE,K13=INT(K13*1)/1=FALSE),AND(L13<>\"\",M13=0),AND(L13=\"\",M13>0),ISNUMBER(N13)=FALSE ),\"Error\",\"\")","v":"#ERROR!"}]
[null,"Development","P5",{"$f":"IFERROR(IF(VLOOKUP(C15,PartnerN°Ref,2,FALSE)=0,\"\",VLOOKUP(C15,PartnerN°Ref,2,FALSE)),\"\")","v":"#ERROR!"},{"$f":"IFERROR(IF(OR(VLOOKUP(C15,PartnerN°Ref,4,FALSE)=\"Country not found\",VLOOKUP(C15,PartnerN°Ref,3,FALSE)=0),\"\",VLOOKUP(C15,PartnerN°Ref,3,FALSE)),\"\")","v":"#ERROR!"},"Qazvin","Staff",2.0,"Turku","3000 KM and 3999 KM",7.0,null,null,{"$f":"IF(AND(M39>0,L39<>\"\"),IF(M39>(ROUND( (ROUND(ROUND(H39,0)*(VLOOKUP(J39,TravelCosts,2,FALSE)),2))/0.65,2)),ROUND(M39*0.8,2),\"covered by unit cost\"),0)","v":0},{"$f":"IF(OR(AND(L39<>\"\",M39>0,ISNUMBER(N39)),R39=\"Error\"),0,ROUND(ROUND(H39,0)*(VLOOKUP(J39,TravelCosts,2,FALSE)),2))","v":"#ERROR!"},"#ERROR!","#ERROR!",{"$f":"IF(OR(COUNTIF(WorkPackage,B13)=0,COUNTIF(PartnerN°,C13)=0,D13=\"\",COUNTIF(CountryALL,E13)=0,F13=\"\",COUNTIF(Category2,G13)=0,ISNUMBER(H13)=FALSE,H13<=0,I13=\"\",COUNTIF(TravelBands,J13)=0,ISNUMBER(K13)=FALSE,OR(K13<0,K13>90),IF(ISNUMBER(H13)=TRUE,H13=INT(H13*1)/1=FALSE),IF(ISNUMBER(K13)=TRUE,K13=INT(K13*1)/1=FALSE),AND(L13<>\"\",M13=0),AND(L13=\"\",M13>0),ISNUMBER(N13)=FALSE ),\"Error\",\"\")","v":"#ERROR!"}]
[null,"Development","P6",{"$f":"IFERROR(IF(VLOOKUP(C15,PartnerN°Ref,2,FALSE)=0,\"\",VLOOKUP(C15,PartnerN°Ref,2,FALSE)),\"\")","v":"#ERROR!"},{"$f":"IFERROR(IF(OR(VLOOKUP(C15,PartnerN°Ref,4,FALSE)=\"Country not found\",VLOOKUP(C15,PartnerN°Ref,3,FALSE)=0),\"\",VLOOKUP(C15,PartnerN°Ref,3,FALSE)),\"\")","v":"#ERROR!"},"Zahedan ","Staff",2.0,"Turku","4000 KM and 7999 KM",7.0,null,null,{"$f":"IF(AND(M40>0,L40<>\"\"),IF(M40>(ROUND( (ROUND(ROUND(H40,0)*(VLOOKUP(J40,TravelCosts,2,FALSE)),2))/0.65,2)),ROUND(M40*0.8,2),\"covered by unit cost\"),0)","v":0},{"$f":"IF(OR(AND(L40<>\"\",M40>0,ISNUMBER(N40)),R40=\"Error\"),0,ROUND(ROUND(H40,0)*(VLOOKUP(J40,TravelCosts,2,FALSE)),2))","v":"#ERROR!"},"#ERROR!","#ERROR!",{"$f":"IF(OR(COUNTIF(WorkPackage,B13)=0,COUNTIF(PartnerN°,C13)=0,D13=\"\",COUNTIF(CountryALL,E13)=0,F13=\"\",COUNTIF(Category2,G13)=0,ISNUMBER(H13)=FALSE,H13<=0,I13=\"\",COUNTIF(TravelBands,J13)=0,ISNUMBER(K13)=FALSE,OR(K13<0,K13>90),IF(ISNUMBER(H13)=TRUE,H13=INT(H13*1)/1=FALSE),IF(ISNUMBER(K13)=TRUE,K13=INT(K13*1)/1=FALSE),AND(L13<>\"\",M13=0),AND(L13=\"\",M13>0),ISNUMBER(N13)=FALSE ),\"Error\",\"\")","v":"#ERROR!"}]
[null,"Development","P7",{"$f":"IFERROR(IF(VLOOKUP(C15,PartnerN°Ref,2,FALSE)=0,\"\",VLOOKUP(C15,PartnerN°Ref,2,FALSE)),\"\")","v":"#ERROR!"},{"$f":"IFERROR(IF(OR(VLOOKUP(C15,PartnerN°Ref,4,FALSE)=\"Country not found\",VLOOKUP(C15,PartnerN°Ref,3,FALSE)=0),\"\",VLOOKUP(C15,PartnerN°Ref,3,FALSE)),\"\")","v":"#ERROR!"},"Shiraz","Staff",2.0,"Turku","4000 KM and 7999 KM",7.0,null,null,{"$f":"IF(AND(M41>0,L41<>\"\"),IF(M41>(ROUND( (ROUND(ROUND(H41,0)*(VLOOKUP(J41,TravelCosts,2,FALSE)),2))/0.65,2)),ROUND(M41*0.8,2),\"covered by unit cost\"),0)","v":0},{"$f":"IF(OR(AND(L41<>\"\",M41>0,ISNUMBER(N41)),R41=\"Error\"),0,ROUND(ROUND(H41,0)*(VLOOKUP(J41,TravelCosts,2,FALSE)),2))","v":"#ERROR!"},"#ERROR!","#ERROR!",{"$f":"IF(OR(COUNTIF(WorkPackage,B13)=0,COUNTIF(PartnerN°,C13)=0,D13=\"\",COUNTIF(CountryALL,E13)=0,F13=\"\",COUNTIF(Category2,G13)=0,ISNUMBER(H13)=FALSE,H13<=0,I13=\"\",COUNTIF(TravelBands,J13)=0,ISNUMBER(K13)=FALSE,OR(K13<0,K13>90),IF(ISNUMBER(H13)=TRUE,H13=INT(H13*1)/1=FALSE),IF(ISNUMBER(K13)=TRUE,K13=INT(K13*1)/1=FALSE),AND(L13<>\"\",M13=0),AND(L13=\"\",M13>0),ISNUMBER(N13)=FALSE ),\"Error\",\"\")","v":"#ERROR!"}]
[null,"Development","P8",{"$f":"IFERROR(IF(VLOOKUP(C15,PartnerN°Ref,2,FALSE)=0,\"\",VLOOKUP(C15,PartnerN°Ref,2,FALSE)),\"\")","v":"#ERROR!"},{"$f":"IFERROR(IF(OR(VLOOKUP(C15,PartnerN°Ref,4,FALSE)=\"Country not found\",VLOOKUP(C15,PartnerN°Ref,3,FALSE)=0),\"\",VLOOKUP(C15,PartnerN°Ref,3,FALSE)),\"\")","v":"#ERROR!"},"Isfahan ","Staff",2.0,"Turku","3000 KM and 3999 KM",7.0,null,null,{"$f":"IF(AND(M42>0,L42<>\"\"),IF(M42>(ROUND( (ROUND(ROUND(H42,0)*(VLOOKUP(J42,TravelCosts,2,FALSE)),2))/0.65,2)),ROUND(M42*0.8,2),\"covered by unit cost\"),0)","v":0},{"$f":"IF(OR(AND(L42<>\"\",M42>0,ISNUMBER(N42)),R42=\"Error\"),0,ROUND(ROUND(H42,0)*(VLOOKUP(J42,TravelCosts,2,FALSE)),2))","v":"#ERROR!"},"#ERROR!","#ERROR!",{"$f":"IF(OR(COUNTIF(WorkPackage,B13)=0,COUNTIF(PartnerN°,C13)=0,D13=\"\",COUNTIF(CountryALL,E13)=0,F13=\"\",COUNTIF(Category2,G13)=0,ISNUMBER(H13)=FALSE,H13<=0,I13=\"\",COUNTIF(TravelBands,J13)=0,ISNUMBER(K13)=FALSE,OR(K13<0,K13>90),IF(ISNUMBER(H13)=TRUE,H13=INT(H13*1)/1=FALSE),IF(ISNUMBER(K13)=TRUE,K13=INT(K13*1)/1=FALSE),AND(L13<>\"\",M13=0),AND(L13=\"\",M13>0),ISNUMBER(N13)=FALSE ),\"Error\",\"\")","v":"#ERROR!"}]
[null,"Development","P9",{"$f":"IFERROR(IF(VLOOKUP(C15,PartnerN°Ref,2,FALSE)=0,\"\",VLOOKUP(C15,PartnerN°Ref,2,FALSE)),\"\")","v":"#ERROR!"},{"$f":"IFERROR(IF(OR(VLOOKUP(C15,PartnerN°Ref,4,FALSE)=\"Country not found\",VLOOKUP(C15,PartnerN°Ref,3,FALSE)=0),\"\",VLOOKUP(C15,PartnerN°Ref,3,FALSE)),\"\")","v":"#ERROR!"},"Tehran ","Staff",2.0,"Turku","3000 KM and 3999 KM",7.0,null,null,{"$f":"IF(AND(M43>0,L43<>\"\"),IF(M43>(ROUND( (ROUND(ROUND(H43,0)*(VLOOKUP(J43,TravelCosts,2,FALSE)),2))/0.65,2)),ROUND(M43*0.8,2),\"covered by unit cost\"),0)","v":0},{"$f":"IF(OR(AND(L43<>\"\",M43>0,ISNUMBER(N43)),R43=\"Error\"),0,ROUND(ROUND(H43,0)*(VLOOKUP(J43,TravelCosts,2,FALSE)),2))","v":"#ERROR!"},"#ERROR!","#ERROR!",{"$f":"IF(OR(COUNTIF(WorkPackage,B13)=0,COUNTIF(PartnerN°,C13)=0,D13=\"\",COUNTIF(CountryALL,E13)=0,F13=\"\",COUNTIF(Category2,G13)=0,ISNUMBER(H13)=FALSE,H13<=0,I13=\"\",COUNTIF(TravelBands,J13)=0,ISNUMBER(K13)=FALSE,OR(K13<0,K13>90),IF(ISNUMBER(H13)=TRUE,H13=INT(H13*1)/1=FALSE),IF(ISNUMBER(K13)=TRUE,K13=INT(K13*1)/1=FALSE),AND(L13<>\"\",M13=0),AND(L13=\"\",M13>0),ISNUMBER(N13)=FALSE ),\"Error\",\"\")","v":"#ERROR!"}]
[null,"Development","P10",{"$f":"IFERROR(IF(VLOOKUP(C15,PartnerN°Ref,2,FALSE)=0,\"\",VLOOKUP(C15,PartnerN°Ref,2,FALSE)),\"\")","v":"#ERROR!"},{"$f":"IFERROR(IF(OR(VLOOKUP(C15,PartnerN°Ref,4,FALSE)=\"Country not found\",VLOOKUP(C15,PartnerN°Ref,3,FALSE)=0),\"\",VLOOKUP(C15,PartnerN°Ref,3,FALSE)),\"\")","v":"#ERROR!"},"Ahvaz","Staff",2.0,"Turku","3000 KM and 3999 KM",7.0,null,null,{"$f":"IF(AND(M44>0,L44<>\"\"),IF(M44>(ROUND( (ROUND(ROUND(H44,0)*(VLOOKUP(J44,TravelCosts,2,FALSE)),2))/0.65,2)),ROUND(M44*0.8,2),\"covered by unit cost\"),0)","v":0},{"$f":"IF(OR(AND(L44<>\"\",M44>0,ISNUMBER(N44)),R44=\"Error\"),0,ROUND(ROUND(H44,0)*(VLOOKUP(J44,TravelCosts,2,FALSE)),2))","v":"#ERROR!"},"#ERROR!","#ERROR!",{"$f":"IF(OR(COUNTIF(WorkPackage,B13)=0,COUNTIF(PartnerN°,C13)=0,D13=\"\",COUNTIF(CountryALL,E13)=0,F13=\"\",COUNTIF(Category2,G13)=0,ISNUMBER(H13)=FALSE,H13<=0,I13=\"\",COUNTIF(TravelBands,J13)=0,ISNUMBER(K13)=FALSE,OR(K13<0,K13>90),IF(ISNUMBER(H13)=TRUE,H13=INT(H13*1)/1=FALSE),IF(ISNUMBER(K13)=TRUE,K13=INT(K13*1)/1=FALSE),AND(L13<>\"\",M13=0),AND(L13=\"\",M13>0),ISNUMBER(N13)=FALSE ),\"Error\",\"\")","v":"#ERROR!"}]
[null,"Development","P11",{"$f":"IFERROR(IF(VLOOKUP(C15,PartnerN°Ref,2,FALSE)=0,\"\",VLOOKUP(C15,PartnerN°Ref,2,FALSE)),\"\")","v":"#ERROR!"},{"$f":"IFERROR(IF(OR(VLOOKUP(C15,PartnerN°Ref,4,FALSE)=\"Country not found\",VLOOKUP(C15,PartnerN°Ref,3,FALSE)=0),\"\",VLOOKUP(C15,PartnerN°Ref,3,FALSE)),\"\")","v":"#ERROR!"},"Tehran ","Staff",2.0,"Turku","3000 KM and 3999 KM",7.0,null,null,{"$f":"IF(AND(M45>0,L45<>\"\"),IF(M45>(ROUND( (ROUND(ROUND(H45,0)*(VLOOKUP(J45,TravelCosts,2,FALSE)),2))/0.65,2)),ROUND(M45*0.8,2),\"covered by unit cost\"),0)","v":0},{"$f":"IF(OR(AND(L45<>\"\",M45>0,ISNUMBER(N45)),R45=\"Error\"),0,ROUND(ROUND(H45,0)*(VLOOKUP(J45,TravelCosts,2,FALSE)),2))","v":"#ERROR!"},"#ERROR!","#ERROR!",{"$f":"IF(OR(COUNTIF(WorkPackage,B45)=0,COUNTIF(PartnerN°,C45)=0,D45=\"\",COUNTIF(CountryALL,E45)=0,F45=\"\",COUNTIF(Category2,G45)=0,ISNUMBER(H45)=FALSE,H45<=0,I45=\"\",COUNTIF(TravelBands,J45)=0,ISNUMBER(K45)=FALSE,OR(K45<0,K45>90),IF(ISNUMBER(H45)=TRUE,H45=INT(H45*1)/1=FALSE),IF(ISNUMBER(K45)=TRUE,K45=INT(K45*1)/1=FALSE),AND(L45<>\"\",M45=0),AND(L45=\"\",M45>0),ISNUMBER(N45)=FALSE ),\"Error\",\"\")","v":"#ERROR!"}]
[null,"Development","P12",{"$f":"IFERROR(IF(VLOOKUP(C15,PartnerN°Ref,2,FALSE)=0,\"\",VLOOKUP(C15,PartnerN°Ref,2,FALSE)),\"\")","v":"#ERROR!"},{"$f":"IFERROR(IF(OR(VLOOKUP(C15,PartnerN°Ref,4,FALSE)=\"Country not found\",VLOOKUP(C15,PartnerN°Ref,3,FALSE)=0),\"\",VLOOKUP(C15,PartnerN°Ref,3,FALSE)),\"\")","v":"#ERROR!"},"Tehran ","Staff",2.0,"Turku","3000 KM and 3999 KM",7.0,null,null,{"$f":"IF(AND(M46>0,L46<>\"\"),IF(M46>(ROUND( (ROUND(ROUND(H46,0)*(VLOOKUP(J46,TravelCosts,2,FALSE)),2))/0.65,2)),ROUND(M46*0.8,2),\"covered by unit cost\"),0)","v":0},{"$f":"IF(OR(AND(L46<>\"\",M46>0,ISNUMBER(N46)),R46=\"Error\"),0,ROUND(ROUND(H46,0)*(VLOOKUP(J46,TravelCosts,2,FALSE)),2))","v":"#ERROR!"},"#ERROR!","#ERROR!",{"$f":"IF(OR(COUNTIF(WorkPackage,B45)=0,COUNTIF(PartnerN°,C45)=0,D45=\"\",COUNTIF(CountryALL,E45)=0,F45=\"\",COUNTIF(Category2,G45)=0,ISNUMBER(H45)=FALSE,H45<=0,I45=\"\",COUNTIF(TravelBands,J45)=0,ISNUMBER(K45)=FALSE,OR(K45<0,K45>90),IF(ISNUMBER(H45)=TRUE,H45=INT(H45*1)/1=FALSE),IF(ISNUMBER(K45)=TRUE,K45=INT(K45*1)/1=FALSE),AND(L45<>\"\",M45=0),AND(L45=\"\",M45>0),ISNUMBER(N45)=FALSE ),\"Error\",\"\")","v":"#ERROR!"}]
[null,"Development","P1",{"$f":"IFERROR(IF(VLOOKUP(C15,PartnerN°Ref,2,FALSE)=0,\"\",VLOOKUP(C15,PartnerN°Ref,2,FALSE)),\"\")","v":"#ERROR!"},{"$f":"IFERROR(IF(OR(VLOOKUP(C15,PartnerN°Ref,4,FALSE)=\"Country not found\",VLOOKUP(C15,PartnerN°Ref,3,FALSE)=0),\"\",VLOOKUP(C15,PartnerN°Ref,3,FALSE)),\"\")","v":"#ERROR!"},"Rome","Staff",3.0,"Qazvin","3000 KM and 3999 KM",5.0,null,null,{"$f":"IF(AND(M47>0,L47<>\"\"),IF(M47>(ROUND( (ROUND(ROUND(H47,0)*(VLOOKUP(J47,TravelCosts,2,FALSE)),2))/0.65,2)),ROUND(M47*0.8,2),\"covered by unit cost\"),0)","v":0},{"$f":"IF(OR(AND(L47<>\"\",M47>0,ISNUMBER(N47)),R47=\"Error\"),0,ROUND(ROUND(H47,0)*(VLOOKUP(J47,TravelCosts,2,FALSE)),2))","v":"#ERROR!"},"#ERROR!","#ERROR!",{"$f":"IF(OR(COUNTIF(WorkPackage,B45)=0,COUNTIF(PartnerN°,C45)=0,D45=\"\",COUNTIF(CountryALL,E45)=0,F45=\"\",COUNTIF(Category2,G45)=0,ISNUMBER(H45)=FALSE,H45<=0,I45=\"\",COUNTIF(TravelBands,J45)=0,ISNUMBER(K45)=FALSE,OR(K45<0,K45>90),IF(ISNUMBER(H45)=TRUE,H45=INT(H45*1)/1=FALSE),IF(ISNUMBER(K45)=TRUE,K45=INT(K45*1)/1=FALSE),AND(L45<>\"\",M45=0),AND(L45=\"\",M45>0),ISNUMBER(N45)=FALSE ),\"Error\",\"\")","v":"#ERROR!"}]
[null,"Development","P2",{"$f":"IFERROR(IF(VLOOKUP(C15,PartnerN°Ref,2,FALSE)=0,\"\",VLOOKUP(C15,PartnerN°Ref,2,FALSE)),\"\")","v":"#ERROR!"},{"$f":"IFERROR(IF(OR(VLOOKUP(C15,PartnerN°Ref,4,FALSE)=\"Country not found\",VLOOKUP(C15,PartnerN°Ref,3,FALSE)=0),\"\",VLOOKUP(C15,PartnerN°Ref,3,FALSE)),\"\")","v":"#ERROR!"},"Turku","Staff",3.0,"Qazvin","3000 KM and 3999 KM",5.0,null,null,{"$f":"IF(AND(M48>0,L48<>\"\"),IF(M48>(ROUND( (ROUND(ROUND(H48,0)*(VLOOKUP(J48,TravelCosts,2,FALSE)),2))/0.65,2)),ROUND(M48*0.8,2),\"covered by unit cost\"),0)","v":0},{"$f":"IF(OR(AND(L48<>\"\",M48>0,ISNUMBER(N48)),R48=\"Error\"),0,ROUND(ROUND(H48,0)*(VLOOKUP(J48,TravelCosts,2,FALSE)),2))","v":"#ERROR!"},"#ERROR!","#ERROR!",{"$f":"IF(OR(COUNTIF(WorkPackage,B45)=0,COUNTIF(PartnerN°,C45)=0,D45=\"\",COUNTIF(CountryALL,E45)=0,F45=\"\",COUNTIF(Category2,G45)=0,ISNUMBER(H45)=FALSE,H45<=0,I45=\"\",COUNTIF(TravelBands,J45)=0,ISNUMBER(K45)=FALSE,OR(K45<0,K45>90),IF(ISNUMBER(H45)=TRUE,H45=INT(H45*1)/1=FALSE),IF(ISNUMBER(K45)=TRUE,K45=INT(K45*1)/1=FALSE),AND(L45<>\"\",M45=0),AND(L45=\"\",M45>0),ISNUMBER(N45)=FALSE ),\"Error\",\"\")","v":"#ERROR!"}]
[null,"Development","P3",{"$f":"IFERROR(IF(VLOOKUP(C15,PartnerN°Ref,2,FALSE)=0,\"\",VLOOKUP(C15,PartnerN°Ref,2,FALSE)),\"\")","v":"#ERROR!"},{"$f":"IFERROR(IF(OR(VLOOKUP(C15,PartnerN°Ref,4,FALSE)=\"Country not found\",VLOOKUP(C15,PartnerN°Ref,3,FALSE)=0),\"\",VLOOKUP(C15,PartnerN°Ref,3,FALSE)),\"\")","v":"#ERROR!"},"Lisbon","Staff",3.0,"Qazvin","4000 KM and 7999 KM",5.0,null,null,{"$f":"IF(AND(M49>0,L49<>\"\"),IF(M49>(ROUND( (ROUND(ROUND(H49,0)*(VLOOKUP(J49,TravelCosts,2,FALSE)),2))/0.65,2)),ROUND(M49*0.8,2),\"covered by unit cost\"),0)","v":0},{"$f":"IF(OR(AND(L49<>\"\",M49>0,ISNUMBER(N49)),R49=\"Error\"),0,ROUND(ROUND(H49,0)*(VLOOKUP(J49,TravelCosts,2,FALSE)),2))","v":"#ERROR!"},"#ERROR!","#ERROR!",{"$f":"IF(OR(COUNTIF(WorkPackage,B45)=0,COUNTIF(PartnerN°,C45)=0,D45=\"\",COUNTIF(CountryALL,E45)=0,F45=\"\",COUNTIF(Category2,G45)=0,ISNUMBER(H45)=FALSE,H45<=0,I45=\"\",COUNTIF(TravelBands,J45)=0,ISNUMBER(K45)=FALSE,OR(K45<0,K45>90),IF(ISNUMBER(H45)=TRUE,H45=INT(H45*1)/1=FALSE),IF(ISNUMBER(K45)=TRUE,K45=INT(K45*1)/1=FALSE),AND(L45<>\"\",M45=0),AND(L45=\"\",M45>0),ISNUMBER(N45)=FALSE ),\"Error\",\"\")","v":"#ERROR!"}]
[null,"Development","P4",{"$f":"IFERROR(IF(VLOOKUP(C15,PartnerN°Ref,2,FALSE)=0,\"\",VLOOKUP(C15,PartnerN°Ref,2,FALSE)),\"\")","v":"#ERROR!"},{"$f":"IFERROR(IF(OR(VLOOKUP(C15,PartnerN°Ref,4,FALSE)=\"Country not found\",VLOOKUP(C15,PartnerN°Ref,3,FALSE)=0),\"\",VLOOKUP(C15,PartnerN°Ref,3,FALSE)),\"\")","v":"#ERROR!"},"Alexandropoulos ","Staff",3.0,"Qazvin","2000 KM and 2999 KM",5.0,null,null,{"$f":"IF(AND(M50>0,L50<>\"\"),IF(M50>(ROUND( (ROUND(ROUND(H50,0)*(VLOOKUP(J50,TravelCosts,2,FALSE)),2))/0.65,2)),ROUND(M50*0.8,2),\"covered by unit cost\"),0)","v":0},{"$f":"IF(OR(AND(L50<>\"\",M50>0,ISNUMBER(N50)),R50=\"Error\"),0,ROUND(ROUND(H50,0)*(VLOOKUP(J50,TravelCosts,2,FALSE)),2))","v":"#ERROR!"},"#ERROR!","#ERROR!",{"$f":"IF(OR(COUNTIF(WorkPackage,B45)=0,COUNTIF(PartnerN°,C45)=0,D45=\"\",COUNTIF(CountryALL,E45)=0,F45=\"\",COUNTIF(Category2,G45)=0,ISNUMBER(H45)=FALSE,H45<=0,I45=\"\",COUNTIF(TravelBands,J45)=0,ISNUMBER(K45)=FALSE,OR(K45<0,K45>90),IF(ISNUMBER(H45)=TRUE,H45=INT(H45*1)/1=FALSE),IF(ISNUMBER(K45)=TRUE,K45=INT(K45*1)/1=FALSE),AND(L45<>\"\",M45=0),AND(L45=\"\",M45>0),ISNUMBER(N45)=FALSE ),\"Error\",\"\")","v":"#ERROR!"}]
[null,"Development","P6",{"$f":"IFERROR(IF(VLOOKUP(C15,PartnerN°Ref,2,FALSE)=0,\"\",VLOOKUP(C15,PartnerN°Ref,2,FALSE)),\"\")","v":"#ERROR!"},{"$f":"IFERROR(IF(OR(VLOOKUP(C15,PartnerN°Ref,4,FALSE)=\"Country not found\",VLOOKUP(C15,PartnerN°Ref,3,FALSE)=0),\"\",VLOOKUP(C15,PartnerN°Ref,3,FALSE)),\"\")","v":"#ERROR!"},"Zahedan ","Staff",2.0,"Qazvin","500 KM and 1999 KM",5.0,null,null,{"$f":"IF(AND(M51>0,L51<>\"\"),IF(M51>(ROUND( (ROUND(ROUND(H51,0)*(VLOOKUP(J51,TravelCosts,2,FALSE)),2))/0.65,2)),ROUND(M51*0.8,2),\"covered by unit cost\"),0)","v":0},{"$f":"IF(OR(AND(L51<>\"\",M51>0,ISNUMBER(N51)),R51=\"Error\"),0,ROUND(ROUND(H51,0)*(VLOOKUP(J51,TravelCosts,2,FALSE)),2))","v":"#ERROR!"},"#ERROR!","#ERROR!",{"$f":"IF(OR(COUNTIF(WorkPackage,B45)=0,COUNTIF(PartnerN°,C45)=0,D45=\"\",COUNTIF(CountryALL,E45)=0,F45=\"\",COUNTIF(Category2,G45)=0,ISNUMBER(H45)=FALSE,H45<=0,I45=\"\",COUNTIF(TravelBands,J45)=0,ISNUMBER(K45)=FALSE,OR(K45<0,K45>90),IF(ISNUMBER(H45)=TRUE,H45=INT(H45*1)/1=FALSE),IF(ISNUMBER(K45)=TRUE,K45=INT(K45*1)/1=FALSE),AND(L45<>\"\",M45=0),AND(L45=\"\",M45>0),ISNUMBER(N45)=FALSE ),\"Error\",\"\")","v":"#ERROR!"}]
[null,"Development","P6",{"$f":"IFERROR(IF(VLOOKUP(C15,PartnerN°Ref,2,FALSE)=0,\"\",VLOOKUP(C15,PartnerN°Ref,2,FALSE)),\"\")","v":"#ERROR!"},{"$f":"IFERROR(IF(OR(VLOOKUP(C15,PartnerN°Ref,4,FALSE)=\"Country not found\",VLOOKUP(C15,PartnerN°Ref,3,FALSE)=0),\"\",VLOOKUP(C15,PartnerN°Ref,3,FALSE)),\"\")","v":"#ERROR!"},"Zahedan ","Staff",3.0,"Qazvin","500 KM and 1999 KM",3.0,null,null,{"$f":"IF(AND(M52>0,L52<>\"\"),IF(M52>(ROUND( (ROUND(ROUND(H52,0)*(VLOOKUP(J52,TravelCosts,2,FALSE)),2))/0.65,2)),ROUND(M52*0.8,2),\"covered by unit cost\"),0)","v":0},{"$f":"IF(OR(AND(L52<>\"\",M52>0,ISNUMBER(N52)),R52=\"Error\"),0,ROUND(ROUND(H52,0)*(VLOOKUP(J52,TravelCosts,2,FALSE)),2))","v":"#ERROR!"},"#ERROR!","#ERROR!",{"$f":"IF(OR(COUNTIF(WorkPackage,B45)=0,COUNTIF(PartnerN°,C45)=0,D45=\"\",COUNTIF(CountryALL,E45)=0,F45=\"\",COUNTIF(Category2,G45)=0,ISNUMBER(H45)=FALSE,H45<=0,I45=\"\",COUNTIF(TravelBands,J45)=0,ISNUMBER(K45)=FALSE,OR(K45<0,K45>90),IF(ISNUMBER(H45)=TRUE,H45=INT(H45*1)/1=FALSE),IF(ISNUMBER(K45)=TRUE,K45=INT(K45*1)/1=FALSE),AND(L45<>\"\",M45=0),AND(L45=\"\",M45>0),ISNUMBER(N45)=FALSE ),\"Error\",\"\")","v":"#ERROR!"}]
[null,"Development","P7",{"$f":"IFERROR(IF(VLOOKUP(C15,PartnerN°Ref,2,FALSE)=0,\"\",VLOOKUP(C15,PartnerN°Ref,2,FALSE)),\"\")","v":"#ERROR!"},{"$f":"IFERROR(IF(OR(VLOOKUP(C15,PartnerN°Ref,4,FALSE)=\"Country not found\",VLOOKUP(C15,PartnerN°Ref,3,FALSE)=0),\"\",VLOOKUP(C15,PartnerN°Ref,3,FALSE)),\"\")","v":"#ERROR!"},"Shiraz","Staff",2.0,"Qazvin","500 KM and 1999 KM",5.0,null,null,{"$f":"IF(AND(M53>0,L53<>\"\"),IF(M53>(ROUND( (ROUND(ROUND(H53,0)*(VLOOKUP(J53,TravelCosts,2,FALSE)),2))/0.65,2)),ROUND(M53*0.8,2),\"covered by unit cost\"),0)","v":0},{"$f":"IF(OR(AND(L53<>\"\",M53>0,ISNUMBER(N53)),R53=\"Error\"),0,ROUND(ROUND(H53,0)*(VLOOKUP(J53,TravelCosts,2,FALSE)),2))","v":"#ERROR!"},"#ERROR!","#ERROR!",{"$f":"IF(OR(COUNTIF(WorkPackage,B45)=0,COUNTIF(PartnerN°,C45)=0,D45=\"\",COUNTIF(CountryALL,E45)=0,F45=\"\",COUNTIF(Category2,G45)=0,ISNUMBER(H45)=FALSE,H45<=0,I45=\"\",COUNTIF(TravelBands,J45)=0,ISNUMBER(K45)=FALSE,OR(K45<0,K45>90),IF(ISNUMBER(H45)=TRUE,H45=INT(H45*1)/1=FALSE),IF(ISNUMBER(K45)=TRUE,K45=INT(K45*1)/1=FALSE),AND(L45<>\"\",M45=0),AND(L45=\"\",M45>0),ISNUMBER(N45)=FALSE ),\"Error\",\"\")","v":"#ERROR!"}]
[null,"Development","P7",{"$f":"IFERROR(IF(VLOOKUP(C15,PartnerN°Ref,2,FALSE)=0,\"\",VLOOKUP(C15,PartnerN°Ref,2,FALSE)),\"\")","v":"#ERROR!"},{"$f":"IFERROR(IF(OR(VLOOKUP(C15,PartnerN°Ref,4,FALSE)=\"Country not found\",VLOOKUP(C15,PartnerN°Ref,3,FALSE)=0),\"\",VLOOKUP(C15,PartnerN°Ref,3,FALSE)),\"\")","v":"#ERROR!"},"Shiraz","Staff",3.0,"Qazvin","500 KM and 1999 KM",3.0,null,null,{"$f":"IF(AND(M54>0,L54<>\"\"),IF(M54>(ROUND( (ROUND(ROUND(H54,0)*(VLOOKUP(J54,TravelCosts,2,FALSE)),2))/0.65,2)),ROUND(M54*0.8,2),\"covered by unit cost\"),0)","v":0},{"$f":"IF(OR(AND(L54<>\"\",M54>0,ISNUMBER(N54)),R54=\"Error\"),0,ROUND(ROUND(H54,0)*(VLOOKUP(J54,TravelCosts,2,FALSE)),2))","v":"#ERROR!"},"#ERROR!","#ERROR!",{"$f":"IF(OR(COUNTIF(WorkPackage,B45)=0,COUNTIF(PartnerN°,C45)=0,D45=\"\",COUNTIF(CountryALL,E45)=0,F45=\"\",COUNTIF(Category2,G45)=0,ISNUMBER(H45)=FALSE,H45<=0,I45=\"\",COUNTIF(TravelBands,J45)=0,ISNUMBER(K45)=FALSE,OR(K45<0,K45>90),IF(ISNUMBER(H45)=TRUE,H45=INT(H45*1)/1=FALSE),IF(ISNUMBER(K45)=TRUE,K45=INT(K45*1)/1=FALSE),AND(L45<>\"\",M45=0),AND(L45=\"\",M45>0),ISNUMBER(N45)=FALSE ),\"Error\",\"\")","v":"#ERROR!"}]
[null,"Development","P8",{"$f":"IFERROR(IF(VLOOKUP(C15,PartnerN°Ref,2,FALSE)=0,\"\",VLOOKUP(C15,PartnerN°Ref,2,FALSE)),\"\")","v":"#ERROR!"},{"$f":"IFERROR(IF(OR(VLOOKUP(C15,PartnerN°Ref,4,FALSE)=\"Country not found\",VLOOKUP(C15,PartnerN°Ref,3,FALSE)=0),\"\",VLOOKUP(C15,PartnerN°Ref,3,FALSE)),\"\")","v":"#ERROR!"},"Isfahan ","Staff",2.0,"Qazvin","100 KM and 499 KM",5.0,null,null,{"$f":"IF(AND(M55>0,L55<>\"\"),IF(M55>(ROUND( (ROUND(ROUND(H55,0)*(VLOOKUP(J55,TravelCosts,2,FALSE)),2))/0.65,2)),ROUND(M55*0.8,2),\"covered by unit cost\"),0)","v":0},{"$f":"IF(OR(AND(L55<>\"\",M55>0,ISNUMBER(N55)),R55=\"Error\"),0,ROUND(ROUND(H55,0)*(VLOOKUP(J55,TravelCosts,2,FALSE)),2))","v":"#ERROR!"},"#ERROR!","#ERROR!",{"$f":"IF(OR(COUNTIF(WorkPackage,B45)=0,COUNTIF(PartnerN°,C45)=0,D45=\"\",COUNTIF(CountryALL,E45)=0,F45=\"\",COUNTIF(Category2,G45)=0,ISNUMBER(H45)=FALSE,H45<=0,I45=\"\",COUNTIF(TravelBands,J45)=0,ISNUMBER(K45)=FALSE,OR(K45<0,K45>90),IF(ISNUMBER(H45)=TRUE,H45=INT(H45*1)/1=FALSE),IF(ISNUMBER(K45)=TRUE,K45=INT(K45*1)/1=FALSE),AND(L45<>\"\",M45=0),AND(L45=\"\",M45>0),ISNUMBER(N45)=FALSE ),\"Error\",\"\")","v":"#ERROR!"}]
[null,"Development","P8",{"$f":"IFERROR(IF(VLOOKUP(C15,PartnerN°Ref,2,FALSE)=0,\"\",VLOOKUP(C15,PartnerN°Ref,2,FALSE)),\"\")","v":"#ERROR!"},{"$f":"IFERROR(IF(OR(VLOOKUP(C15,PartnerN°Ref,4,FALSE)=\"Country not found\",VLOOKUP(C15,PartnerN°Ref,3,FALSE)=0),\"\",VLOOKUP(C15,PartnerN°Ref,3,FALSE)),\"\")","v":"#ERROR!"},"Isfahan ","Staff",3.0,"Qazvin","100 KM and 499 KM",3.0,null,null,{"$f":"IF(AND(M56>0,L56<>\"\"),IF(M56>(ROUND( (ROUND(ROUND(H56,0)*(VLOOKUP(J56,TravelCosts,2,FALSE)),2))/0.65,2)),ROUND(M56*0.8,2),\"covered by unit cost\"),0)","v":0},{"$f":"IF(OR(AND(L56<>\"\",M56>0,ISNUMBER(N56)),R56=\"Error\"),0,ROUND(ROUND(H56,0)*(VLOOKUP(J56,TravelCosts,2,FALSE)),2))","v":"#ERROR!"},"#ERROR!","#ERROR!",{"$f":"IF(OR(COUNTIF(WorkPackage,B45)=0,COUNTIF(PartnerN°,C45)=0,D45=\"\",COUNTIF(CountryALL,E45)=0,F45=\"\",COUNTIF(Category2,G45)=0,ISNUMBER(H45)=FALSE,H45<=0,I45=\"\",COUNTIF(TravelBands,J45)=0,ISNUMBER(K45)=FALSE,OR(K45<0,K45>90),IF(ISNUMBER(H45)=TRUE,H45=INT(H45*1)/1=FALSE),IF(ISNUMBER(K45)=TRUE,K45=INT(K45*1)/1=FALSE),AND(L45<>\"\",M45=0),AND(L45=\"\",M45>0),ISNUMBER(N45)=FALSE ),\"Error\",\"\")","v":"#ERROR!"}]
[null,"Development","P9",{"$f":"IFERROR(IF(VLOOKUP(C15,PartnerN°Ref,2,FALSE)=0,\"\",VLOOKUP(C15,PartnerN°Ref,2,FALSE)),\"\")","v":"#ERROR!"},{"$f":"IFERROR(IF(OR(VLOOKUP(C15,PartnerN°Ref,4,FALSE)=\"Country not found\",VLOOKUP(C15,PartnerN°Ref,3,FALSE)=0),\"\",VLOOKUP(C15,PartnerN°Ref,3,FALSE)),\"\")","v":"#ERROR!"},"Tehran ","Staff",2.0,"Qazvin","100 KM and 499 KM",5.0,null,null,{"$f":"IF(AND(M57>0,L57<>\"\"),IF(M57>(ROUND( (ROUND(ROUND(H57,0)*(VLOOKUP(J57,TravelCosts,2,FALSE)),2))/0.65,2)),ROUND(M57*0.8,2),\"covered by unit cost\"),0)","v":0},{"$f":"IF(OR(AND(L57<>\"\",M57>0,ISNUMBER(N57)),R57=\"Error\"),0,ROUND(ROUND(H57,0)*(VLOOKUP(J57,TravelCosts,2,FALSE)),2))","v":"#ERROR!"},"#ERROR!","#ERROR!",{"$f":"IF(OR(COUNTIF(WorkPackage,B45)=0,COUNTIF(PartnerN°,C45)=0,D45=\"\",COUNTIF(CountryALL,E45)=0,F45=\"\",COUNTIF(Category2,G45)=0,ISNUMBER(H45)=FALSE,H45<=0,I45=\"\",COUNTIF(TravelBands,J45)=0,ISNUMBER(K45)=FALSE,OR(K45<0,K45>90),IF(ISNUMBER(H45)=TRUE,H45=INT(H45*1)/1=FALSE),IF(ISNUMBER(K45)=TRUE,K45=INT(K45*1)/1=FALSE),AND(L45<>\"\",M45=0),AND(L45=\"\",M45>0),ISNUMBER(N45)=FALSE ),\"Error\",\"\")","v":"#ERROR!"}]
[null,"Development","P9",{"$f":"IFERROR(IF(VLOOKUP(C15,PartnerN°Ref,2,FALSE)=0,\"\",VLOOKUP(C15,PartnerN°Ref,2,FALSE)),\"\")","v":"#ERROR!"},{"$f":"IFERROR(IF(OR(VLOOKUP(C15,PartnerN°Ref,4,FALSE)=\"Country not found\",VLOOKUP(C15,PartnerN°Ref,3,FALSE)=0),\"\",VLOOKUP(C15,PartnerN°Ref,3,FALSE)),\"\")","v":"#ERROR!"},"Tehran ","Staff",3.0,"Qazvin","100 KM and 499 KM",3.0,null,null,{"$f":"IF(AND(M58>0,L58<>\"\"),IF(M58>(ROUND( (ROUND(ROUND(H58,0)*(VLOOKUP(J58,TravelCosts,2,FALSE)),2))/0.65,2)),ROUND(M58*0.8,2),\"covered by unit cost\"),0)","v":0},{"$f":"IF(OR(AND(L58<>\"\",M58>0,ISNUMBER(N58)),R58=\"Error\"),0,ROUND(ROUND(H58,0)*(VLOOKUP(J58,TravelCosts,2,FALSE)),2))","v":"#ERROR!"},"#ERROR!","#ERROR!",{"$f":"IF(OR(COUNTIF(WorkPackage,B45)=0,COUNTIF(PartnerN°,C45)=0,D45=\"\",COUNTIF(CountryALL,E45)=0,F45=\"\",COUNTIF(Category2,G45)=0,ISNUMBER(H45)=FALSE,H45<=0,I45=\"\",COUNTIF(TravelBands,J45)=0,ISNUMBER(K45)=FALSE,OR(K45<0,K45>90),IF(ISNUMBER(H45)=TRUE,H45=INT(H45*1)/1=FALSE),IF(ISNUMBER(K45)=TRUE,K45=INT(K45*1)/1=FALSE),AND(L45<>\"\",M45=0),AND(L45=\"\",M45>0),ISNUMBER(N45)=FALSE ),\"Error\",\"\")","v":"#ERROR!"}]
[null,"Development","P10",{"$f":"IFERROR(IF(VLOOKUP(C15,PartnerN°Ref,2,FALSE)=0,\"\",VLOOKUP(C15,PartnerN°Ref,2,FALSE)),\"\")","v":"#ERROR!"},{"$f":"IFERROR(IF(OR(VLOOKUP(C15,PartnerN°Ref,4,FALSE)=\"Country not found\",VLOOKUP(C15,PartnerN°Ref,3,FALSE)=0),\"\",VLOOKUP(C15,PartnerN°Ref,3,FALSE)),\"\")","v":"#ERROR!"},"Ahvaz","Staff",2.0,"Qazvin","500 KM and 1999 KM",5.0,null,null,{"$f":"IF(AND(M59>0,L59<>\"\"),IF(M59>(ROUND( (ROUND(ROUND(H59,0)*(VLOOKUP(J59,TravelCosts,2,FALSE)),2))/0.65,2)),ROUND(M59*0.8,2),\"covered by unit cost\"),0)","v":0},{"$f":"IF(OR(AND(L59<>\"\",M59>0,ISNUMBER(N59)),R59=\"Error\"),0,ROUND(ROUND(H59,0)*(VLOOKUP(J59,TravelCosts,2,FALSE)),2))","v":"#ERROR!"},"#ERROR!","#ERROR!",{"$f":"IF(OR(COUNTIF(WorkPackage,B45)=0,COUNTIF(PartnerN°,C45)=0,D45=\"\",COUNTIF(CountryALL,E45)=0,F45=\"\",COUNTIF(Category2,G45)=0,ISNUMBER(H45)=FALSE,H45<=0,I45=\"\",COUNTIF(TravelBands,J45)=0,ISNUMBER(K45)=FALSE,OR(K45<0,K45>90),IF(ISNUMBER(H45)=TRUE,H45=INT(H45*1)/1=FALSE),IF(ISNUMBER(K45)=TRUE,K45=INT(K45*1)/1=FALSE),AND(L45<>\"\",M45=0),AND(L45=\"\",M45>0),ISNUMBER(N45)=FALSE ),\"Error\",\"\")","v":"#ERROR!"}]
[null,"Development","P10",{"$f":"IFERROR(IF(VLOOKUP(C15,PartnerN°Ref,2,FALSE)=0,\"\",VLOOKUP(C15,PartnerN°Ref,2,FALSE)),\"\")","v":"#ERROR!"},{"$f":"IFERROR(IF(OR(VLOOKUP(C15,PartnerN°Ref,4,FALSE)=\"Country not found\",VLOOKUP(C15,PartnerN°Ref,3,FALSE)=0),\"\",VLOOKUP(C15,PartnerN°Ref,3,FALSE)),\"\")","v":"#ERROR!"},"Ahvaz","Staff",3.0,"Qazvin","500 KM and 1999 KM",3.0,null,null,{"$f":"IF(AND(M60>0,L60<>\"\"),IF(M60>(ROUND( (ROUND(ROUND(H60,0)*(VLOOKUP(J60,TravelCosts,2,FALSE)),2))/0.65,2)),ROUND(M60*0.8,2),\"covered by unit cost\"),0)","v":0},{"$f":"IF(OR(AND(L60<>\"\",M60>0,ISNUMBER(N60)),R60=\"Error\"),0,ROUND(ROUND(H60,0)*(VLOOKUP(J60,TravelCosts,2,FALSE)),2))","v":"#ERROR!"},"#ERROR!","#ERROR!",{"$f":"IF(OR(COUNTIF(WorkPackage,B45)=0,COUNTIF(PartnerN°,C45)=0,D45=\"\",COUNTIF(CountryALL,E45)=0,F45=\"\",COUNTIF(Category2,G45)=0,ISNUMBER(H45)=FALSE,H45<=0,I45=\"\",COUNTIF(TravelBands,J45)=0,ISNUMBER(K45)=FALSE,OR(K45<0,K45>90),IF(ISNUMBER(H45)=TRUE,H45=INT(H45*1)/1=FALSE),IF(ISNUMBER(K45)=TRUE,K45=INT(K45*1)/1=FALSE),AND(L45<>\"\",M45=0),AND(L45=\"\",M45>0),ISNUMBER(N45)=FALSE ),\"Error\",\"\")","v":"#ERROR!"}]
[null,"Development","P11",{"$f":"IFERROR(IF(VLOOKUP(C15,PartnerN°Ref,2,FALSE)=0,\"\",VLOOKUP(C15,PartnerN°Ref,2,FALSE)),\"\")","v":"#ERROR!"},{"$f":"IFERROR(IF(OR(VLOOKUP(C15,PartnerN°Ref,4,FALSE)=\"Country not found\",VLOOKUP(C15,PartnerN°Ref,3,FALSE)=0),\"\",VLOOKUP(C15,PartnerN°Ref,3,FALSE)),\"\")","v":"#ERROR!"},"Tehran ","Staff",2.0,"Qazvin","100 KM and 499 KM",5.0,null,null,{"$f":"IF(AND(M61>0,L61<>\"\"),IF(M61>(ROUND( (ROUND(ROUND(H61,0)*(VLOOKUP(J61,TravelCosts,2,FALSE)),2))/0.65,2)),ROUND(M61*0.8,2),\"covered by unit cost\"),0)","v":0},{"$f":"IF(OR(AND(L61<>\"\",M61>0,ISNUMBER(N61)),R61=\"Error\"),0,ROUND(ROUND(H61,0)*(VLOOKUP(J61,TravelCosts,2,FALSE)),2))","v":"#ERROR!"},"#ERROR!","#ERROR!",{"$f":"IF(OR(COUNTIF(WorkPackage,B45)=0,COUNTIF(PartnerN°,C45)=0,D45=\"\",COUNTIF(CountryALL,E45)=0,F45=\"\",COUNTIF(Category2,G45)=0,ISNUMBER(H45)=FALSE,H45<=0,I45=\"\",COUNTIF(TravelBands,J45)=0,ISNUMBER(K45)=FALSE,OR(K45<0,K45>90),IF(ISNUMBER(H45)=TRUE,H45=INT(H45*1)/1=FALSE),IF(ISNUMBER(K45)=TRUE,K45=INT(K45*1)/1=FALSE),AND(L45<>\"\",M45=0),AND(L45=\"\",M45>0),ISNUMBER(N45)=FALSE ),\"Error\",\"\")","v":"#ERROR!"}]
[null,"Development","P11",{"$f":"IFERROR(IF(VLOOKUP(C15,PartnerN°Ref,2,FALSE)=0,\"\",VLOOKUP(C15,PartnerN°Ref,2,FALSE)),\"\")","v":"#ERROR!"},{"$f":"IFERROR(IF(OR(VLOOKUP(C15,PartnerN°Ref,4,FALSE)=\"Country not found\",VLOOKUP(C15,PartnerN°Ref,3,FALSE)=0),\"\",VLOOKUP(C15,PartnerN°Ref,3,FALSE)),\"\")","v":"#ERROR!"},"Tehran ","Staff",3.0,"Qazvin","100 KM and 499 KM",3.0,null,null,{"$f":"IF(AND(M62>0,L62<>\"\"),IF(M62>(ROUND( (ROUND(ROUND(H62,0)*(VLOOKUP(J62,TravelCosts,2,FALSE)),2))/0.65,2)),ROUND(M62*0.8,2),\"covered by unit cost\"),0)","v":0},{"$f":"IF(OR(AND(L62<>\"\",M62>0,ISNUMBER(N62)),R62=\"Error\"),0,ROUND(ROUND(H62,0)*(VLOOKUP(J62,TravelCosts,2,FALSE)),2))","v":"#ERROR!"},"#ERROR!","#ERROR!",{"$f":"IF(OR(COUNTIF(WorkPackage,B45)=0,COUNTIF(PartnerN°,C45)=0,D45=\"\",COUNTIF(CountryALL,E45)=0,F45=\"\",COUNTIF(Category2,G45)=0,ISNUMBER(H45)=FALSE,H45<=0,I45=\"\",COUNTIF(TravelBands,J45)=0,ISNUMBER(K45)=FALSE,OR(K45<0,K45>90),IF(ISNUMBER(H45)=TRUE,H45=INT(H45*1)/1=FALSE),IF(ISNUMBER(K45)=TRUE,K45=INT(K45*1)/1=FALSE),AND(L45<>\"\",M45=0),AND(L45=\"\",M45>0),ISNUMBER(N45)=FALSE ),\"Error\",\"\")","v":"#ERROR!"}]
[null,"Development","P12",{"$f":"IFERROR(IF(VLOOKUP(C15,PartnerN°Ref,2,FALSE)=0,\"\",VLOOKUP(C15,PartnerN°Ref,2,FALSE)),\"\")","v":"#ERROR!"},{"$f":"IFERROR(IF(OR(VLOOKUP(C15,PartnerN°Ref,4,FALSE)=\"Country not found\",VLOOKUP(C15,PartnerN°Ref,3,FALSE)=0),\"\",VLOOKUP(C15,PartnerN°Ref,3,FALSE)),\"\")","v":"#ERROR!"},"Tehran ","Staff",3.0,"Qazvin","100 KM and 499 KM",5.0,null,null,{"$f":"IF(AND(M63>0,L63<>\"\"),IF(M63>(ROUND( (ROUND(ROUND(H63,0)*(VLOOKUP(J63,TravelCosts,2,FALSE)),2))/0.65,2)),ROUND(M63*0.8,2),\"covered by unit cost\"),0)","v":0},{"$f":"IF(OR(AND(L63<>\"\",M63>0,ISNUMBER(N63)),R63=\"Error\"),0,ROUND(ROUND(H63,0)*(VLOOKUP(J63,TravelCosts,2,FALSE)),2))","v":"#ERROR!"},"#ERROR!","#ERROR!",{"$f":"IF(OR(COUNTIF(WorkPackage,B45)=0,COUNTIF(PartnerN°,C45)=0,D45=\"\",COUNTIF(CountryALL,E45)=0,F45=\"\",COUNTIF(Category2,G45)=0,ISNUMBER(H45)=FALSE,H45<=0,I45=\"\",COUNTIF(TravelBands,J45)=0,ISNUMBER(K45)=FALSE,OR(K45<0,K45>90),IF(ISNUMBER(H45)=TRUE,H45=INT(H45*1)/1=FALSE),IF(ISNUMBER(K45)=TRUE,K45=INT(K45*1)/1=FALSE),AND(L45<>\"\",M45=0),AND(L45=\"\",M45>0),ISNUMBER(N45)=FALSE ),\"Error\",\"\")","v":"#ERROR!"}]
[null,"Development","P2",{"$f":"IFERROR(IF(VLOOKUP(C15,PartnerN°Ref,2,FALSE)=0,\"\",VLOOKUP(C15,PartnerN°Ref,2,FALSE)),\"\")","v":"#ERROR!"},{"$f":"IFERROR(IF(OR(VLOOKUP(C15,PartnerN°Ref,4,FALSE)=\"Country not found\",VLOOKUP(C15,PartnerN°Ref,3,FALSE)=0),\"\",VLOOKUP(C15,PartnerN°Ref,3,FALSE)),\"\")","v":"#ERROR!"},"Turku","Staff",2.0,"Rome ","2000 KM and 2999 KM",7.0,null,null,{"$f":"IF(AND(M64>0,L64<>\"\"),IF(M64>(ROUND( (ROUND(ROUND(H64,0)*(VLOOKUP(J64,TravelCosts,2,FALSE)),2))/0.65,2)),ROUND(M64*0.8,2),\"covered by unit cost\"),0)","v":0},{"$f":"IF(OR(AND(L64<>\"\",M64>0,ISNUMBER(N64)),R64=\"Error\"),0,ROUND(ROUND(H64,0)*(VLOOKUP(J64,TravelCosts,2,FALSE)),2))","v":"#ERROR!"},"#ERROR!","#ERROR!",{"$f":"IF(OR(COUNTIF(WorkPackage,B45)=0,COUNTIF(PartnerN°,C45)=0,D45=\"\",COUNTIF(CountryALL,E45)=0,F45=\"\",COUNTIF(Category2,G45)=0,ISNUMBER(H45)=FALSE,H45<=0,I45=\"\",COUNTIF(TravelBands,J45)=0,ISNUMBER(K45)=FALSE,OR(K45<0,K45>90),IF(ISNUMBER(H45)=TRUE,H45=INT(H45*1)/1=FALSE),IF(ISNUMBER(K45)=TRUE,K45=INT(K45*1)/1=FALSE),AND(L45<>\"\",M45=0),AND(L45=\"\",M45>0),ISNUMBER(N45)=FALSE ),\"Error\",\"\")","v":"#ERROR!"}]
[null,"Development","P3",{"$f":"IFERROR(IF(VLOOKUP(C15,PartnerN°Ref,2,FALSE)=0,\"\",VLOOKUP(C15,PartnerN°Ref,2,FALSE)),\"\")","v":"#ERROR!"},{"$f":"IFERROR(IF(OR(VLOOKUP(C15,PartnerN°Ref,4,FALSE)=\"Country not found\",VLOOKUP(C15,PartnerN°Ref,3,FALSE)=0),\"\",VLOOKUP(C15,PartnerN°Ref,3,FALSE)),\"\")","v":"#ERROR!"},"Lisbon ","Staff",2.0,"Rome ","500 KM and 1999 KM",7.0,null,null,{"$f":"IF(AND(M65>0,L65<>\"\"),IF(M65>(ROUND( (ROUND(ROUND(H65,0)*(VLOOKUP(J65,TravelCosts,2,FALSE)),2))/0.65,2)),ROUND(M65*0.8,2),\"covered by unit cost\"),0)","v":0},{"$f":"IF(OR(AND(L65<>\"\",M65>0,ISNUMBER(N65)),R65=\"Error\"),0,ROUND(ROUND(H65,0)*(VLOOKUP(J65,TravelCosts,2,FALSE)),2))","v":"#ERROR!"},"#ERROR!","#ERROR!",{"$f":"IF(OR(COUNTIF(WorkPackage,B45)=0,COUNTIF(PartnerN°,C45)=0,D45=\"\",COUNTIF(CountryALL,E45)=0,F45=\"\",COUNTIF(Category2,G45)=0,ISNUMBER(H45)=FALSE,H45<=0,I45=\"\",COUNTIF(TravelBands,J45)=0,ISNUMBER(K45)=FALSE,OR(K45<0,K45>90),IF(ISNUMBER(H45)=TRUE,H45=INT(H45*1)/1=FALSE),IF(ISNUMBER(K45)=TRUE,K45=INT(K45*1)/1=FALSE),AND(L45<>\"\",M45=0),AND(L45=\"\",M45>0),ISNUMBER(N45)=FALSE ),\"Error\",\"\")","v":"#ERROR!"}]
[null,"Development","P4",{"$f":"IFERROR(IF(VLOOKUP(C15,PartnerN°Ref,2,FALSE)=0,\"\",VLOOKUP(C15,PartnerN°Ref,2,FALSE)),\"\")","v":"#ERROR!"},{"$f":"IFERROR(IF(OR(VLOOKUP(C15,PartnerN°Ref,4,FALSE)=\"Country not found\",VLOOKUP(C15,PartnerN°Ref,3,FALSE)=0),\"\",VLOOKUP(C15,PartnerN°Ref,3,FALSE)),\"\")","v":"#ERROR!"},"Alexandropoulos","Staff",2.0,"Rome ","500 KM and 1999 KM",7.0,null,null,{"$f":"IF(AND(M66>0,L66<>\"\"),IF(M66>(ROUND( (ROUND(ROUND(H66,0)*(VLOOKUP(J66,TravelCosts,2,FALSE)),2))/0.65,2)),ROUND(M66*0.8,2),\"covered by unit cost\"),0)","v":0},{"$f":"IF(OR(AND(L66<>\"\",M66>0,ISNUMBER(N66)),R66=\"Error\"),0,ROUND(ROUND(H66,0)*(VLOOKUP(J66,TravelCosts,2,FALSE)),2))","v":"#ERROR!"},"#ERROR!","#ERROR!",{"$f":"IF(OR(COUNTIF(WorkPackage,B45)=0,COUNTIF(PartnerN°,C45)=0,D45=\"\",COUNTIF(CountryALL,E45)=0,F45=\"\",COUNTIF(Category2,G45)=0,ISNUMBER(H45)=FALSE,H45<=0,I45=\"\",COUNTIF(TravelBands,J45)=0,ISNUMBER(K45)=FALSE,OR(K45<0,K45>90),IF(ISNUMBER(H45)=TRUE,H45=INT(H45*1)/1=FALSE),IF(ISNUMBER(K45)=TRUE,K45=INT(K45*1)/1=FALSE),AND(L45<>\"\",M45=0),AND(L45=\"\",M45>0),ISNUMBER(N45)=FALSE ),\"Error\",\"\")","v":"#ERROR!"}]
[null,"Development","P5",{"$f":"IFERROR(IF(VLOOKUP(C15,PartnerN°Ref,2,FALSE)=0,\"\",VLOOKUP(C15,PartnerN°Ref,2,FALSE)),\"\")","v":"#ERROR!"},{"$f":"IFERROR(IF(OR(VLOOKUP(C15,PartnerN°Ref,4,FALSE)=\"Country not found\",VLOOKUP(C15,PartnerN°Ref,3,FALSE)=0),\"\",VLOOKUP(C15,PartnerN°Ref,3,FALSE)),\"\")","v":"#ERROR!"},"Qazvin ","Staff",2.0,"Rome ","3000 KM and 3999 KM",7.0,null,null,{"$f":"IF(AND(M67>0,L67<>\"\"),IF(M67>(ROUND( (ROUND(ROUND(H67,0)*(VLOOKUP(J67,TravelCosts,2,FALSE)),2))/0.65,2)),ROUND(M67*0.8,2),\"covered by unit cost\"),0)","v":0},{"$f":"IF(OR(AND(L67<>\"\",M67>0,ISNUMBER(N67)),R67=\"Error\"),0,ROUND(ROUND(H67,0)*(VLOOKUP(J67,TravelCosts,2,FALSE)),2))","v":"#ERROR!"},"#ERROR!","#ERROR!",{"$f":"IF(OR(COUNTIF(WorkPackage,B45)=0,COUNTIF(PartnerN°,C45)=0,D45=\"\",COUNTIF(CountryALL,E45)=0,F45=\"\",COUNTIF(Category2,G45)=0,ISNUMBER(H45)=FALSE,H45<=0,I45=\"\",COUNTIF(TravelBands,J45)=0,ISNUMBER(K45)=FALSE,OR(K45<0,K45>90),IF(ISNUMBER(H45)=TRUE,H45=INT(H45*1)/1=FALSE),IF(ISNUMBER(K45)=TRUE,K45=INT(K45*1)/1=FALSE),AND(L45<>\"\",M45=0),AND(L45=\"\",M45>0),ISNUMBER(N45)=FALSE ),\"Error\",\"\")","v":"#ERROR!"}]
[null,"Development","P6",{"$f":"IFERROR(IF(VLOOKUP(C15,PartnerN°Ref,2,FALSE)=0,\"\",VLOOKUP(C15,PartnerN°Ref,2,FALSE)),\"\")","v":"#ERROR!"},{"$f":"IFERROR(IF(OR(VLOOKUP(C15,PartnerN°Ref,4,FALSE)=\"Country not found\",VLOOKUP(C15,PartnerN°Ref,3,FALSE)=0),\"\",VLOOKUP(C15,PartnerN°Ref,3,FALSE)),\"\")","v":"#ERROR!"},"Zahedan ","Staff",2.0,"Rome ","4000 KM and 7999 KM",7.0,null,null,{"$f":"IF(AND(M68>0,L68<>\"\"),IF(M68>(ROUND( (ROUND(ROUND(H68,0)*(VLOOKUP(J68,TravelCosts,2,FALSE)),2))/0.65,2)),ROUND(M68*0.8,2),\"covered by unit cost\"),0)","v":0},{"$f":"IF(OR(AND(L68<>\"\",M68>0,ISNUMBER(N68)),R68=\"Error\"),0,ROUND(ROUND(H68,0)*(VLOOKUP(J68,TravelCosts,2,FALSE)),2))","v":"#ERROR!"},"#ERROR!","#ERROR!",{"$f":"IF(OR(COUNTIF(WorkPackage,B45)=0,COUNTIF(PartnerN°,C45)=0,D45=\"\",COUNTIF(CountryALL,E45)=0,F45=\"\",COUNTIF(Category2,G45)=0,ISNUMBER(H45)=FALSE,H45<=0,I45=\"\",COUNTIF(TravelBands,J45)=0,ISNUMBER(K45)=FALSE,OR(K45<0,K45>90),IF(ISNUMBER(H45)=TRUE,H45=INT(H45*1)/1=FALSE),IF(ISNUMBER(K45)=TRUE,K45=INT(K45*1)/1=FALSE),AND(L45<>\"\",M45=0),AND(L45=\"\",M45>0),ISNUMBER(N45)=FALSE ),\"Error\",\"\")","v":"#ERROR!"}]
[null,"Development","P7",{"$f":"IFERROR(IF(VLOOKUP(C15,PartnerN°Ref,2,FALSE)=0,\"\",VLOOKUP(C15,PartnerN°Ref,2,FALSE)),\"\")","v":"#ERROR!"},{"$f":"IFERROR(IF(OR(VLOOKUP(C15,PartnerN°Ref,4,FALSE)=\"Country not found\",VLOOKUP(C15,PartnerN°Ref,3,FALSE)=0),\"\",VLOOKUP(C15,PartnerN°Ref,3,FALSE)),\"\")","v":"#ERROR!"},"Shiraz","Staff",2.0,"Rome ","3000 KM and 3999 KM",7.0,null,null,{"$f":"IF(AND(M69>0,L69<>\"\"),IF(M69>(ROUND( (ROUND(ROUND(H69,0)*(VLOOKUP(J69,TravelCosts,2,FALSE)),2))/0.65,2)),ROUND(M69*0.8,2),\"covered by unit cost\"),0)","v":0},{"$f":"IF(OR(AND(L69<>\"\",M69>0,ISNUMBER(N69)),R69=\"Error\"),0,ROUND(ROUND(H69,0)*(VLOOKUP(J69,TravelCosts,2,FALSE)),2))","v":"#ERROR!"},"#ERROR!","#ERROR!",{"$f":"IF(OR(COUNTIF(WorkPackage,B45)=0,COUNTIF(PartnerN°,C45)=0,D45=\"\",COUNTIF(CountryALL,E45)=0,F45=\"\",COUNTIF(Category2,G45)=0,ISNUMBER(H45)=FALSE,H45<=0,I45=\"\",COUNTIF(TravelBands,J45)=0,ISNUMBER(K45)=FALSE,OR(K45<0,K45>90),IF(ISNUMBER(H45)=TRUE,H45=INT(H45*1)/1=FALSE),IF(ISNUMBER(K45)=TRUE,K45=INT(K45*1)/1=FALSE),AND(L45<>\"\",M45=0),AND(L45=\"\",M45>0),ISNUMBER(N45)=FALSE ),\"Error\",\"\")","v":"#ERROR!"}]
[null,"Development","P8",{"$f":"IFERROR(IF(VLOOKUP(C15,PartnerN°Ref,2,FALSE)=0,\"\",VLOOKUP(C15,PartnerN°Ref,2,FALSE)),\"\")","v":"#ERROR!"},{"$f":"IFERROR(IF(OR(VLOOKUP(C15,PartnerN°Ref,4,FALSE)=\"Country not found\",VLOOKUP(C15,PartnerN°Ref,3,FALSE)=0),\"\",VLOOKUP(C15,PartnerN°Ref,3,FALSE)),\"\")","v":"#ERROR!"},"Isfahan ","Staff",2.0,"Rome ","3000 KM and 3999 KM",7.0,null,null,{"$f":"IF(AND(M70>0,L70<>\"\"),IF(M70>(ROUND( (ROUND(ROUND(H70,0)*(VLOOKUP(J70,TravelCosts,2,FALSE)),2))/0.65,2)),ROUND(M70*0.8,2),\"covered by unit cost\"),0)","v":0},{"$f":"IF(OR(AND(L70<>\"\",M70>0,ISNUMBER(N70)),R70=\"Error\"),0,ROUND(ROUND(H70,0)*(VLOOKUP(J70,TravelCosts,2,FALSE)),2))","v":"#ERROR!"},"#ERROR!","#ERROR!",{"$f":"IF(OR(COUNTIF(WorkPackage,B45)=0,COUNTIF(PartnerN°,C45)=0,D45=\"\",COUNTIF(CountryALL,E45)=0,F45=\"\",COUNTIF(Category2,G45)=0,ISNUMBER(H45)=FALSE,H45<=0,I45=\"\",COUNTIF(TravelBands,J45)=0,ISNUMBER(K45)=FALSE,OR(K45<0,K45>90),IF(ISNUMBER(H45)=TRUE,H45=INT(H45*1)/1=FALSE),IF(ISNUMBER(K45)=TRUE,K45=INT(K45*1)/1=FALSE),AND(L45<>\"\",M45=0),AND(L45=\"\",M45>0),ISNUMBER(N45)=FALSE ),\"Error\",\"\")","v":"#ERROR!"}]
[null,"Development","P9",{"$f":"IFERROR(IF(VLOOKUP(C15,PartnerN°Ref,2,FALSE)=0,\"\",VLOOKUP(C15,PartnerN°Ref,2,FALSE)),\"\")","v":"#ERROR!"},{"$f":"IFERROR(IF(OR(VLOOKUP(C15,PartnerN°Ref,4,FALSE)=\"Country not found\",VLOOKUP(C15,PartnerN°Ref,3,FALSE)=0),\"\",VLOOKUP(C15,PartnerN°Ref,3,FALSE)),\"\")","v":"#ERROR!"},"Tehran ","Staff",2.0,"Rome ","3000 KM and 3999 KM",7.0,null,null,{"$f":"IF(AND(M71>0,L71<>\"\"),IF(M71>(ROUND( (ROUND(ROUND(H71,0)*(VLOOKUP(J71,TravelCosts,2,FALSE)),2))/0.65,2)),ROUND(M71*0.8,2),\"covered by unit cost\"),0)","v":0},{"$f":"IF(OR(AND(L71<>\"\",M71>0,ISNUMBER(N71)),R71=\"Error\"),0,ROUND(ROUND(H71,0)*(VLOOKUP(J71,TravelCosts,2,FALSE)),2))","v":"#ERROR!"},"#ERROR!","#ERROR!",{"$f":"IF(OR(COUNTIF(WorkPackage,B45)=0,COUNTIF(PartnerN°,C45)=0,D45=\"\",COUNTIF(CountryALL,E45)=0,F45=\"\",COUNTIF(Category2,G45)=0,ISNUMBER(H45)=FALSE,H45<=0,I45=\"\",COUNTIF(TravelBands,J45)=0,ISNUMBER(K45)=FALSE,OR(K45<0,K45>90),IF(ISNUMBER(H45)=TRUE,H45=INT(H45*1)/1=FALSE),IF(ISNUMBER(K45)=TRUE,K45=INT(K45*1)/1=FALSE),AND(L45<>\"\",M45=0),AND(L45=\"\",M45>0),ISNUMBER(N45)=FALSE ),\"Error\",\"\")","v":"#ERROR!"}]
[null,"Development","P10",{"$f":"IFERROR(IF(VLOOKUP(C15,PartnerN°Ref,2,FALSE)=0,\"\",VLOOKUP(C15,PartnerN°Ref,2,FALSE)),\"\")","v":"#ERROR!"},{"$f":"IFERROR(IF(OR(VLOOKUP(C15,PartnerN°Ref,4,FALSE)=\"Country not found\",VLOOKUP(C15,PartnerN°Ref,3,FALSE)=0),\"\",VLOOKUP(C15,PartnerN°Ref,3,FALSE)),\"\")","v":"#ERROR!"},"Ahvaz","Staff",2.0,"Rome ","3000 KM and 3999 KM",7.0,null,null,{"$f":"IF(AND(M72>0,L72<>\"\"),IF(M72>(ROUND( (ROUND(ROUND(H72,0)*(VLOOKUP(J72,TravelCosts,2,FALSE)),2))/0.65,2)),ROUND(M72*0.8,2),\"covered by unit cost\"),0)","v":0},{"$f":"IF(OR(AND(L72<>\"\",M72>0,ISNUMBER(N72)),R72=\"Error\"),0,ROUND(ROUND(H72,0)*(VLOOKUP(J72,TravelCosts,2,FALSE)),2))","v":"#ERROR!"},"#ERROR!","#ERROR!",{"$f":"IF(OR(COUNTIF(WorkPackage,B45)=0,COUNTIF(PartnerN°,C45)=0,D45=\"\",COUNTIF(CountryALL,E45)=0,F45=\"\",COUNTIF(Category2,G45)=0,ISNUMBER(H45)=FALSE,H45<=0,I45=\"\",COUNTIF(TravelBands,J45)=0,ISNUMBER(K45)=FALSE,OR(K45<0,K45>90),IF(ISNUMBER(H45)=TRUE,H45=INT(H45*1)/1=FALSE),IF(ISNUMBER(K45)=TRUE,K45=INT(K45*1)/1=FALSE),AND(L45<>\"\",M45=0),AND(L45=\"\",M45>0),ISNUMBER(N45)=FALSE ),\"Error\",\"\")","v":"#ERROR!"}]
[null,"Development","P11",{"$f":"IFERROR(IF(VLOOKUP(C15,PartnerN°Ref,2,FALSE)=0,\"\",VLOOKUP(C15,PartnerN°Ref,2,FALSE)),\"\")","v":"#ERROR!"},{"$f":"IFERROR(IF(OR(VLOOKUP(C15,PartnerN°Ref,4,FALSE)=\"Country not found\",VLOOKUP(C15,PartnerN°Ref,3,FALSE)=0),\"\",VLOOKUP(C15,PartnerN°Ref,3,FALSE)),\"\")","v":"#ERROR!"},"Tehran ","Staff",2.0,"Rome ","3000 KM and 3999 KM",7.0,null,null,{"$f":"IF(AND(M73>0,L73<>\"\"),IF(M73>(ROUND( (ROUND(ROUND(H73,0)*(VLOOKUP(J73,TravelCosts,2,FALSE)),2))/0.65,2)),ROUND(M73*0.8,2),\"covered by unit cost\"),0)","v":0},{"$f":"IF(OR(AND(L73<>\"\",M73>0,ISNUMBER(N73)),R73=\"Error\"),0,ROUND(ROUND(H73,0)*(VLOOKUP(J73,TravelCosts,2,FALSE)),2))","v":"#ERROR!"},"#ERROR!","#ERROR!",{"$f":"IF(OR(COUNTIF(WorkPackage,B45)=0,COUNTIF(PartnerN°,C45)=0,D45=\"\",COUNTIF(CountryALL,E45)=0,F45=\"\",COUNTIF(Category2,G45)=0,ISNUMBER(H45)=FALSE,H45<=0,I45=\"\",COUNTIF(TravelBands,J45)=0,ISNUMBER(K45)=FALSE,OR(K45<0,K45>90),IF(ISNUMBER(H45)=TRUE,H45=INT(H45*1)/1=FALSE),IF(ISNUMBER(K45)=TRUE,K45=INT(K45*1)/1=FALSE),AND(L45<>\"\",M45=0),AND(L45=\"\",M45>0),ISNUMBER(N45)=FALSE ),\"Error\",\"\")","v":"#ERROR!"}]
[null,"Development","P12",{"$f":"IFERROR(IF(VLOOKUP(C15,PartnerN°Ref,2,FALSE)=0,\"\",VLOOKUP(C15,PartnerN°Ref,2,FALSE)),\"\")","v":"#ERROR!"},{"$f":"IFERROR(IF(OR(VLOOKUP(C15,PartnerN°Ref,4,FALSE)=\"Country not found\",VLOOKUP(C15,PartnerN°Ref,3,FALSE)=0),\"\",VLOOKUP(C15,PartnerN°Ref,3,FALSE)),\"\")","v":"#ERROR!"},"Tehran ","Staff",2.0,"Rome ","3000 KM and 3999 KM",7.0,null,null,{"$f":"IF(AND(M74>0,L74<>\"\"),IF(M74>(ROUND( (ROUND(ROUND(H74,0)*(VLOOKUP(J74,TravelCosts,2,FALSE)),2))/0.65,2)),ROUND(M74*0.8,2),\"covered by unit cost\"),0)","v":0},{"$f":"IF(OR(AND(L74<>\"\",M74>0,ISNUMBER(N74)),R74=\"Error\"),0,ROUND(ROUND(H74,0)*(VLOOKUP(J74,TravelCosts,2,FALSE)),2))","v":"#ERROR!"},"#ERROR!","#ERROR!",{"$f":"IF(OR(COUNTIF(WorkPackage,B45)=0,COUNTIF(PartnerN°,C45)=0,D45=\"\",COUNTIF(CountryALL,E45)=0,F45=\"\",COUNTIF(Category2,G45)=0,ISNUMBER(H45)=FALSE,H45<=0,I45=\"\",COUNTIF(TravelBands,J45)=0,ISNUMBER(K45)=FALSE,OR(K45<0,K45>90),IF(ISNUMBER(H45)=TRUE,H45=INT(H45*1)/1=FALSE),IF(ISNUMBER(K45)=TRUE,K45=INT(K45*1)/1=FALSE),AND(L45<>\"\",M45=0),AND(L45=\"\",M45>0),ISNUMBER(N45)=FALSE ),\"Error\",\"\")","v":"#ERROR!"}]
[null,"Development","P1",{"$f":"IFERROR(IF(VLOOKUP(C15,PartnerN°Ref,2,FALSE)=0,\"\",VLOOKUP(C15,PartnerN°Ref,2,FALSE)),\"\")","v":"#ERROR!"},{"$f":"IFERROR(IF(OR(VLOOKUP(C15,PartnerN°Ref,4,FALSE)=\"Country not found\",VLOOKUP(C15,PartnerN°Ref,3,FALSE)=0),\"\",VLOOKUP(C15,PartnerN°Ref,3,FALSE)),\"\")","v":"#ERROR!"},"Rome","Staff",3.0,"Ahvaz","3000 KM and 3999 KM",5.0,null,null,{"$f":"IF(AND(M75>0,L75<>\"\"),IF(M75>(ROUND( (ROUND(ROUND(H75,0)*(VLOOKUP(J75,TravelCosts,2,FALSE)),2))/0.65,2)),ROUND(M75*0.8,2),\"covered by unit cost\"),0)","v":0},{"$f":"IF(OR(AND(L75<>\"\",M75>0,ISNUMBER(N75)),R75=\"Error\"),0,ROUND(ROUND(H75,0)*(VLOOKUP(J75,TravelCosts,2,FALSE)),2))","v":"#ERROR!"},"#ERROR!","#ERROR!",{"$f":"IF(OR(COUNTIF(WorkPackage,B45)=0,COUNTIF(PartnerN°,C45)=0,D45=\"\",COUNTIF(CountryALL,E45)=0,F45=\"\",COUNTIF(Category2,G45)=0,ISNUMBER(H45)=FALSE,H45<=0,I45=\"\",COUNTIF(TravelBands,J45)=0,ISNUMBER(K45)=FALSE,OR(K45<0,K45>90),IF(ISNUMBER(H45)=TRUE,H45=INT(H45*1)/1=FALSE),IF(ISNUMBER(K45)=TRUE,K45=INT(K45*1)/1=FALSE),AND(L45<>\"\",M45=0),AND(L45=\"\",M45>0),ISNUMBER(N45)=FALSE ),\"Error\",\"\")","v":"#ERROR!"}]
[null,"Development","P2",{"$f":"IFERROR(IF(VLOOKUP(C15,PartnerN°Ref,2,FALSE)=0,\"\",VLOOKUP(C15,PartnerN°Ref,2,FALSE)),\"\")","v":"#ERROR!"},{"$f":"IFERROR(IF(OR(VLOOKUP(C15,PartnerN°Ref,4,FALSE)=\"Country not found\",VLOOKUP(C15,PartnerN°Ref,3,FALSE)=0),\"\",VLOOKUP(C15,PartnerN°Ref,3,FALSE)),\"\")","v":"#ERROR!"},"Turku ","Staff",3.0,"Ahvaz","3000 KM and 3999 KM",5.0,null,null,{"$f":"IF(AND(M76>0,L76<>\"\"),IF(M76>(ROUND( (ROUND(ROUND(H76,0)*(VLOOKUP(J76,TravelCosts,2,FALSE)),2))/0.65,2)),ROUND(M76*0.8,2),\"covered by unit cost\"),0)","v":0},{"$f":"IF(OR(AND(L76<>\"\",M76>0,ISNUMBER(N76)),R76=\"Error\"),0,ROUND(ROUND(H76,0)*(VLOOKUP(J76,TravelCosts,2,FALSE)),2))","v":"#ERROR!"},"#ERROR!","#ERROR!",{"$f":"IF(OR(COUNTIF(WorkPackage,B45)=0,COUNTIF(PartnerN°,C45)=0,D45=\"\",COUNTIF(CountryALL,E45)=0,F45=\"\",COUNTIF(Category2,G45)=0,ISNUMBER(H45)=FALSE,H45<=0,I45=\"\",COUNTIF(TravelBands,J45)=0,ISNUMBER(K45)=FALSE,OR(K45<0,K45>90),IF(ISNUMBER(H45)=TRUE,H45=INT(H45*1)/1=FALSE),IF(ISNUMBER(K45)=TRUE,K45=INT(K45*1)/1=FALSE),AND(L45<>\"\",M45=0),AND(L45=\"\",M45>0),ISNUMBER(N45)=FALSE ),\"Error\",\"\")","v":"#ERROR!"}]
[null,"Development","P3",{"$f":"IFERROR(IF(VLOOKUP(C15,PartnerN°Ref,2,FALSE)=0,\"\",VLOOKUP(C15,PartnerN°Ref,2,FALSE)),\"\")","v":"#ERROR!"},{"$f":"IFERROR(IF(OR(VLOOKUP(C15,PartnerN°Ref,4,FALSE)=\"Country not found\",VLOOKUP(C15,PartnerN°Ref,3,FALSE)=0),\"\",VLOOKUP(C15,PartnerN°Ref,3,FALSE)),\"\")","v":"#ERROR!"},"Lisbon ","Staff",3.0,"Ahvaz","4000 KM and 7999 KM",5.0,null,null,{"$f":"IF(AND(M77>0,L77<>\"\"),IF(M77>(ROUND( (ROUND(ROUND(H77,0)*(VLOOKUP(J77,TravelCosts,2,FALSE)),2))/0.65,2)),ROUND(M77*0.8,2),\"covered by unit cost\"),0)","v":0},{"$f":"IF(OR(AND(L77<>\"\",M77>0,ISNUMBER(N77)),R77=\"Error\"),0,ROUND(ROUND(H77,0)*(VLOOKUP(J77,TravelCosts,2,FALSE)),2))","v":"#ERROR!"},"#ERROR!","#ERROR!",{"$f":"IF(OR(COUNTIF(WorkPackage,B77)=0,COUNTIF(PartnerN°,C77)=0,D77=\"\",COUNTIF(CountryALL,E77)=0,F77=\"\",COUNTIF(Category2,G77)=0,ISNUMBER(H77)=FALSE,H77<=0,I77=\"\",COUNTIF(TravelBands,J77)=0,ISNUMBER(K77)=FALSE,OR(K77<0,K77>90),IF(ISNUMBER(H77)=TRUE,H77=INT(H77*1)/1=FALSE),IF(ISNUMBER(K77)=TRUE,K77=INT(K77*1)/1=FALSE),AND(L77<>\"\",M77=0),AND(L77=\"\",M77>0),ISNUMBER(N77)=FALSE ),\"Error\",\"\")","v":"#ERROR!"}]
[null,"Development","P4",{"$f":"IFERROR(IF(VLOOKUP(C15,PartnerN°Ref,2,FALSE)=0,\"\",VLOOKUP(C15,PartnerN°Ref,2,FALSE)),\"\")","v":"#ERROR!"},{"$f":"IFERROR(IF(OR(VLOOKUP(C15,PartnerN°Ref,4,FALSE)=\"Country not found\",VLOOKUP(C15,PartnerN°Ref,3,FALSE)=0),\"\",VLOOKUP(C15,PartnerN°Ref,3,FALSE)),\"\")","v":"#ERROR!"},"Alexandropoulos","Staff",3.0,"Ahvaz","2000 KM and 2999 KM",5.0,null,null,{"$f":"IF(AND(M78>0,L78<>\"\"),IF(M78>(ROUND( (ROUND(ROUND(H78,0)*(VLOOKUP(J78,TravelCosts,2,FALSE)),2))/0.65,2)),ROUND(M78*0.8,2),\"covered by unit cost\"),0)","v":0},{"$f":"IF(OR(AND(L78<>\"\",M78>0,ISNUMBER(N78)),R78=\"Error\"),0,ROUND(ROUND(H78,0)*(VLOOKUP(J78,TravelCosts,2,FALSE)),2))","v":"#ERROR!"},"#ERROR!","#ERROR!",{"$f":"IF(OR(COUNTIF(WorkPackage,B77)=0,COUNTIF(PartnerN°,C77)=0,D77=\"\",COUNTIF(CountryALL,E77)=0,F77=\"\",COUNTIF(Category2,G77)=0,ISNUMBER(H77)=FALSE,H77<=0,I77=\"\",COUNTIF(TravelBands,J77)=0,ISNUMBER(K77)=FALSE,OR(K77<0,K77>90),IF(ISNUMBER(H77)=TRUE,H77=INT(H77*1)/1=FALSE),IF(ISNUMBER(K77)=TRUE,K77=INT(K77*1)/1=FALSE),AND(L77<>\"\",M77=0),AND(L77=\"\",M77>0),ISNUMBER(N77)=FALSE ),\"Error\",\"\")","v":"#ERROR!"}]
[null,"Development","P5",{"$f":"IFERROR(IF(VLOOKUP(C15,PartnerN°Ref,2,FALSE)=0,\"\",VLOOKUP(C15,PartnerN°Ref,2,FALSE)),\"\")","v":"#ERROR!"},{"$f":"IFERROR(IF(OR(VLOOKUP(C15,PartnerN°Ref,4,FALSE)=\"Country not found\",VLOOKUP(C15,PartnerN°Ref,3,FALSE)=0),\"\",VLOOKUP(C15,PartnerN°Ref,3,FALSE)),\"\")","v":"#ERROR!"},"Qazvin ","Staff",3.0,"Ahvaz","500 KM and 1999 KM",5.0,null,null,{"$f":"IF(AND(M79>0,L79<>\"\"),IF(M79>(ROUND( (ROUND(ROUND(H79,0)*(VLOOKUP(J79,TravelCosts,2,FALSE)),2))/0.65,2)),ROUND(M79*0.8,2),\"covered by unit cost\"),0)","v":0},{"$f":"IF(OR(AND(L79<>\"\",M79>0,ISNUMBER(N79)),R79=\"Error\"),0,ROUND(ROUND(H79,0)*(VLOOKUP(J79,TravelCosts,2,FALSE)),2))","v":"#ERROR!"},"#ERROR!","#ERROR!",{"$f":"IF(OR(COUNTIF(WorkPackage,B77)=0,COUNTIF(PartnerN°,C77)=0,D77=\"\",COUNTIF(CountryALL,E77)=0,F77=\"\",COUNTIF(Category2,G77)=0,ISNUMBER(H77)=FALSE,H77<=0,I77=\"\",COUNTIF(TravelBands,J77)=0,ISNUMBER(K77)=FALSE,OR(K77<0,K77>90),IF(ISNUMBER(H77)=TRUE,H77=INT(H77*1)/1=FALSE),IF(ISNUMBER(K77)=TRUE,K77=INT(K77*1)/1=FALSE),AND(L77<>\"\",M77=0),AND(L77=\"\",M77>0),ISNUMBER(N77)=FALSE ),\"Error\",\"\")","v":"#ERROR!"}]
[null,"Development","P6",{"$f":"IFERROR(IF(VLOOKUP(C15,PartnerN°Ref,2,FALSE)=0,\"\",VLOOKUP(C15,PartnerN°Ref,2,FALSE)),\"\")","v":"#ERROR!"},{"$f":"IFERROR(IF(OR(VLOOKUP(C15,PartnerN°Ref,4,FALSE)=\"Country not found\",VLOOKUP(C15,PartnerN°Ref,3,FALSE)=0),\"\",VLOOKUP(C15,PartnerN°Ref,3,FALSE)),\"\")","v":"#ERROR!"},"Zahedan ","Staff",3.0,"Ahvaz","500 KM and 1999 KM",5.0,null,null,{"$f":"IF(AND(M80>0,L80<>\"\"),IF(M80>(ROUND( (ROUND(ROUND(H80,0)*(VLOOKUP(J80,TravelCosts,2,FALSE)),2))/0.65,2)),ROUND(M80*0.8,2),\"covered by unit cost\"),0)","v":0},{"$f":"IF(OR(AND(L80<>\"\",M80>0,ISNUMBER(N80)),R80=\"Error\"),0,ROUND(ROUND(H80,0)*(VLOOKUP(J80,TravelCosts,2,FALSE)),2))","v":"#ERROR!"},"#ERROR!","#ERROR!",{"$f":"IF(OR(COUNTIF(WorkPackage,B77)=0,COUNTIF(PartnerN°,C77)=0,D77=\"\",COUNTIF(CountryALL,E77)=0,F77=\"\",COUNTIF(Category2,G77)=0,ISNUMBER(H77)=FALSE,H77<=0,I77=\"\",COUNTIF(TravelBands,J77)=0,ISNUMBER(K77)=FALSE,OR(K77<0,K77>90),IF(ISNUMBER(H77)=TRUE,H77=INT(H77*1)/1=FALSE),IF(ISNUMBER(K77)=TRUE,K77=INT(K77*1)/1=FALSE),AND(L77<>\"\",M77=0),AND(L77=\"\",M77>0),ISNUMBER(N77)=FALSE ),\"Error\",\"\")","v":"#ERROR!"}]
[null,"Development","P7",{"$f":"IFERROR(IF(VLOOKUP(C15,PartnerN°Ref,2,FALSE)=0,\"\",VLOOKUP(C15,PartnerN°Ref,2,FALSE)),\"\")","v":"#ERROR!"},{"$f":"IFERROR(IF(OR(VLOOKUP(C15,PartnerN°Ref,4,FALSE)=\"Country not found\",VLOOKUP(C15,PartnerN°Ref,3,FALSE)=0),\"\",VLOOKUP(C15,PartnerN°Ref,3,FALSE)),\"\")","v":"#ERROR!"},"Shiraz","Staff",3.0,"Ahvaz","100 KM and 499 KM",5.0,null,null,{"$f":"IF(AND(M81>0,L81<>\"\"),IF(M81>(ROUND( (ROUND(ROUND(H81,0)*(VLOOKUP(J81,TravelCosts,2,FALSE)),2))/0.65,2)),ROUND(M81*0.8,2),\"covered by unit cost\"),0)","v":0},{"$f":"IF(OR(AND(L81<>\"\",M81>0,ISNUMBER(N81)),R81=\"Error\"),0,ROUND(ROUND(H81,0)*(VLOOKUP(J81,TravelCosts,2,FALSE)),2))","v":"#ERROR!"},"#ERROR!","#ERROR!",{"$f":"IF(OR(COUNTIF(WorkPackage,B77)=0,COUNTIF(PartnerN°,C77)=0,D77=\"\",COUNTIF(CountryALL,E77)=0,F77=\"\",COUNTIF(Category2,G77)=0,ISNUMBER(H77)=FALSE,H77<=0,I77=\"\",COUNTIF(TravelBands,J77)=0,ISNUMBER(K77)=FALSE,OR(K77<0,K77>90),IF(ISNUMBER(H77)=TRUE,H77=INT(H77*1)/1=FALSE),IF(ISNUMBER(K77)=TRUE,K77=INT(K77*1)/1=FALSE),AND(L77<>\"\",M77=0),AND(L77=\"\",M77>0),ISNUMBER(N77)=FALSE ),\"Error\",\"\")","v":"#ERROR!"}]
[null,"Development","P8",{"$f":"IFERROR(IF(VLOOKUP(C15,PartnerN°Ref,2,FALSE)=0,\"\",VLOOKUP(C15,PartnerN°Ref,2,FALSE)),\"\")","v":"#ERROR!"},{"$f":"IFERROR(IF(OR(VLOOKUP(C15,PartnerN°Ref,4,FALSE)=\"Country not found\",VLOOKUP(C15,PartnerN°Ref,3,FALSE)=0),\"\",VLOOKUP(C15,PartnerN°Ref,3,FALSE)),\"\")","v":"#ERROR!"},"Isfahan ","Staff",3.0,"Ahvaz","100 KM and 499 KM",5.0,null,null,{"$f":"IF(AND(M82>0,L82<>\"\"),IF(M82>(ROUND( (ROUND(ROUND(H82,0)*(VLOOKUP(J82,TravelCosts,2,FALSE)),2))/0.65,2)),ROUND(M82*0.8,2),\"covered by unit cost\"),0)","v":0},{"$f":"IF(OR(AND(L82<>\"\",M82>0,ISNUMBER(N82)),R82=\"Error\"),0,ROUND(ROUND(H82,0)*(VLOOKUP(J82,TravelCosts,2,FALSE)),2))","v":"#ERROR!"},"#ERROR!","#ERROR!",{"$f":"IF(OR(COUNTIF(WorkPackage,B77)=0,COUNTIF(PartnerN°,C77)=0,D77=\"\",COUNTIF(CountryALL,E77)=0,F77=\"\",COUNTIF(Category2,G77)=0,ISNUMBER(H77)=FALSE,H77<=0,I77=\"\",COUNTIF(TravelBands,J77)=0,ISNUMBER(K77)=FALSE,OR(K77<0,K77>90),IF(ISNUMBER(H77)=TRUE,H77=INT(H77*1)/1=FALSE),IF(ISNUMBER(K77)=TRUE,K77=INT(K77*1)/1=FALSE),AND(L77<>\"\",M77=0),AND(L77=\"\",M77>0),ISNUMBER(N77)=FALSE ),\"Error\",\"\")","v":"#ERROR!"}]
[null,"Development","P9",{"$f":"IFERROR(IF(VLOOKUP(C15,PartnerN°Ref,2,FALSE)=0,\"\",VLOOKUP(C15,PartnerN°Ref,2,FALSE)),\"\")","v":"#ERROR!"},{"$f":"IFERROR(IF(OR(VLOOKUP(C15,PartnerN°Ref,4,FALSE)=\"Country not found\",VLOOKUP(C15,PartnerN°Ref,3,FALSE)=0),\"\",VLOOKUP(C15,PartnerN°Ref,3,FALSE)),\"\")","v":"#ERROR!"},"Tehran ","Staff",3.0,"Ahvaz","500 KM and 1999 KM",5.0,null,null,{"$f":"IF(AND(M83>0,L83<>\"\"),IF(M83>(ROUND( (ROUND(ROUND(H83,0)*(VLOOKUP(J83,TravelCosts,2,FALSE)),2))/0.65,2)),ROUND(M83*0.8,2),\"covered by unit cost\"),0)","v":0},{"$f":"IF(OR(AND(L83<>\"\",M83>0,ISNUMBER(N83)),R83=\"Error\"),0,ROUND(ROUND(H83,0)*(VLOOKUP(J83,TravelCosts,2,FALSE)),2))","v":"#ERROR!"},"#ERROR!","#ERROR!",{"$f":"IF(OR(COUNTIF(WorkPackage,B77)=0,COUNTIF(PartnerN°,C77)=0,D77=\"\",COUNTIF(CountryALL,E77)=0,F77=\"\",COUNTIF(Category2,G77)=0,ISNUMBER(H77)=FALSE,H77<=0,I77=\"\",COUNTIF(TravelBands,J77)=0,ISNUMBER(K77)=FALSE,OR(K77<0,K77>90),IF(ISNUMBER(H77)=TRUE,H77=INT(H77*1)/1=FALSE),IF(ISNUMBER(K77)=TRUE,K77=INT(K77*1)/1=FALSE),AND(L77<>\"\",M77=0),AND(L77=\"\",M77>0),ISNUMBER(N77)=FALSE ),\"Error\",\"\")","v":"#ERROR!"}]
[null,"Development","P11",{"$f":"IFERROR(IF(VLOOKUP(C15,PartnerN°Ref,2,FALSE)=0,\"\",VLOOKUP(C15,PartnerN°Ref,2,FALSE)),\"\")","v":"#ERROR!"},{"$f":"IFERROR(IF(OR(VLOOKUP(C15,PartnerN°Ref,4,FALSE)=\"Country not found\",VLOOKUP(C15,PartnerN°Ref,3,FALSE)=0),\"\",VLOOKUP(C15,PartnerN°Ref,3,FALSE)),\"\")","v":"#ERROR!"},"Tehran ","Staff",3.0,"Ahvaz","500 KM and 1999 KM",5.0,null,null,{"$f":"IF(AND(M84>0,L84<>\"\"),IF(M84>(ROUND( (ROUND(ROUND(H84,0)*(VLOOKUP(J84,TravelCosts,2,FALSE)),2))/0.65,2)),ROUND(M84*0.8,2),\"covered by unit cost\"),0)","v":0},{"$f":"IF(OR(AND(L84<>\"\",M84>0,ISNUMBER(N84)),R84=\"Error\"),0,ROUND(ROUND(H84,0)*(VLOOKUP(J84,TravelCosts,2,FALSE)),2))","v":"#ERROR!"},"#ERROR!","#ERROR!",{"$f":"IF(OR(COUNTIF(WorkPackage,B77)=0,COUNTIF(PartnerN°,C77)=0,D77=\"\",COUNTIF(CountryALL,E77)=0,F77=\"\",COUNTIF(Category2,G77)=0,ISNUMBER(H77)=FALSE,H77<=0,I77=\"\",COUNTIF(TravelBands,J77)=0,ISNUMBER(K77)=FALSE,OR(K77<0,K77>90),IF(ISNUMBER(H77)=TRUE,H77=INT(H77*1)/1=FALSE),IF(ISNUMBER(K77)=TRUE,K77=INT(K77*1)/1=FALSE),AND(L77<>\"\",M77=0),AND(L77=\"\",M77>0),ISNUMBER(N77)=FALSE ),\"Error\",\"\")","v":"#ERROR!"}]
[null,"Development","P12",{"$f":"IFERROR(IF(VLOOKUP(C15,PartnerN°Ref,2,FALSE)=0,\"\",VLOOKUP(C15,PartnerN°Ref,2,FALSE)),\"\")","v":"#ERROR!"},{"$f":"IFERROR(IF(OR(VLOOKUP(C15,PartnerN°Ref,4,FALSE)=\"Country not found\",VLOOKUP(C15,PartnerN°Ref,3,FALSE)=0),\"\",VLOOKUP(C15,PartnerN°Ref,3,FALSE)),\"\")","v":"#ERROR!"},"Tehran ","Staff",3.0,"Ahvaz","500 KM and 1999 KM",5.0,null,null,{"$f":"IF(AND(M85>0,L85<>\"\"),IF(M85>(ROUND( (ROUND(ROUND(H85,0)*(VLOOKUP(J85,TravelCosts,2,FALSE)),2))/0.65,2)),ROUND(M85*0.8,2),\"covered by unit cost\"),0)","v":0},{"$f":"IF(OR(AND(L85<>\"\",M85>0,ISNUMBER(N85)),R85=\"Error\"),0,ROUND(ROUND(H85,0)*(VLOOKUP(J85,TravelCosts,2,FALSE)),2))","v":"#ERROR!"},"#ERROR!","#ERROR!",{"$f":"IF(OR(COUNTIF(WorkPackage,B77)=0,COUNTIF(PartnerN°,C77)=0,D77=\"\",COUNTIF(CountryALL,E77)=0,F77=\"\",COUNTIF(Category2,G77)=0,ISNUMBER(H77)=FALSE,H77<=0,I77=\"\",COUNTIF(TravelBands,J77)=0,ISNUMBER(K77)=FALSE,OR(K77<0,K77>90),IF(ISNUMBER(H77)=TRUE,H77=INT(H77*1)/1=FALSE),IF(ISNUMBER(K77)=TRUE,K77=INT(K77*1)/1=FALSE),AND(L77<>\"\",M77=0),AND(L77=\"\",M77>0),ISNUMBER(N77)=FALSE ),\"Error\",\"\")","v":"#ERROR!"}]
[null,"Development","P1",{"$f":"IFERROR(IF(VLOOKUP(C15,PartnerN°Ref,2,FALSE)=0,\"\",VLOOKUP(C15,PartnerN°Ref,2,FALSE)),\"\")","v":"#ERROR!"},{"$f":"IFERROR(IF(OR(VLOOKUP(C15,PartnerN°Ref,4,FALSE)=\"Country not found\",VLOOKUP(C15,PartnerN°Ref,3,FALSE)=0),\"\",VLOOKUP(C15,PartnerN°Ref,3,FALSE)),\"\")","v":"#ERROR!"},"Rome","Staff",3.0,"Shiraz","3000 KM and 3999 KM",5.0,null,null,{"$f":"IF(AND(M86>0,L86<>\"\"),IF(M86>(ROUND( (ROUND(ROUND(H86,0)*(VLOOKUP(J86,TravelCosts,2,FALSE)),2))/0.65,2)),ROUND(M86*0.8,2),\"covered by unit cost\"),0)","v":0},{"$f":"IF(OR(AND(L86<>\"\",M86>0,ISNUMBER(N86)),R86=\"Error\"),0,ROUND(ROUND(H86,0)*(VLOOKUP(J86,TravelCosts,2,FALSE)),2))","v":"#ERROR!"},"#ERROR!","#ERROR!",{"$f":"IF(OR(COUNTIF(WorkPackage,B77)=0,COUNTIF(PartnerN°,C77)=0,D77=\"\",COUNTIF(CountryALL,E77)=0,F77=\"\",COUNTIF(Category2,G77)=0,ISNUMBER(H77)=FALSE,H77<=0,I77=\"\",COUNTIF(TravelBands,J77)=0,ISNUMBER(K77)=FALSE,OR(K77<0,K77>90),IF(ISNUMBER(H77)=TRUE,H77=INT(H77*1)/1=FALSE),IF(ISNUMBER(K77)=TRUE,K77=INT(K77*1)/1=FALSE),AND(L77<>\"\",M77=0),AND(L77=\"\",M77>0),ISNUMBER(N77)=FALSE ),\"Error\",\"\")","v":"#ERROR!"}]
[null,"Development","P2",{"$f":"IFERROR(IF(VLOOKUP(C15,PartnerN°Ref,2,FALSE)=0,\"\",VLOOKUP(C15,PartnerN°Ref,2,FALSE)),\"\")","v":"#ERROR!"},{"$f":"IFERROR(IF(OR(VLOOKUP(C15,PartnerN°Ref,4,FALSE)=\"Country not found\",VLOOKUP(C15,PartnerN°Ref,3,FALSE)=0),\"\",VLOOKUP(C15,PartnerN°Ref,3,FALSE)),\"\")","v":"#ERROR!"},"Turku ","Staff",3.0,"Shiraz","4000 KM and 7999 KM",5.0,null,null,{"$f":"IF(AND(M87>0,L87<>\"\"),IF(M87>(ROUND( (ROUND(ROUND(H87,0)*(VLOOKUP(J87,TravelCosts,2,FALSE)),2))/0.65,2)),ROUND(M87*0.8,2),\"covered by unit cost\"),0)","v":0},{"$f":"IF(OR(AND(L87<>\"\",M87>0,ISNUMBER(N87)),R87=\"Error\"),0,ROUND(ROUND(H87,0)*(VLOOKUP(J87,TravelCosts,2,FALSE)),2))","v":"#ERROR!"},"#ERROR!","#ERROR!",{"$f":"IF(OR(COUNTIF(WorkPackage,B77)=0,COUNTIF(PartnerN°,C77)=0,D77=\"\",COUNTIF(CountryALL,E77)=0,F77=\"\",COUNTIF(Category2,G77)=0,ISNUMBER(H77)=FALSE,H77<=0,I77=\"\",COUNTIF(TravelBands,J77)=0,ISNUMBER(K77)=FALSE,OR(K77<0,K77>90),IF(ISNUMBER(H77)=TRUE,H77=INT(H77*1)/1=FALSE),IF(ISNUMBER(K77)=TRUE,K77=INT(K77*1)/1=FALSE),AND(L77<>\"\",M77=0),AND(L77=\"\",M77>0),ISNUMBER(N77)=FALSE ),\"Error\",\"\")","v":"#ERROR!"}]
[null,"Development","P3",{"$f":"IFERROR(IF(VLOOKUP(C15,PartnerN°Ref,2,FALSE)=0,\"\",VLOOKUP(C15,PartnerN°Ref,2,FALSE)),\"\")","v":"#ERROR!"},{"$f":"IFERROR(IF(OR(VLOOKUP(C15,PartnerN°Ref,4,FALSE)=\"Country not found\",VLOOKUP(C15,PartnerN°Ref,3,FALSE)=0),\"\",VLOOKUP(C15,PartnerN°Ref,3,FALSE)),\"\")","v":"#ERROR!"},"Lisbon ","Staff",3.0,"Shiraz","4000 KM and 7999 KM",5.0,null,null,{"$f":"IF(AND(M88>0,L88<>\"\"),IF(M88>(ROUND( (ROUND(ROUND(H88,0)*(VLOOKUP(J88,TravelCosts,2,FALSE)),2))/0.65,2)),ROUND(M88*0.8,2),\"covered by unit cost\"),0)","v":0},{"$f":"IF(OR(AND(L88<>\"\",M88>0,ISNUMBER(N88)),R88=\"Error\"),0,ROUND(ROUND(H88,0)*(VLOOKUP(J88,TravelCosts,2,FALSE)),2))","v":"#ERROR!"},"#ERROR!","#ERROR!",{"$f":"IF(OR(COUNTIF(WorkPackage,B77)=0,COUNTIF(PartnerN°,C77)=0,D77=\"\",COUNTIF(CountryALL,E77)=0,F77=\"\",COUNTIF(Category2,G77)=0,ISNUMBER(H77)=FALSE,H77<=0,I77=\"\",COUNTIF(TravelBands,J77)=0,ISNUMBER(K77)=FALSE,OR(K77<0,K77>90),IF(ISNUMBER(H77)=TRUE,H77=INT(H77*1)/1=FALSE),IF(ISNUMBER(K77)=TRUE,K77=INT(K77*1)/1=FALSE),AND(L77<>\"\",M77=0),AND(L77=\"\",M77>0),ISNUMBER(N77)=FALSE ),\"Error\",\"\")","v":"#ERROR!"}]
[null,"Development","P4",{"$f":"IFERROR(IF(VLOOKUP(C15,PartnerN°Ref,2,FALSE)=0,\"\",VLOOKUP(C15,PartnerN°Ref,2,FALSE)),\"\")","v":"#ERROR!"},{"$f":"IFERROR(IF(OR(VLOOKUP(C15,PartnerN°Ref,4,FALSE)=\"Country not found\",VLOOKUP(C15,PartnerN°Ref,3,FALSE)=0),\"\",VLOOKUP(C15,PartnerN°Ref,3,FALSE)),\"\")","v":"#ERROR!"},"Alexandropoulos","Staff",3.0,"Shiraz","2000 KM and 2999 KM",5.0,null,null,{"$f":"IF(AND(M89>0,L89<>\"\"),IF(M89>(ROUND( (ROUND(ROUND(H89,0)*(VLOOKUP(J89,TravelCosts,2,FALSE)),2))/0.65,2)),ROUND(M89*0.8,2),\"covered by unit cost\"),0)","v":0},{"$f":"IF(OR(AND(L89<>\"\",M89>0,ISNUMBER(N89)),R89=\"Error\"),0,ROUND(ROUND(H89,0)*(VLOOKUP(J89,TravelCosts,2,FALSE)),2))","v":"#ERROR!"},"#ERROR!","#ERROR!",{"$f":"IF(OR(COUNTIF(WorkPackage,B77)=0,COUNTIF(PartnerN°,C77)=0,D77=\"\",COUNTIF(CountryALL,E77)=0,F77=\"\",COUNTIF(Category2,G77)=0,ISNUMBER(H77)=FALSE,H77<=0,I77=\"\",COUNTIF(TravelBands,J77)=0,ISNUMBER(K77)=FALSE,OR(K77<0,K77>90),IF(ISNUMBER(H77)=TRUE,H77=INT(H77*1)/1=FALSE),IF(ISNUMBER(K77)=TRUE,K77=INT(K77*1)/1=FALSE),AND(L77<>\"\",M77=0),AND(L77=\"\",M77>0),ISNUMBER(N77)=FALSE ),\"Error\",\"\")","v":"#ERROR!"}]
[null,"Development","P5",{"$f":"IFERROR(IF(VLOOKUP(C15,PartnerN°Ref,2,FALSE)=0,\"\",VLOOKUP(C15,PartnerN°Ref,2,FALSE)),\"\")","v":"#ERROR!"},{"$f":"IFERROR(IF(OR(VLOOKUP(C15,PartnerN°Ref,4,FALSE)=\"Country not found\",VLOOKUP(C15,PartnerN°Ref,3,FALSE)=0),\"\",VLOOKUP(C15,PartnerN°Ref,3,FALSE)),\"\")","v":"#ERROR!"},"Qazvin ","Staff",3.0,"Shiraz","500 KM and 1999 KM",5.0,null,null,{"$f":"IF(AND(M90>0,L90<>\"\"),IF(M90>(ROUND( (ROUND(ROUND(H90,0)*(VLOOKUP(J90,TravelCosts,2,FALSE)),2))/0.65,2)),ROUND(M90*0.8,2),\"covered by unit cost\"),0)","v":0},{"$f":"IF(OR(AND(L90<>\"\",M90>0,ISNUMBER(N90)),R90=\"Error\"),0,ROUND(ROUND(H90,0)*(VLOOKUP(J90,TravelCosts,2,FALSE)),2))","v":"#ERROR!"},"#ERROR!","#ERROR!",{"$f":"IF(OR(COUNTIF(WorkPackage,B77)=0,COUNTIF(PartnerN°,C77)=0,D77=\"\",COUNTIF(CountryALL,E77)=0,F77=\"\",COUNTIF(Category2,G77)=0,ISNUMBER(H77)=FALSE,H77<=0,I77=\"\",COUNTIF(TravelBands,J77)=0,ISNUMBER(K77)=FALSE,OR(K77<0,K77>90),IF(ISNUMBER(H77)=TRUE,H77=INT(H77*1)/1=FALSE),IF(ISNUMBER(K77)=TRUE,K77=INT(K77*1)/1=FALSE),AND(L77<>\"\",M77=0),AND(L77=\"\",M77>0),ISNUMBER(N77)=FALSE ),\"Error\",\"\")","v":"#ERROR!"}]
[null,"Development","P6",{"$f":"IFERROR(IF(VLOOKUP(C15,PartnerN°Ref,2,FALSE)=0,\"\",VLOOKUP(C15,PartnerN°Ref,2,FALSE)),\"\")","v":"#ERROR!"},{"$f":"IFERROR(IF(OR(VLOOKUP(C15,PartnerN°Ref,4,FALSE)=\"Country not found\",VLOOKUP(C15,PartnerN°Ref,3,FALSE)=0),\"\",VLOOKUP(C15,PartnerN°Ref,3,FALSE)),\"\")","v":"#ERROR!"},"Zahedan ","Staff",3.0,"Shiraz","500 KM and 1999 KM",5.0,null,null,{"$f":"IF(AND(M91>0,L91<>\"\"),IF(M91>(ROUND( (ROUND(ROUND(H91,0)*(VLOOKUP(J91,TravelCosts,2,FALSE)),2))/0.65,2)),ROUND(M91*0.8,2),\"covered by unit cost\"),0)","v":0},{"$f":"IF(OR(AND(L91<>\"\",M91>0,ISNUMBER(N91)),R91=\"Error\"),0,ROUND(ROUND(H91,0)*(VLOOKUP(J91,TravelCosts,2,FALSE)),2))","v":"#ERROR!"},"#ERROR!","#ERROR!",{"$f":"IF(OR(COUNTIF(WorkPackage,B77)=0,COUNTIF(PartnerN°,C77)=0,D77=\"\",COUNTIF(CountryALL,E77)=0,F77=\"\",COUNTIF(Category2,G77)=0,ISNUMBER(H77)=FALSE,H77<=0,I77=\"\",COUNTIF(TravelBands,J77)=0,ISNUMBER(K77)=FALSE,OR(K77<0,K77>90),IF(ISNUMBER(H77)=TRUE,H77=INT(H77*1)/1=FALSE),IF(ISNUMBER(K77)=TRUE,K77=INT(K77*1)/1=FALSE),AND(L77<>\"\",M77=0),AND(L77=\"\",M77>0),ISNUMBER(N77)=FALSE ),\"Error\",\"\")","v":"#ERROR!"}]
[null,"Development","P8",{"$f":"IFERROR(IF(VLOOKUP(C15,PartnerN°Ref,2,FALSE)=0,\"\",VLOOKUP(C15,PartnerN°Ref,2,FALSE)),\"\")","v":"#ERROR!"},{"$f":"IFERROR(IF(OR(VLOOKUP(C15,PartnerN°Ref,4,FALSE)=\"Country not found\",VLOOKUP(C15,PartnerN°Ref,3,FALSE)=0),\"\",VLOOKUP(C15,PartnerN°Ref,3,FALSE)),\"\")","v":"#ERROR!"},"Isfahan ","Staff",3.0,"Shiraz","100 KM and 499 KM",5.0,null,null,{"$f":"IF(AND(M92>0,L92<>\"\"),IF(M92>(ROUND( (ROUND(ROUND(H92,0)*(VLOOKUP(J92,TravelCosts,2,FALSE)),2))/0.65,2)),ROUND(M92*0.8,2),\"covered by unit cost\"),0)","v":0},{"$f":"IF(OR(AND(L92<>\"\",M92>0,ISNUMBER(N92)),R92=\"Error\"),0,ROUND(ROUND(H92,0)*(VLOOKUP(J92,TravelCosts,2,FALSE)),2))","v":"#ERROR!"},"#ERROR!","#ERROR!",{"$f":"IF(OR(COUNTIF(WorkPackage,B77)=0,COUNTIF(PartnerN°,C77)=0,D77=\"\",COUNTIF(CountryALL,E77)=0,F77=\"\",COUNTIF(Category2,G77)=0,ISNUMBER(H77)=FALSE,H77<=0,I77=\"\",COUNTIF(TravelBands,J77)=0,ISNUMBER(K77)=FALSE,OR(K77<0,K77>90),IF(ISNUMBER(H77)=TRUE,H77=INT(H77*1)/1=FALSE),IF(ISNUMBER(K77)=TRUE,K77=INT(K77*1)/1=FALSE),AND(L77<>\"\",M77=0),AND(L77=\"\",M77>0),ISNUMBER(N77)=FALSE ),\"Error\",\"\")","v":"#ERROR!"}]
[null,"Development","P9",{"$f":"IFERROR(IF(VLOOKUP(C15,PartnerN°Ref,2,FALSE)=0,\"\",VLOOKUP(C15,PartnerN°Ref,2,FALSE)),\"\")","v":"#ERROR!"},{"$f":"IFERROR(IF(OR(VLOOKUP(C15,PartnerN°Ref,4,FALSE)=\"Country not found\",VLOOKUP(C15,PartnerN°Ref,3,FALSE)=0),\"\",VLOOKUP(C15,PartnerN°Ref,3,FALSE)),\"\")","v":"#ERROR!"},"Tehran ","Staff",3.0,"Shiraz","500 KM and 1999 KM",5.0,null,null,{"$f":"IF(AND(M93>0,L93<>\"\"),IF(M93>(ROUND( (ROUND(ROUND(H93,0)*(VLOOKUP(J93,TravelCosts,2,FALSE)),2))/0.65,2)),ROUND(M93*0.8,2),\"covered by unit cost\"),0)","v":0},{"$f":"IF(OR(AND(L93<>\"\",M93>0,ISNUMBER(N93)),R93=\"Error\"),0,ROUND(ROUND(H93,0)*(VLOOKUP(J93,TravelCosts,2,FALSE)),2))","v":"#ERROR!"},"#ERROR!","#ERROR!",{"$f":"IF(OR(COUNTIF(WorkPackage,B77)=0,COUNTIF(PartnerN°,C77)=0,D77=\"\",COUNTIF(CountryALL,E77)=0,F77=\"\",COUNTIF(Category2,G77)=0,ISNUMBER(H77)=FALSE,H77<=0,I77=\"\",COUNTIF(TravelBands,J77)=0,ISNUMBER(K77)=FALSE,OR(K77<0,K77>90),IF(ISNUMBER(H77)=TRUE,H77=INT(H77*1)/1=FALSE),IF(ISNUMBER(K77)=TRUE,K77=INT(K77*1)/1=FALSE),AND(L77<>\"\",M77=0),AND(L77=\"\",M77>0),ISNUMBER(N77)=FALSE ),\"Error\",\"\")","v":"#ERROR!"}]
[null,"Development","P10",{"$f":"IFERROR(IF(VLOOKUP(C15,PartnerN°Ref,2,FALSE)=0,\"\",VLOOKUP(C15,PartnerN°Ref,2,FALSE)),\"\")","v":"#ERROR!"},{"$f":"IFERROR(IF(OR(VLOOKUP(C15,PartnerN°Ref,4,FALSE)=\"Country not found\",VLOOKUP(C15,PartnerN°Ref,3,FALSE)=0),\"\",VLOOKUP(C15,PartnerN°Ref,3,FALSE)),\"\")","v":"#ERROR!"},"Ahvaz","Staff",3.0,"Shiraz","100 KM and 499 KM",5.0,null,null,{"$f":"IF(AND(M94>0,L94<>\"\"),IF(M94>(ROUND( (ROUND(ROUND(H94,0)*(VLOOKUP(J94,TravelCosts,2,FALSE)),2))/0.65,2)),ROUND(M94*0.8,2),\"covered by unit cost\"),0)","v":0},{"$f":"IF(OR(AND(L94<>\"\",M94>0,ISNUMBER(N94)),R94=\"Error\"),0,ROUND(ROUND(H94,0)*(VLOOKUP(J94,TravelCosts,2,FALSE)),2))","v":"#ERROR!"},"#ERROR!","#ERROR!",{"$f":"IF(OR(COUNTIF(WorkPackage,B77)=0,COUNTIF(PartnerN°,C77)=0,D77=\"\",COUNTIF(CountryALL,E77)=0,F77=\"\",COUNTIF(Category2,G77)=0,ISNUMBER(H77)=FALSE,H77<=0,I77=\"\",COUNTIF(TravelBands,J77)=0,ISNUMBER(K77)=FALSE,OR(K77<0,K77>90),IF(ISNUMBER(H77)=TRUE,H77=INT(H77*1)/1=FALSE),IF(ISNUMBER(K77)=TRUE,K77=INT(K77*1)/1=FALSE),AND(L77<>\"\",M77=0),AND(L77=\"\",M77>0),ISNUMBER(N77)=FALSE ),\"Error\",\"\")","v":"#ERROR!"}]
[null,"Development","P11",{"$f":"IFERROR(IF(VLOOKUP(C15,PartnerN°Ref,2,FALSE)=0,\"\",VLOOKUP(C15,PartnerN°Ref,2,FALSE)),\"\")","v":"#ERROR!"},{"$f":"IFERROR(IF(OR(VLOOKUP(C15,PartnerN°Ref,4,FALSE)=\"Country not found\",VLOOKUP(C15,PartnerN°Ref,3,FALSE)=0),\"\",VLOOKUP(C15,PartnerN°Ref,3,FALSE)),\"\")","v":"#ERROR!"},"Tehran ","Staff",3.0,"Shiraz","500 KM and 1999 KM",5.0,null,null,{"$f":"IF(AND(M95>0,L95<>\"\"),IF(M95>(ROUND( (ROUND(ROUND(H95,0)*(VLOOKUP(J95,TravelCosts,2,FALSE)),2))/0.65,2)),ROUND(M95*0.8,2),\"covered by unit cost\"),0)","v":0},{"$f":"IF(OR(AND(L95<>\"\",M95>0,ISNUMBER(N95)),R95=\"Error\"),0,ROUND(ROUND(H95,0)*(VLOOKUP(J95,TravelCosts,2,FALSE)),2))","v":"#ERROR!"},"#ERROR!","#ERROR!",{"$f":"IF(OR(COUNTIF(WorkPackage,B77)=0,COUNTIF(PartnerN°,C77)=0,D77=\"\",COUNTIF(CountryALL,E77)=0,F77=\"\",COUNTIF(Category2,G77)=0,ISNUMBER(H77)=FALSE,H77<=0,I77=\"\",COUNTIF(TravelBands,J77)=0,ISNUMBER(K77)=FALSE,OR(K77<0,K77>90),IF(ISNUMBER(H77)=TRUE,H77=INT(H77*1)/1=FALSE),IF(ISNUMBER(K77)=TRUE,K77=INT(K77*1)/1=FALSE),AND(L77<>\"\",M77=0),AND(L77=\"\",M77>0),ISNUMBER(N77)=FALSE ),\"Error\",\"\")","v":"#ERROR!"}]
[null,"Development","P12",{"$f":"IFERROR(IF(VLOOKUP(C15,PartnerN°Ref,2,FALSE)=0,\"\",VLOOKUP(C15,PartnerN°Ref,2,FALSE)),\"\")","v":"#ERROR!"},{"$f":"IFERROR(IF(OR(VLOOKUP(C15,PartnerN°Ref,4,FALSE)=\"Country not found\",VLOOKUP(C15,PartnerN°Ref,3,FALSE)=0),\"\",VLOOKUP(C15,PartnerN°Ref,3,FALSE)),\"\")","v":"#ERROR!"},"Tehran ","Staff",3.0,"Shiraz","500 KM and 1999 KM",5.0,null,null,{"$f":"IF(AND(M96>0,L96<>\"\"),IF(M96>(ROUND( (ROUND(ROUND(H96,0)*(VLOOKUP(J96,TravelCosts,2,FALSE)),2))/0.65,2)),ROUND(M96*0.8,2),\"covered by unit cost\"),0)","v":0},{"$f":"IF(OR(AND(L96<>\"\",M96>0,ISNUMBER(N96)),R96=\"Error\"),0,ROUND(ROUND(H96,0)*(VLOOKUP(J96,TravelCosts,2,FALSE)),2))","v":"#ERROR!"},"#ERROR!","#ERROR!",{"$f":"IF(OR(COUNTIF(WorkPackage,B77)=0,COUNTIF(PartnerN°,C77)=0,D77=\"\",COUNTIF(CountryALL,E77)=0,F77=\"\",COUNTIF(Category2,G77)=0,ISNUMBER(H77)=FALSE,H77<=0,I77=\"\",COUNTIF(TravelBands,J77)=0,ISNUMBER(K77)=FALSE,OR(K77<0,K77>90),IF(ISNUMBER(H77)=TRUE,H77=INT(H77*1)/1=FALSE),IF(ISNUMBER(K77)=TRUE,K77=INT(K77*1)/1=FALSE),AND(L77<>\"\",M77=0),AND(L77=\"\",M77>0),ISNUMBER(N77)=FALSE ),\"Error\",\"\")","v":"#ERROR!"}]
[null,"Dissemination & Exploitation","P1",{"$f":"IFERROR(IF(VLOOKUP(C15,PartnerN°Ref,2,FALSE)=0,\"\",VLOOKUP(C15,PartnerN°Ref,2,FALSE)),\"\")","v":"#ERROR!"},{"$f":"IFERROR(IF(OR(VLOOKUP(C15,PartnerN°Ref,4,FALSE)=\"Country not found\",VLOOKUP(C15,PartnerN°Ref,3,FALSE)=0),\"\",VLOOKUP(C15,PartnerN°Ref,3,FALSE)),\"\")","v":"#ERROR!"},"Rome","Staff",3.0,"Tehran ","3000 KM and 3999 KM",5.0,null,null,{"$f":"IF(AND(M97>0,L97<>\"\"),IF(M97>(ROUND( (ROUND(ROUND(H97,0)*(VLOOKUP(J97,TravelCosts,2,FALSE)),2))/0.65,2)),ROUND(M97*0.8,2),\"covered by unit cost\"),0)","v":0},{"$f":"IF(OR(AND(L97<>\"\",M97>0,ISNUMBER(N97)),R97=\"Error\"),0,ROUND(ROUND(H97,0)*(VLOOKUP(J97,TravelCosts,2,FALSE)),2))","v":"#ERROR!"},"#ERROR!","#ERROR!",{"$f":"IF(OR(COUNTIF(WorkPackage,B77)=0,COUNTIF(PartnerN°,C77)=0,D77=\"\",COUNTIF(CountryALL,E77)=0,F77=\"\",COUNTIF(Category2,G77)=0,ISNUMBER(H77)=FALSE,H77<=0,I77=\"\",COUNTIF(TravelBands,J77)=0,ISNUMBER(K77)=FALSE,OR(K77<0,K77>90),IF(ISNUMBER(H77)=TRUE,H77=INT(H77*1)/1=FALSE),IF(ISNUMBER(K77)=TRUE,K77=INT(K77*1)/1=FALSE),AND(L77<>\"\",M77=0),AND(L77=\"\",M77>0),ISNUMBER(N77)=FALSE ),\"Error\",\"\")","v":"#ERROR!"}]
[null,"Dissemination & Exploitation","P2",{"$f":"IFERROR(IF(VLOOKUP(C15,PartnerN°Ref,2,FALSE)=0,\"\",VLOOKUP(C15,PartnerN°Ref,2,FALSE)),\"\")","v":"#ERROR!"},{"$f":"IFERROR(IF(OR(VLOOKUP(C15,PartnerN°Ref,4,FALSE)=\"Country not found\",VLOOKUP(C15,PartnerN°Ref,3,FALSE)=0),\"\",VLOOKUP(C15,PartnerN°Ref,3,FALSE)),\"\")","v":"#ERROR!"},"Turku ","Staff",3.0,"Tehran ","3000 KM and 3999 KM",5.0,null,null,{"$f":"IF(AND(M98>0,L98<>\"\"),IF(M98>(ROUND( (ROUND(ROUND(H98,0)*(VLOOKUP(J98,TravelCosts,2,FALSE)),2))/0.65,2)),ROUND(M98*0.8,2),\"covered by unit cost\"),0)","v":0},{"$f":"IF(OR(AND(L98<>\"\",M98>0,ISNUMBER(N98)),R98=\"Error\"),0,ROUND(ROUND(H98,0)*(VLOOKUP(J98,TravelCosts,2,FALSE)),2))","v":"#ERROR!"},"#ERROR!","#ERROR!",{"$f":"IF(OR(COUNTIF(WorkPackage,B77)=0,COUNTIF(PartnerN°,C77)=0,D77=\"\",COUNTIF(CountryALL,E77)=0,F77=\"\",COUNTIF(Category2,G77)=0,ISNUMBER(H77)=FALSE,H77<=0,I77=\"\",COUNTIF(TravelBands,J77)=0,ISNUMBER(K77)=FALSE,OR(K77<0,K77>90),IF(ISNUMBER(H77)=TRUE,H77=INT(H77*1)/1=FALSE),IF(ISNUMBER(K77)=TRUE,K77=INT(K77*1)/1=FALSE),AND(L77<>\"\",M77=0),AND(L77=\"\",M77>0),ISNUMBER(N77)=FALSE ),\"Error\",\"\")","v":"#ERROR!"}]
[null,"Dissemination & Exploitation","P3",{"$f":"IFERROR(IF(VLOOKUP(C15,PartnerN°Ref,2,FALSE)=0,\"\",VLOOKUP(C15,PartnerN°Ref,2,FALSE)),\"\")","v":"#ERROR!"},{"$f":"IFERROR(IF(OR(VLOOKUP(C15,PartnerN°Ref,4,FALSE)=\"Country not found\",VLOOKUP(C15,PartnerN°Ref,3,FALSE)=0),\"\",VLOOKUP(C15,PartnerN°Ref,3,FALSE)),\"\")","v":"#ERROR!"},"Lisbon ","Staff",3.0,"Tehran ","4000 KM and 7999 KM",5.0,null,null,{"$f":"IF(AND(M99>0,L99<>\"\"),IF(M99>(ROUND( (ROUND(ROUND(H99,0)*(VLOOKUP(J99,TravelCosts,2,FALSE)),2))/0.65,2)),ROUND(M99*0.8,2),\"covered by unit cost\"),0)","v":0},{"$f":"IF(OR(AND(L99<>\"\",M99>0,ISNUMBER(N99)),R99=\"Error\"),0,ROUND(ROUND(H99,0)*(VLOOKUP(J99,TravelCosts,2,FALSE)),2))","v":"#ERROR!"},"#ERROR!","#ERROR!",{"$f":"IF(OR(COUNTIF(WorkPackage,B77)=0,COUNTIF(PartnerN°,C77)=0,D77=\"\",COUNTIF(CountryALL,E77)=0,F77=\"\",COUNTIF(Category2,G77)=0,ISNUMBER(H77)=FALSE,H77<=0,I77=\"\",COUNTIF(TravelBands,J77)=0,ISNUMBER(K77)=FALSE,OR(K77<0,K77>90),IF(ISNUMBER(H77)=TRUE,H77=INT(H77*1)/1=FALSE),IF(ISNUMBER(K77)=TRUE,K77=INT(K77*1)/1=FALSE),AND(L77<>\"\",M77=0),AND(L77=\"\",M77>0),ISNUMBER(N77)=FALSE ),\"Error\",\"\")","v":"#ERROR!"}]
[null,"Dissemination & Exploitation","P4",{"$f":"IFERROR(IF(VLOOKUP(C15,PartnerN°Ref,2,FALSE)=0,\"\",VLOOKUP(C15,PartnerN°Ref,2,FALSE)),\"\")","v":"#ERROR!"},{"$f":"IFERROR(IF(OR(VLOOKUP(C15,PartnerN°Ref,4,FALSE)=\"Country not found\",VLOOKUP(C15,PartnerN°Ref,3,FALSE)=0),\"\",VLOOKUP(C15,PartnerN°Ref,3,FALSE)),\"\")","v":"#ERROR!"},"Alexandropoulos","Staff",3.0,"Tehran ","2000 KM and 2999 KM",5.0,null,null,{"$f":"IF(AND(M100>0,L100<>\"\"),IF(M100>(ROUND( (ROUND(ROUND(H100,0)*(VLOOKUP(J100,TravelCosts,2,FALSE)),2))/0.65,2)),ROUND(M100*0.8,2),\"covered by unit cost\"),0)","v":0},{"$f":"IF(OR(AND(L100<>\"\",M100>0,ISNUMBER(N100)),R100=\"Error\"),0,ROUND(ROUND(H100,0)*(VLOOKUP(J100,TravelCosts,2,FALSE)),2))","v":"#ERROR!"},"#ERROR!","#ERROR!",{"$f":"IF(OR(COUNTIF(WorkPackage,B77)=0,COUNTIF(PartnerN°,C77)=0,D77=\"\",COUNTIF(CountryALL,E77)=0,F77=\"\",COUNTIF(Category2,G77)=0,ISNUMBER(H77)=FALSE,H77<=0,I77=\"\",COUNTIF(TravelBands,J77)=0,ISNUMBER(K77)=FALSE,OR(K77<0,K77>90),IF(ISNUMBER(H77)=TRUE,H77=INT(H77*1)/1=FALSE),IF(ISNUMBER(K77)=TRUE,K77=INT(K77*1)/1=FALSE),AND(L77<>\"\",M77=0),AND(L77=\"\",M77>0),ISNUMBER(N77)=FALSE ),\"Error\",\"\")","v":"#ERROR!"}]
[null,"Dissemination & Exploitation","P5",{"$f":"IFERROR(IF(VLOOKUP(C15,PartnerN°Ref,2,FALSE)=0,\"\",VLOOKUP(C15,PartnerN°Ref,2,FALSE)),\"\")","v":"#ERROR!"},{"$f":"IFERROR(IF(OR(VLOOKUP(C15,PartnerN°Ref,4,FALSE)=\"Country not found\",VLOOKUP(C15,PartnerN°Ref,3,FALSE)=0),\"\",VLOOKUP(C15,PartnerN°Ref,3,FALSE)),\"\")","v":"#ERROR!"},"Qazvin ","Staff",4.0,"Tehran ","100 KM and 499 KM",5.0,null,null,{"$f":"IF(AND(M101>0,L101<>\"\"),IF(M101>(ROUND( (ROUND(ROUND(H101,0)*(VLOOKUP(J101,TravelCosts,2,FALSE)),2))/0.65,2)),ROUND(M101*0.8,2),\"covered by unit cost\"),0)","v":0},{"$f":"IF(OR(AND(L101<>\"\",M101>0,ISNUMBER(N101)),R101=\"Error\"),0,ROUND(ROUND(H101,0)*(VLOOKUP(J101,TravelCosts,2,FALSE)),2))","v":"#ERROR!"},"#ERROR!","#ERROR!",{"$f":"IF(OR(COUNTIF(WorkPackage,B77)=0,COUNTIF(PartnerN°,C77)=0,D77=\"\",COUNTIF(CountryALL,E77)=0,F77=\"\",COUNTIF(Category2,G77)=0,ISNUMBER(H77)=FALSE,H77<=0,I77=\"\",COUNTIF(TravelBands,J77)=0,ISNUMBER(K77)=FALSE,OR(K77<0,K77>90),IF(ISNUMBER(H77)=TRUE,H77=INT(H77*1)/1=FALSE),IF(ISNUMBER(K77)=TRUE,K77=INT(K77*1)/1=FALSE),AND(L77<>\"\",M77=0),AND(L77=\"\",M77>0),ISNUMBER(N77)=FALSE ),\"Error\",\"\")","v":"#ERROR!"}]
[null,"Dissemination & Exploitation","P6",{"$f":"IFERROR(IF(VLOOKUP(C15,PartnerN°Ref,2,FALSE)=0,\"\",VLOOKUP(C15,PartnerN°Ref,2,FALSE)),\"\")","v":"#ERROR!"},{"$f":"IFERROR(IF(OR(VLOOKUP(C15,PartnerN°Ref,4,FALSE)=\"Country not found\",VLOOKUP(C15,PartnerN°Ref,3,FALSE)=0),\"\",VLOOKUP(C15,PartnerN°Ref,3,FALSE)),\"\")","v":"#ERROR!"},"Zahedan ","Staff",4.0,"Tehran ","500 KM and 1999 KM",5.0,null,null,{"$f":"IF(AND(M102>0,L102<>\"\"),IF(M102>(ROUND( (ROUND(ROUND(H102,0)*(VLOOKUP(J102,TravelCosts,2,FALSE)),2))/0.65,2)),ROUND(M102*0.8,2),\"covered by unit cost\"),0)","v":0},{"$f":"IF(OR(AND(L102<>\"\",M102>0,ISNUMBER(N102)),R102=\"Error\"),0,ROUND(ROUND(H102,0)*(VLOOKUP(J102,TravelCosts,2,FALSE)),2))","v":"#ERROR!"},"#ERROR!","#ERROR!",{"$f":"IF(OR(COUNTIF(WorkPackage,B77)=0,COUNTIF(PartnerN°,C77)=0,D77=\"\",COUNTIF(CountryALL,E77)=0,F77=\"\",COUNTIF(Category2,G77)=0,ISNUMBER(H77)=FALSE,H77<=0,I77=\"\",COUNTIF(TravelBands,J77)=0,ISNUMBER(K77)=FALSE,OR(K77<0,K77>90),IF(ISNUMBER(H77)=TRUE,H77=INT(H77*1)/1=FALSE),IF(ISNUMBER(K77)=TRUE,K77=INT(K77*1)/1=FALSE),AND(L77<>\"\",M77=0),AND(L77=\"\",M77>0),ISNUMBER(N77)=FALSE ),\"Error\",\"\")","v":"#ERROR!"}]
[null,"Dissemination & Exploitation","P7",{"$f":"IFERROR(IF(VLOOKUP(C15,PartnerN°Ref,2,FALSE)=0,\"\",VLOOKUP(C15,PartnerN°Ref,2,FALSE)),\"\")","v":"#ERROR!"},{"$f":"IFERROR(IF(OR(VLOOKUP(C15,PartnerN°Ref,4,FALSE)=\"Country not found\",VLOOKUP(C15,PartnerN°Ref,3,FALSE)=0),\"\",VLOOKUP(C15,PartnerN°Ref,3,FALSE)),\"\")","v":"#ERROR!"},"Shiraz","Staff",4.0,"Tehran ","500 KM and 1999 KM",5.0,null,null,{"$f":"IF(AND(M103>0,L103<>\"\"),IF(M103>(ROUND( (ROUND(ROUND(H103,0)*(VLOOKUP(J103,TravelCosts,2,FALSE)),2))/0.65,2)),ROUND(M103*0.8,2),\"covered by unit cost\"),0)","v":0},{"$f":"IF(OR(AND(L103<>\"\",M103>0,ISNUMBER(N103)),R103=\"Error\"),0,ROUND(ROUND(H103,0)*(VLOOKUP(J103,TravelCosts,2,FALSE)),2))","v":"#ERROR!"},"#ERROR!","#ERROR!",{"$f":"IF(OR(COUNTIF(WorkPackage,B77)=0,COUNTIF(PartnerN°,C77)=0,D77=\"\",COUNTIF(CountryALL,E77)=0,F77=\"\",COUNTIF(Category2,G77)=0,ISNUMBER(H77)=FALSE,H77<=0,I77=\"\",COUNTIF(TravelBands,J77)=0,ISNUMBER(K77)=FALSE,OR(K77<0,K77>90),IF(ISNUMBER(H77)=TRUE,H77=INT(H77*1)/1=FALSE),IF(ISNUMBER(K77)=TRUE,K77=INT(K77*1)/1=FALSE),AND(L77<>\"\",M77=0),AND(L77=\"\",M77>0),ISNUMBER(N77)=FALSE ),\"Error\",\"\")","v":"#ERROR!"}]
[null,"Dissemination & Exploitation","P8",{"$f":"IFERROR(IF(VLOOKUP(C15,PartnerN°Ref,2,FALSE)=0,\"\",VLOOKUP(C15,PartnerN°Ref,2,FALSE)),\"\")","v":"#ERROR!"},{"$f":"IFERROR(IF(OR(VLOOKUP(C15,PartnerN°Ref,4,FALSE)=\"Country not found\",VLOOKUP(C15,PartnerN°Ref,3,FALSE)=0),\"\",VLOOKUP(C15,PartnerN°Ref,3,FALSE)),\"\")","v":"#ERROR!"},"Isfahan ","Staff",4.0,"Tehran ","100 KM and 499 KM",5.0,null,null,{"$f":"IF(AND(M104>0,L104<>\"\"),IF(M104>(ROUND( (ROUND(ROUND(H104,0)*(VLOOKUP(J104,TravelCosts,2,FALSE)),2))/0.65,2)),ROUND(M104*0.8,2),\"covered by unit cost\"),0)","v":0},{"$f":"IF(OR(AND(L104<>\"\",M104>0,ISNUMBER(N104)),R104=\"Error\"),0,ROUND(ROUND(H104,0)*(VLOOKUP(J104,TravelCosts,2,FALSE)),2))","v":"#ERROR!"},"#ERROR!","#ERROR!",{"$f":"IF(OR(COUNTIF(WorkPackage,B77)=0,COUNTIF(PartnerN°,C77)=0,D77=\"\",COUNTIF(CountryALL,E77)=0,F77=\"\",COUNTIF(Category2,G77)=0,ISNUMBER(H77)=FALSE,H77<=0,I77=\"\",COUNTIF(TravelBands,J77)=0,ISNUMBER(K77)=FALSE,OR(K77<0,K77>90),IF(ISNUMBER(H77)=TRUE,H77=INT(H77*1)/1=FALSE),IF(ISNUMBER(K77)=TRUE,K77=INT(K77*1)/1=FALSE),AND(L77<>\"\",M77=0),AND(L77=\"\",M77>0),ISNUMBER(N77)=FALSE ),\"Error\",\"\")","v":"#ERROR!"}]
[null,"Dissemination & Exploitation","P10",{"$f":"IFERROR(IF(VLOOKUP(C15,PartnerN°Ref,2,FALSE)=0,\"\",VLOOKUP(C15,PartnerN°Ref,2,FALSE)),\"\")","v":"#ERROR!"},{"$f":"IFERROR(IF(OR(VLOOKUP(C15,PartnerN°Ref,4,FALSE)=\"Country not found\",VLOOKUP(C15,PartnerN°Ref,3,FALSE)=0),\"\",VLOOKUP(C15,PartnerN°Ref,3,FALSE)),\"\")","v":"#ERROR!"},"Ahvaz","Staff",4.0,"Tehran ","500 KM and 1999 KM",5.0,null,null,{"$f":"IF(AND(M105>0,L105<>\"\"),IF(M105>(ROUND( (ROUND(ROUND(H105,0)*(VLOOKUP(J105,TravelCosts,2,FALSE)),2))/0.65,2)),ROUND(M105*0.8,2),\"covered by unit cost\"),0)","v":0},{"$f":"IF(OR(AND(L105<>\"\",M105>0,ISNUMBER(N105)),R105=\"Error\"),0,ROUND(ROUND(H105,0)*(VLOOKUP(J105,TravelCosts,2,FALSE)),2))","v":"#ERROR!"},"#ERROR!","#ERROR!",{"$f":"IF(OR(COUNTIF(WorkPackage,B77)=0,COUNTIF(PartnerN°,C77)=0,D77=\"\",COUNTIF(CountryALL,E77)=0,F77=\"\",COUNTIF(Category2,G77)=0,ISNUMBER(H77)=FALSE,H77<=0,I77=\"\",COUNTIF(TravelBands,J77)=0,ISNUMBER(K77)=FALSE,OR(K77<0,K77>90),IF(ISNUMBER(H77)=TRUE,H77=INT(H77*1)/1=FALSE),IF(ISNUMBER(K77)=TRUE,K77=INT(K77*1)/1=FALSE),AND(L77<>\"\",M77=0),AND(L77=\"\",M77>0),ISNUMBER(N77)=FALSE ),\"Error\",\"\")","v":"#ERROR!"}]
[null,"Management","P2",{"$f":"IFERROR(IF(VLOOKUP(C15,PartnerN°Ref,2,FALSE)=0,\"\",VLOOKUP(C15,PartnerN°Ref,2,FALSE)),\"\")","v":"#ERROR!"},{"$f":"IFERROR(IF(OR(VLOOKUP(C15,PartnerN°Ref,4,FALSE)=\"Country not found\",VLOOKUP(C15,PartnerN°Ref,3,FALSE)=0),\"\",VLOOKUP(C15,PartnerN°Ref,3,FALSE)),\"\")","v":"#ERROR!"},"Turku","Staff",3.0,"Rome","2000 KM and 2999 KM",5.0,null,null,{"$f":"IF(AND(M106>0,L106<>\"\"),IF(M106>(ROUND( (ROUND(ROUND(H106,0)*(VLOOKUP(J106,TravelCosts,2,FALSE)),2))/0.65,2)),ROUND(M106*0.8,2),\"covered by unit cost\"),0)","v":0},{"$f":"IF(OR(AND(L106<>\"\",M106>0,ISNUMBER(N106)),R106=\"Error\"),0,ROUND(ROUND(H106,0)*(VLOOKUP(J106,TravelCosts,2,FALSE)),2))","v":"#ERROR!"},"#ERROR!","#ERROR!",{"$f":"IF(OR(COUNTIF(WorkPackage,B77)=0,COUNTIF(PartnerN°,C77)=0,D77=\"\",COUNTIF(CountryALL,E77)=0,F77=\"\",COUNTIF(Category2,G77)=0,ISNUMBER(H77)=FALSE,H77<=0,I77=\"\",COUNTIF(TravelBands,J77)=0,ISNUMBER(K77)=FALSE,OR(K77<0,K77>90),IF(ISNUMBER(H77)=TRUE,H77=INT(H77*1)/1=FALSE),IF(ISNUMBER(K77)=TRUE,K77=INT(K77*1)/1=FALSE),AND(L77<>\"\",M77=0),AND(L77=\"\",M77>0),ISNUMBER(N77)=FALSE ),\"Error\",\"\")","v":"#ERROR!"}]
[null,"Management","P3",{"$f":"IFERROR(IF(VLOOKUP(C15,PartnerN°Ref,2,FALSE)=0,\"\",VLOOKUP(C15,PartnerN°Ref,2,FALSE)),\"\")","v":"#ERROR!"},{"$f":"IFERROR(IF(OR(VLOOKUP(C15,PartnerN°Ref,4,FALSE)=\"Country not found\",VLOOKUP(C15,PartnerN°Ref,3,FALSE)=0),\"\",VLOOKUP(C15,PartnerN°Ref,3,FALSE)),\"\")","v":"#ERROR!"},"Lisbon ","Staff",3.0,"Rome","500 KM and 1999 KM",5.0,null,null,{"$f":"IF(AND(M107>0,L107<>\"\"),IF(M107>(ROUND( (ROUND(ROUND(H107,0)*(VLOOKUP(J107,TravelCosts,2,FALSE)),2))/0.65,2)),ROUND(M107*0.8,2),\"covered by unit cost\"),0)","v":0},{"$f":"IF(OR(AND(L107<>\"\",M107>0,ISNUMBER(N107)),R107=\"Error\"),0,ROUND(ROUND(H107,0)*(VLOOKUP(J107,TravelCosts,2,FALSE)),2))","v":"#ERROR!"},"#ERROR!","#ERROR!",{"$f":"IF(OR(COUNTIF(WorkPackage,B77)=0,COUNTIF(PartnerN°,C77)=0,D77=\"\",COUNTIF(CountryALL,E77)=0,F77=\"\",COUNTIF(Category2,G77)=0,ISNUMBER(H77)=FALSE,H77<=0,I77=\"\",COUNTIF(TravelBands,J77)=0,ISNUMBER(K77)=FALSE,OR(K77<0,K77>90),IF(ISNUMBER(H77)=TRUE,H77=INT(H77*1)/1=FALSE),IF(ISNUMBER(K77)=TRUE,K77=INT(K77*1)/1=FALSE),AND(L77<>\"\",M77=0),AND(L77=\"\",M77>0),ISNUMBER(N77)=FALSE ),\"Error\",\"\")","v":"#ERROR!"}]
[null,"Management","P4",{"$f":"IFERROR(IF(VLOOKUP(C15,PartnerN°Ref,2,FALSE)=0,\"\",VLOOKUP(C15,PartnerN°Ref,2,FALSE)),\"\")","v":"#ERROR!"},{"$f":"IFERROR(IF(OR(VLOOKUP(C15,PartnerN°Ref,4,FALSE)=\"Country not found\",VLOOKUP(C15,PartnerN°Ref,3,FALSE)=0),\"\",VLOOKUP(C15,PartnerN°Ref,3,FALSE)),\"\")","v":"#ERROR!"},"Alexandropoulos","Staff",3.0,"Rome","500 KM and 1999 KM",5.0,null,null,{"$f":"IF(AND(M108>0,L108<>\"\"),IF(M108>(ROUND( (ROUND(ROUND(H108,0)*(VLOOKUP(J108,TravelCosts,2,FALSE)),2))/0.65,2)),ROUND(M108*0.8,2),\"covered by unit cost\"),0)","v":0},{"$f":"IF(OR(AND(L108<>\"\",M108>0,ISNUMBER(N108)),R108=\"Error\"),0,ROUND(ROUND(H108,0)*(VLOOKUP(J108,TravelCosts,2,FALSE)),2))","v":"#ERROR!"},"#ERROR!","#ERROR!",{"$f":"IF(OR(COUNTIF(WorkPackage,B77)=0,COUNTIF(PartnerN°,C77)=0,D77=\"\",COUNTIF(CountryALL,E77)=0,F77=\"\",COUNTIF(Category2,G77)=0,ISNUMBER(H77)=FALSE,H77<=0,I77=\"\",COUNTIF(TravelBands,J77)=0,ISNUMBER(K77)=FALSE,OR(K77<0,K77>90),IF(ISNUMBER(H77)=TRUE,H77=INT(H77*1)/1=FALSE),IF(ISNUMBER(K77)=TRUE,K77=INT(K77*1)/1=FALSE),AND(L77<>\"\",M77=0),AND(L77=\"\",M77>0),ISNUMBER(N77)=FALSE ),\"Error\",\"\")","v":"#ERROR!"}]
[null,"Management","P5",{"$f":"IFERROR(IF(VLOOKUP(C15,PartnerN°Ref,2,FALSE)=0,\"\",VLOOKUP(C15,PartnerN°Ref,2,FALSE)),\"\")","v":"#ERROR!"},{"$f":"IFERROR(IF(OR(VLOOKUP(C15,PartnerN°Ref,4,FALSE)=\"Country not found\",VLOOKUP(C15,PartnerN°Ref,3,FALSE)=0),\"\",VLOOKUP(C15,PartnerN°Ref,3,FALSE)),\"\")","v":"#ERROR!"},"Qazvin ","Staff",3.0,"Rome","3000 KM and 3999 KM",5.0,null,null,{"$f":"IF(AND(M109>0,L109<>\"\"),IF(M109>(ROUND( (ROUND(ROUND(H109,0)*(VLOOKUP(J109,TravelCosts,2,FALSE)),2))/0.65,2)),ROUND(M109*0.8,2),\"covered by unit cost\"),0)","v":0},{"$f":"IF(OR(AND(L109<>\"\",M109>0,ISNUMBER(N109)),R109=\"Error\"),0,ROUND(ROUND(H109,0)*(VLOOKUP(J109,TravelCosts,2,FALSE)),2))","v":"#ERROR!"},"#ERROR!","#ERROR!",{"$f":"IF(OR(COUNTIF(WorkPackage,B109)=0,COUNTIF(PartnerN°,C109)=0,D109=\"\",COUNTIF(CountryALL,E109)=0,F109=\"\",COUNTIF(Category2,G109)=0,ISNUMBER(H109)=FALSE,H109<=0,I109=\"\",COUNTIF(TravelBands,J109)=0,ISNUMBER(K109)=FALSE,OR(K109<0,K109>90),IF(ISNUMBER(H109)=TRUE,H109=INT(H109*1)/1=FALSE),IF(ISNUMBER(K109)=TRUE,K109=INT(K109*1)/1=FALSE),AND(L109<>\"\",M109=0),AND(L109=\"\",M109>0),ISNUMBER(N109)=FALSE ),\"Error\",\"\")","v":"#ERROR!"}]
[null,"Management","P6",{"$f":"IFERROR(IF(VLOOKUP(C15,PartnerN°Ref,2,FALSE)=0,\"\",VLOOKUP(C15,PartnerN°Ref,2,FALSE)),\"\")","v":"#ERROR!"},{"$f":"IFERROR(IF(OR(VLOOKUP(C15,PartnerN°Ref,4,FALSE)=\"Country not found\",VLOOKUP(C15,PartnerN°Ref,3,FALSE)=0),\"\",VLOOKUP(C15,PartnerN°Ref,3,FALSE)),\"\")","v":"#ERROR!"},"Zahedan ","Staff",3.0,"Rome","4000 KM and 7999 KM",5.0,null,null,{"$f":"IF(AND(M110>0,L110<>\"\"),IF(M110>(ROUND( (ROUND(ROUND(H110,0)*(VLOOKUP(J110,TravelCosts,2,FALSE)),2))/0.65,2)),ROUND(M110*0.8,2),\"covered by unit cost\"),0)","v":0},{"$f":"IF(OR(AND(L110<>\"\",M110>0,ISNUMBER(N110)),R110=\"Error\"),0,ROUND(ROUND(H110,0)*(VLOOKUP(J110,TravelCosts,2,FALSE)),2))","v":"#ERROR!"},"#ERROR!","#ERROR!",{"$f":"IF(OR(COUNTIF(WorkPackage,B109)=0,COUNTIF(PartnerN°,C109)=0,D109=\"\",COUNTIF(CountryALL,E109)=0,F109=\"\",COUNTIF(Category2,G109)=0,ISNUMBER(H109)=FALSE,H109<=0,I109=\"\",COUNTIF(TravelBands,J109)=0,ISNUMBER(K109)=FALSE,OR(K109<0,K109>90),IF(ISNUMBER(H109)=TRUE,H109=INT(H109*1)/1=FALSE),IF(ISNUMBER(K109)=TRUE,K109=INT(K109*1)/1=FALSE),AND(L109<>\"\",M109=0),AND(L109=\"\",M109>0),ISNUMBER(N109)=FALSE ),\"Error\",\"\")","v":"#ERROR!"}]
[null,"Management","P7",{"$f":"IFERROR(IF(VLOOKUP(C15,PartnerN°Ref,2,FALSE)=0,\"\",VLOOKUP(C15,PartnerN°Ref,2,FALSE)),\"\")","v":"#ERROR!"},{"$f":"IFERROR(IF(OR(VLOOKUP(C15,PartnerN°Ref,4,FALSE)=\"Country not found\",VLOOKUP(C15,PartnerN°Ref,3,FALSE)=0),\"\",VLOOKUP(C15,PartnerN°Ref,3,FALSE)),\"\")","v":"#ERROR!"},"Shiraz","Staff",3.0,"Rome","3000 KM and 3999 KM",5.0,null,null,{"$f":"IF(AND(M111>0,L111<>\"\"),IF(M111>(ROUND( (ROUND(ROUND(H111,0)*(VLOOKUP(J111,TravelCosts,2,FALSE)),2))/0.65,2)),ROUND(M111*0.8,2),\"covered by unit cost\"),0)","v":0},{"$f":"IF(OR(AND(L111<>\"\",M111>0,ISNUMBER(N111)),R111=\"Error\"),0,ROUND(ROUND(H111,0)*(VLOOKUP(J111,TravelCosts,2,FALSE)),2))","v":"#ERROR!"},"#ERROR!","#ERROR!",{"$f":"IF(OR(COUNTIF(WorkPackage,B109)=0,COUNTIF(PartnerN°,C109)=0,D109=\"\",COUNTIF(CountryALL,E109)=0,F109=\"\",COUNTIF(Category2,G109)=0,ISNUMBER(H109)=FALSE,H109<=0,I109=\"\",COUNTIF(TravelBands,J109)=0,ISNUMBER(K109)=FALSE,OR(K109<0,K109>90),IF(ISNUMBER(H109)=TRUE,H109=INT(H109*1)/1=FALSE),IF(ISNUMBER(K109)=TRUE,K109=INT(K109*1)/1=FALSE),AND(L109<>\"\",M109=0),AND(L109=\"\",M109>0),ISNUMBER(N109)=FALSE ),\"Error\",\"\")","v":"#ERROR!"}]
[null,"Management","P8",{"$f":"IFERROR(IF(VLOOKUP(C15,PartnerN°Ref,2,FALSE)=0,\"\",VLOOKUP(C15,PartnerN°Ref,2,FALSE)),\"\")","v":"#ERROR!"},{"$f":"IFERROR(IF(OR(VLOOKUP(C15,PartnerN°Ref,4,FALSE)=\"Country not found\",VLOOKUP(C15,PartnerN°Ref,3,FALSE)=0),\"\",VLOOKUP(C15,PartnerN°Ref,3,FALSE)),\"\")","v":"#ERROR!"},"Isfahan ","Staff",3.0,"Rome","3000 KM and 3999 KM",5.0,null,null,{"$f":"IF(AND(M112>0,L112<>\"\"),IF(M112>(ROUND( (ROUND(ROUND(H112,0)*(VLOOKUP(J112,TravelCosts,2,FALSE)),2))/0.65,2)),ROUND(M112*0.8,2),\"covered by unit cost\"),0)","v":0},{"$f":"IF(OR(AND(L112<>\"\",M112>0,ISNUMBER(N112)),R112=\"Error\"),0,ROUND(ROUND(H112,0)*(VLOOKUP(J112,TravelCosts,2,FALSE)),2))","v":"#ERROR!"},"#ERROR!","#ERROR!",{"$f":"IF(OR(COUNTIF(WorkPackage,B109)=0,COUNTIF(PartnerN°,C109)=0,D109=\"\",COUNTIF(CountryALL,E109)=0,F109=\"\",COUNTIF(Category2,G109)=0,ISNUMBER(H109)=FALSE,H109<=0,I109=\"\",COUNTIF(TravelBands,J109)=0,ISNUMBER(K109)=FALSE,OR(K109<0,K109>90),IF(ISNUMBER(H109)=TRUE,H109=INT(H109*1)/1=FALSE),IF(ISNUMBER(K109)=TRUE,K109=INT(K109*1)/1=FALSE),AND(L109<>\"\",M109=0),AND(L109=\"\",M109>0),ISNUMBER(N109)=FALSE ),\"Error\",\"\")","v":"#ERROR!"}]
[null,"Management","P9",{"$f":"IFERROR(IF(VLOOKUP(C15,PartnerN°Ref,2,FALSE)=0,\"\",VLOOKUP(C15,PartnerN°Ref,2,FALSE)),\"\")","v":"#ERROR!"},{"$f":"IFERROR(IF(OR(VLOOKUP(C15,PartnerN°Ref,4,FALSE)=\"Country not found\",VLOOKUP(C15,PartnerN°Ref,3,FALSE)=0),\"\",VLOOKUP(C15,PartnerN°Ref,3,FALSE)),\"\")","v":"#ERROR!"},"Tehran ","Staff",3.0,"Rome","3000 KM and 3999 KM",5.0,null,null,{"$f":"IF(AND(M113>0,L113<>\"\"),IF(M113>(ROUND( (ROUND(ROUND(H113,0)*(VLOOKUP(J113,TravelCosts,2,FALSE)),2))/0.65,2)),ROUND(M113*0.8,2),\"covered by unit cost\"),0)","v":0},{"$f":"IF(OR(AND(L113<>\"\",M113>0,ISNUMBER(N113)),R113=\"Error\"),0,ROUND(ROUND(H113,0)*(VLOOKUP(J113,TravelCosts,2,FALSE)),2))","v":"#ERROR!"},"#ERROR!","#ERROR!",{"$f":"IF(OR(COUNTIF(WorkPackage,B109)=0,COUNTIF(PartnerN°,C109)=0,D109=\"\",COUNTIF(CountryALL,E109)=0,F109=\"\",COUNTIF(Category2,G109)=0,ISNUMBER(H109)=FALSE,H109<=0,I109=\"\",COUNTIF(TravelBands,J109)=0,ISNUMBER(K109)=FALSE,OR(K109<0,K109>90),IF(ISNUMBER(H109)=TRUE,H109=INT(H109*1)/1=FALSE),IF(ISNUMBER(K109)=TRUE,K109=INT(K109*1)/1=FALSE),AND(L109<>\"\",M109=0),AND(L109=\"\",M109>0),ISNUMBER(N109)=FALSE ),\"Error\",\"\")","v":"#ERROR!"}]
[null,"Management","P10",{"$f":"IFERROR(IF(VLOOKUP(C15,PartnerN°Ref,2,FALSE)=0,\"\",VLOOKUP(C15,PartnerN°Ref,2,FALSE)),\"\")","v":"#ERROR!"},{"$f":"IFERROR(IF(OR(VLOOKUP(C15,PartnerN°Ref,4,FALSE)=\"Country not found\",VLOOKUP(C15,PartnerN°Ref,3,FALSE)=0),\"\",VLOOKUP(C15,PartnerN°Ref,3,FALSE)),\"\")","v":"#ERROR!"},"Ahvaz","Staff",3.0,"Rome","3000 KM and 3999 KM",5.0,null,null,{"$f":"IF(AND(M114>0,L114<>\"\"),IF(M114>(ROUND( (ROUND(ROUND(H114,0)*(VLOOKUP(J114,TravelCosts,2,FALSE)),2))/0.65,2)),ROUND(M114*0.8,2),\"covered by unit cost\"),0)","v":0},{"$f":"IF(OR(AND(L114<>\"\",M114>0,ISNUMBER(N114)),R114=\"Error\"),0,ROUND(ROUND(H114,0)*(VLOOKUP(J114,TravelCosts,2,FALSE)),2))","v":"#ERROR!"},"#ERROR!","#ERROR!",{"$f":"IF(OR(COUNTIF(WorkPackage,B109)=0,COUNTIF(PartnerN°,C109)=0,D109=\"\",COUNTIF(CountryALL,E109)=0,F109=\"\",COUNTIF(Category2,G109)=0,ISNUMBER(H109)=FALSE,H109<=0,I109=\"\",COUNTIF(TravelBands,J109)=0,ISNUMBER(K109)=FALSE,OR(K109<0,K109>90),IF(ISNUMBER(H109)=TRUE,H109=INT(H109*1)/1=FALSE),IF(ISNUMBER(K109)=TRUE,K109=INT(K109*1)/1=FALSE),AND(L109<>\"\",M109=0),AND(L109=\"\",M109>0),ISNUMBER(N109)=FALSE ),\"Error\",\"\")","v":"#ERROR!"}]
[null,"Management","P11",{"$f":"IFERROR(IF(VLOOKUP(C15,PartnerN°Ref,2,FALSE)=0,\"\",VLOOKUP(C15,PartnerN°Ref,2,FALSE)),\"\")","v":"#ERROR!"},{"$f":"IFERROR(IF(OR(VLOOKUP(C15,PartnerN°Ref,4,FALSE)=\"Country not found\",VLOOKUP(C15,PartnerN°Ref,3,FALSE)=0),\"\",VLOOKUP(C15,PartnerN°Ref,3,FALSE)),\"\")","v":"#ERROR!"},"Tehran ","Staff",3.0,"Rome","3000 KM and 3999 KM",5.0,null,null,{"$f":"IF(AND(M115>0,L115<>\"\"),IF(M115>(ROUND( (ROUND(ROUND(H115,0)*(VLOOKUP(J115,TravelCosts,2,FALSE)),2))/0.65,2)),ROUND(M115*0.8,2),\"covered by unit cost\"),0)","v":0},{"$f":"IF(OR(AND(L115<>\"\",M115>0,ISNUMBER(N115)),R115=\"Error\"),0,ROUND(ROUND(H115,0)*(VLOOKUP(J115,TravelCosts,2,FALSE)),2))","v":"#ERROR!"},"#ERROR!","#ERROR!",{"$f":"IF(OR(COUNTIF(WorkPackage,B109)=0,COUNTIF(PartnerN°,C109)=0,D109=\"\",COUNTIF(CountryALL,E109)=0,F109=\"\",COUNTIF(Category2,G109)=0,ISNUMBER(H109)=FALSE,H109<=0,I109=\"\",COUNTIF(TravelBands,J109)=0,ISNUMBER(K109)=FALSE,OR(K109<0,K109>90),IF(ISNUMBER(H109)=TRUE,H109=INT(H109*1)/1=FALSE),IF(ISNUMBER(K109)=TRUE,K109=INT(K109*1)/1=FALSE),AND(L109<>\"\",M109=0),AND(L109=\"\",M109>0),ISNUMBER(N109)=FALSE ),\"Error\",\"\")","v":"#ERROR!"}]
[null,"Management","P12",{"$f":"IFERROR(IF(VLOOKUP(C15,PartnerN°Ref,2,FALSE)=0,\"\",VLOOKUP(C15,PartnerN°Ref,2,FALSE)),\"\")","v":"#ERROR!"},{"$f":"IFERROR(IF(OR(VLOOKUP(C15,PartnerN°Ref,4,FALSE)=\"Country not found\",VLOOKUP(C15,PartnerN°Ref,3,FALSE)=0),\"\",VLOOKUP(C15,PartnerN°Ref,3,FALSE)),\"\")","v":"#ERROR!"},"Tehran ","Staff",3.0,"Rome","3000 KM and 3999 KM",5.0,null,null,{"$f":"IF(AND(M116>0,L116<>\"\"),IF(M116>(ROUND( (ROUND(ROUND(H116,0)*(VLOOKUP(J116,TravelCosts,2,FALSE)),2))/0.65,2)),ROUND(M116*0.8,2),\"covered by unit cost\"),0)","v":0},{"$f":"IF(OR(AND(L116<>\"\",M116>0,ISNUMBER(N116)),R116=\"Error\"),0,ROUND(ROUND(H116,0)*(VLOOKUP(J116,TravelCosts,2,FALSE)),2))","v":"#ERROR!"},"#ERROR!","#ERROR!",{"$f":"IF(OR(COUNTIF(WorkPackage,B109)=0,COUNTIF(PartnerN°,C109)=0,D109=\"\",COUNTIF(CountryALL,E109)=0,F109=\"\",COUNTIF(Category2,G109)=0,ISNUMBER(H109)=FALSE,H109<=0,I109=\"\",COUNTIF(TravelBands,J109)=0,ISNUMBER(K109)=FALSE,OR(K109<0,K109>90),IF(ISNUMBER(H109)=TRUE,H109=INT(H109*1)/1=FALSE),IF(ISNUMBER(K109)=TRUE,K109=INT(K109*1)/1=FALSE),AND(L109<>\"\",M109=0),AND(L109=\"\",M109>0),ISNUMBER(N109)=FALSE ),\"Error\",\"\")","v":"#ERROR!"}]
[null,"Management","P1",{"$f":"IFERROR(IF(VLOOKUP(C15,PartnerN°Ref,2,FALSE)=0,\"\",VLOOKUP(C15,PartnerN°Ref,2,FALSE)),\"\")","v":"#ERROR!"},{"$f":"IFERROR(IF(OR(VLOOKUP(C15,PartnerN°Ref,4,FALSE)=\"Country not found\",VLOOKUP(C15,PartnerN°Ref,3,FALSE)=0),\"\",VLOOKUP(C15,PartnerN°Ref,3,FALSE)),\"\")","v":"#ERROR!"},"Rome","Staff",3.0,"Bruxelles ","500 KM and 1999 KM",3.0,null,null,{"$f":"IF(AND(M117>0,L117<>\"\"),IF(M117>(ROUND( (ROUND(ROUND(H117,0)*(VLOOKUP(J117,TravelCosts,2,FALSE)),2))/0.65,2)),ROUND(M117*0.8,2),\"covered by unit cost\"),0)","v":0},{"$f":"IF(OR(AND(L117<>\"\",M117>0,ISNUMBER(N117)),R117=\"Error\"),0,ROUND(ROUND(H117,0)*(VLOOKUP(J117,TravelCosts,2,FALSE)),2))","v":"#ERROR!"},"#ERROR!","#ERROR!",{"$f":"IF(OR(COUNTIF(WorkPackage,B109)=0,COUNTIF(PartnerN°,C109)=0,D109=\"\",COUNTIF(CountryALL,E109)=0,F109=\"\",COUNTIF(Category2,G109)=0,ISNUMBER(H109)=FALSE,H109<=0,I109=\"\",COUNTIF(TravelBands,J109)=0,ISNUMBER(K109)=FALSE,OR(K109<0,K109>90),IF(ISNUMBER(H109)=TRUE,H109=INT(H109*1)/1=FALSE),IF(ISNUMBER(K109)=TRUE,K109=INT(K109*1)/1=FALSE),AND(L109<>\"\",M109=0),AND(L109=\"\",M109>0),ISNUMBER(N109)=FALSE ),\"Error\",\"\")","v":"#ERROR!"}]
[null,"Development","P9",{"$f":"IFERROR(IF(VLOOKUP(C15,PartnerN°Ref,2,FALSE)=0,\"\",VLOOKUP(C15,PartnerN°Ref,2,FALSE)),\"\")","v":"#ERROR!"},{"$f":"IFERROR(IF(OR(VLOOKUP(C15,PartnerN°Ref,4,FALSE)=\"Country not found\",VLOOKUP(C15,PartnerN°Ref,3,FALSE)=0),\"\",VLOOKUP(C15,PartnerN°Ref,3,FALSE)),\"\")","v":"#ERROR!"},"Tehran ","Staff",3.0,"Bruxelles ","4000 KM and 7999 KM",3.0,null,null,{"$f":"IF(AND(M118>0,L118<>\"\"),IF(M118>(ROUND( (ROUND(ROUND(H118,0)*(VLOOKUP(J118,TravelCosts,2,FALSE)),2))/0.65,2)),ROUND(M118*0.8,2),\"covered by unit cost\"),0)","v":0},{"$f":"IF(OR(AND(L118<>\"\",M118>0,ISNUMBER(N118)),R118=\"Error\"),0,ROUND(ROUND(H118,0)*(VLOOKUP(J118,TravelCosts,2,FALSE)),2))","v":"#ERROR!"},"#ERROR!","#ERROR!",{"$f":"IF(OR(COUNTIF(WorkPackage,B109)=0,COUNTIF(PartnerN°,C109)=0,D109=\"\",COUNTIF(CountryALL,E109)=0,F109=\"\",COUNTIF(Category2,G109)=0,ISNUMBER(H109)=FALSE,H109<=0,I109=\"\",COUNTIF(TravelBands,J109)=0,ISNUMBER(K109)=FALSE,OR(K109<0,K109>90),IF(ISNUMBER(H109)=TRUE,H109=INT(H109*1)/1=FALSE),IF(ISNUMBER(K109)=TRUE,K109=INT(K109*1)/1=FALSE),AND(L109<>\"\",M109=0),AND(L109=\"\",M109>0),ISNUMBER(N109)=FALSE ),\"Error\",\"\")","v":"#ERROR!"}]

{"sheet":"4. Equipment Costs","index":4,"n_rows":90,"n_cols":9,"rows_kept":90,"cut":false,"hidden":false,"merged":[[10,1,11,1],[10,2,11,2],[10,3,11,3],[10,4,11,4],[10,5,11,5],[10,6,11,6],[10,7,11,7],[10,8,11,8],[0,1,0,8],[1,1,1,8],[2,1,2,8],[3,1,8,1],[3,2,8,3],[3,4,8,8],[9,1,9,8]]}
[]
[null,"4. Equipment Costs"]
[]
[null,"Total (EUR)",{"$f":"SUM(H:H)","v":"#ERROR!"}]
[]
[]
[]
[]
[]
[]
[null,"Work\nPackage","Partner \nN°","Name of Partner\n(to encode in overview sheet)","Country\n(to encode in overview sheet)","Nature, type and specifications of the item","Amount\nExcluding VAT\n(EUR)","Total\n(EUR)","Check\nData\nEncoding"]
[]
[null,null,null,{"$f":"IFERROR(IF(VLOOKUP(C13,PartnerN°Ref,2,FALSE)=0,\"\",VLOOKUP(C13,PartnerN°Ref,2,FALSE)),\"\")","v":"#ERROR!"},{"$f":"IFERROR(IF(OR(VLOOKUP(C13,PartnerN°Ref,4,FALSE)=\"Country not found\",VLOOKUP(C13,PartnerN°Ref,3,FALSE)=0),\"\",VLOOKUP(C13,PartnerN°Ref,3,FALSE)),\"\")","v":"#ERROR!"},null,0.0,{"$f":"IF(I13=\"Error\",0,ROUND(G13,2))","v":"#ERROR!"},{"$f":"IF(OR(COUNTIF(WorkPackage,B13)=0,COUNTIF(PartnerN°,C13)=0,D13=\"\",COUNTIF(CountryEligEquip,E13)=0,F13=\"\",ISNUMBER(G13)=FALSE,IF(ISNUMBER(G13)=TRUE,G13=INT(G13*100)/100=FALSE)),\"Error\",\"\")","v":"#ERROR!"}]
[null,"Development","P5",{"$f":"IFERROR(IF(VLOOKUP(C13,PartnerN°Ref,2,FALSE)=0,\"\",VLOOKUP(C13,PartnerN°Ref,2,FALSE)),\"\")","v":"#ERROR!"},{"$f":"IFERROR(IF(OR(VLOOKUP(C13,PartnerN°Ref,4,FALSE)=\"Country not found\",VLOOKUP(C13,PartnerN°Ref,3,FALSE)=0),\"\",VLOOKUP(C13,PartnerN°Ref,3,FALSE)),\"\")","v":"#ERROR!"},"Adobe presenter license 3 years",1000.0,"#ERROR!",{"$f":"IF(OR(COUNTIF(WorkPackage,B13)=0,COUNTIF(PartnerN°,C13)=0,D13=\"\",COUNTIF(CountryEligEquip,E13)=0,F13=\"\",ISNUMBER(G13)=FALSE,IF(ISNUMBER(G13)=TRUE,G13=INT(G13*100)/100=FALSE)),\"Error\",\"\")","v":"#ERROR!"}]
[null,"Development","P5",{"$f":"IFERROR(IF(VLOOKUP(C13,PartnerN°Ref,2,FALSE)=0,\"\",VLOOKUP(C13,PartnerN°Ref,2,FALSE)),\"\")","v":"#ERROR!"},{"$f":"IFERROR(IF(OR(VLOOKUP(C13,PartnerN°Ref,4,FALSE)=\"Country not found\",VLOOKUP(C13,PartnerN°Ref,3,FALSE)=0),\"\",VLOOKUP(C13,PartnerN°Ref,3,FALSE)),\"\")","v":"#ERROR!"},"UPS",200.0,"#ERROR!",{"$f":"IF(OR(COUNTIF(WorkPackage,B13)=0,COUNTIF(PartnerN°,C13)=0,D13=\"\",COUNTIF(CountryEligEquip,E13)=0,F13=\"\",ISNUMBER(G13)=FALSE,IF(ISNUMBER(G13)=TRUE,G13=INT(G13*100)/100=FALSE)),\"Error\",\"\")","v":"#ERROR!"}]
[null,"Development","P5",{"$f":"IFERROR(IF(VLOOKUP(C13,PartnerN°Ref,2,FALSE)=0,\"\",VLOOKUP(C13,PartnerN°Ref,2,FALSE)),\"\")","v":"#ERROR!"},{"$f":"IFERROR(IF(OR(VLOOKUP(C13,PartnerN°Ref,4,FALSE)=\"Country not found\",VLOOKUP(C13,PartnerN°Ref,3,FALSE)=0),\"\",VLOOKUP(C13,PartnerN°Ref,3,FALSE)),\"\")","v":"#ERROR!"},"Switch, ruter, network accessories",850.0,"#ERROR!",{"$f":"IF(OR(COUNTIF(WorkPackage,B13)=0,COUNTIF(PartnerN°,C13)=0,D13=\"\",COUNTIF(CountryEligEquip,E13)=0,F13=\"\",ISNUMBER(G13)=FALSE,IF(ISNUMBER(G13)=TRUE,G13=INT(G13*100)/100=FALSE)),\"Error\",\"\")","v":"#ERROR!"}]
[null,"Development","P5",{"$f":"IFERROR(IF(VLOOKUP(C13,PartnerN°Ref,2,FALSE)=0,\"\",VLOOKUP(C13,PartnerN°Ref,2,FALSE)),\"\")","v":"#ERROR!"},{"$f":"IFERROR(IF(OR(VLOOKUP(C13,PartnerN°Ref,4,FALSE)=\"Country not found\",VLOOKUP(C13,PartnerN°Ref,3,FALSE)=0),\"\",VLOOKUP(C13,PartnerN°Ref,3,FALSE)),\"\")","v":"#ERROR!"},"Laptops for curricula develoment - 5 items",4500.0,"#ERROR!",{"$f":"IF(OR(COUNTIF(WorkPackage,B13)=0,COUNTIF(PartnerN°,C13)=0,D13=\"\",COUNTIF(CountryEligEquip,E13)=0,F13=\"\",ISNUMBER(G13)=FALSE,IF(ISNUMBER(G13)=TRUE,G13=INT(G13*100)/100=FALSE)),\"Error\",\"\")","v":"#ERROR!"}]
[null,"Development","P5",{"$f":"IFERROR(IF(VLOOKUP(C13,PartnerN°Ref,2,FALSE)=0,\"\",VLOOKUP(C13,PartnerN°Ref,2,FALSE)),\"\")","v":"#ERROR!"},{"$f":"IFERROR(IF(OR(VLOOKUP(C13,PartnerN°Ref,4,FALSE)=\"Country not found\",VLOOKUP(C13,PartnerN°Ref,3,FALSE)=0),\"\",VLOOKUP(C13,PartnerN°Ref,3,FALSE)),\"\")","v":"#ERROR!"},"Video camera, Multimedia projector 2 items",800.0,"#ERROR!",{"$f":"IF(OR(COUNTIF(WorkPackage,B13)=0,COUNTIF(PartnerN°,C13)=0,D13=\"\",COUNTIF(CountryEligEquip,E13)=0,F13=\"\",ISNUMBER(G13)=FALSE,IF(ISNUMBER(G13)=TRUE,G13=INT(G13*100)/100=FALSE)),\"Error\",\"\")","v":"#ERROR!"}]
[null,"Development","P5",{"$f":"IFERROR(IF(VLOOKUP(C13,PartnerN°Ref,2,FALSE)=0,\"\",VLOOKUP(C13,PartnerN°Ref,2,FALSE)),\"\")","v":"#ERROR!"},{"$f":"IFERROR(IF(OR(VLOOKUP(C13,PartnerN°Ref,4,FALSE)=\"Country not found\",VLOOKUP(C13,PartnerN°Ref,3,FALSE)=0),\"\",VLOOKUP(C13,PartnerN°Ref,3,FALSE)),\"\")","v":"#ERROR!"},"Server for e-learning platform - 1 item",2100.0,"#ERROR!",{"$f":"IF(OR(COUNTIF(WorkPackage,B13)=0,COUNTIF(PartnerN°,C13)=0,D13=\"\",COUNTIF(CountryEligEquip,E13)=0,F13=\"\",ISNUMBER(G13)=FALSE,IF(ISNUMBER(G13)=TRUE,G13=INT(G13*100)/100=FALSE)),\"Error\",\"\")","v":"#ERROR!"}]
[null,"Development","P5",{"$f":"IFERROR(IF(VLOOKUP(C13,PartnerN°Ref,2,FALSE)=0,\"\",VLOOKUP(C13,PartnerN°Ref,2,FALSE)),\"\")","v":"#ERROR!"},{"$f":"IFERROR(IF(OR(VLOOKUP(C13,PartnerN°Ref,4,FALSE)=\"Country not found\",VLOOKUP(C13,PartnerN°Ref,3,FALSE)=0),\"\",VLOOKUP(C13,PartnerN°Ref,3,FALSE)),\"\")","v":"#ERROR!"},"Workstations for curricula experimentation ",11000.0,"#ERROR!",{"$f":"IF(OR(COUNTIF(WorkPackage,B13)=0,COUNTIF(PartnerN°,C13)=0,D13=\"\",COUNTIF(CountryEligEquip,E13)=0,F13=\"\",ISNUMBER(G13)=FALSE,IF(ISNUMBER(G13)=TRUE,G13=INT(G13*100)/100=FALSE)),\"Error\",\"\")","v":"#ERROR!"}]
[null,"Development","P5",{"$f":"IFERROR(IF(VLOOKUP(C13,PartnerN°Ref,2,FALSE)=0,\"\",VLOOKUP(C13,PartnerN°Ref,2,FALSE)),\"\")","v":"#ERROR!"},{"$f":"IFERROR(IF(OR(VLOOKUP(C13,PartnerN°Ref,4,FALSE)=\"Country not found\",VLOOKUP(C13,PartnerN°Ref,3,FALSE)=0),\"\",VLOOKUP(C13,PartnerN°Ref,3,FALSE)),\"\")","v":"#ERROR!"},"ADALTA Mathematica,",1200.0,"#ERROR!",{"$f":"IF(OR(COUNTIF(WorkPackage,B13)=0,COUNTIF(PartnerN°,C13)=0,D13=\"\",COUNTIF(CountryEligEquip,E13)=0,F13=\"\",ISNUMBER(G13)=FALSE,IF(ISNUMBER(G13)=TRUE,G13=INT(G13*100)/100=FALSE)),\"Error\",\"\")","v":"#ERROR!"}]
[null,"Development","P5",{"$f":"IFERROR(IF(VLOOKUP(C13,PartnerN°Ref,2,FALSE)=0,\"\",VLOOKUP(C13,PartnerN°Ref,2,FALSE)),\"\")","v":"#ERROR!"},{"$f":"IFERROR(IF(OR(VLOOKUP(C13,PartnerN°Ref,4,FALSE)=\"Country not found\",VLOOKUP(C13,PartnerN°Ref,3,FALSE)=0),\"\",VLOOKUP(C13,PartnerN°Ref,3,FALSE)),\"\")","v":"#ERROR!"},"ADALTA Microcal Origin",700.0,"#ERROR!",{"$f":"IF(OR(COUNTIF(WorkPackage,B13)=0,COUNTIF(PartnerN°,C13)=0,D13=\"\",COUNTIF(CountryEligEquip,E13)=0,F13=\"\",ISNUMBER(G13)=FALSE,IF(ISNUMBER(G13)=TRUE,G13=INT(G13*100)/100=FALSE)),\"Error\",\"\")","v":"#ERROR!"}]
[null,"Development","P5",{"$f":"IFERROR(IF(VLOOKUP(C13,PartnerN°Ref,2,FALSE)=0,\"\",VLOOKUP(C13,PartnerN°Ref,2,FALSE)),\"\")","v":"#ERROR!"},{"$f":"IFERROR(IF(OR(VLOOKUP(C13,PartnerN°Ref,4,FALSE)=\"Country not found\",VLOOKUP(C13,PartnerN°Ref,3,FALSE)=0),\"\",VLOOKUP(C13,PartnerN°Ref,3,FALSE)),\"\")","v":"#ERROR!"},"Raspberry PI with sensors",100.0,"#ERROR!",{"$f":"IF(OR(COUNTIF(WorkPackage,B13)=0,COUNTIF(PartnerN°,C13)=0,D13=\"\",COUNTIF(CountryEligEquip,E13)=0,F13=\"\",ISNUMBER(G13)=FALSE,IF(ISNUMBER(G13)=TRUE,G13=INT(G13*100)/100=FALSE)),\"Error\",\"\")","v":"#ERROR!"}]
[null,"Development","P5",{"$f":"IFERROR(IF(VLOOKUP(C13,PartnerN°Ref,2,FALSE)=0,\"\",VLOOKUP(C13,PartnerN°Ref,2,FALSE)),\"\")","v":"#ERROR!"},{"$f":"IFERROR(IF(OR(VLOOKUP(C13,PartnerN°Ref,4,FALSE)=\"Country not found\",VLOOKUP(C13,PartnerN°Ref,3,FALSE)=0),\"\",VLOOKUP(C13,PartnerN°Ref,3,FALSE)),\"\")","v":"#ERROR!"},"Arduino e atmel microcontroller ",300.0,"#ERROR!",{"$f":"IF(OR(COUNTIF(WorkPackage,B13)=0,COUNTIF(PartnerN°,C13)=0,D13=\"\",COUNTIF(CountryEligEquip,E13)=0,F13=\"\",ISNUMBER(G13)=FALSE,IF(ISNUMBER(G13)=TRUE,G13=INT(G13*100)/100=FALSE)),\"Error\",\"\")","v":"#ERROR!"}]
[null,"Development","P6",{"$f":"IFERROR(IF(VLOOKUP(C13,PartnerN°Ref,2,FALSE)=0,\"\",VLOOKUP(C13,PartnerN°Ref,2,FALSE)),\"\")","v":"#ERROR!"},{"$f":"IFERROR(IF(OR(VLOOKUP(C13,PartnerN°Ref,4,FALSE)=\"Country not found\",VLOOKUP(C13,PartnerN°Ref,3,FALSE)=0),\"\",VLOOKUP(C13,PartnerN°Ref,3,FALSE)),\"\")","v":"#ERROR!"},"Adobe presenter license 3 years",1000.0,"#ERROR!",{"$f":"IF(OR(COUNTIF(WorkPackage,B13)=0,COUNTIF(PartnerN°,C13)=0,D13=\"\",COUNTIF(CountryEligEquip,E13)=0,F13=\"\",ISNUMBER(G13)=FALSE,IF(ISNUMBER(G13)=TRUE,G13=INT(G13*100)/100=FALSE)),\"Error\",\"\")","v":"#ERROR!"}]
[null,"Development","P6",{"$f":"IFERROR(IF(VLOOKUP(C13,PartnerN°Ref,2,FALSE)=0,\"\",VLOOKUP(C13,PartnerN°Ref,2,FALSE)),\"\")","v":"#ERROR!"},{"$f":"IFERROR(IF(OR(VLOOKUP(C13,PartnerN°Ref,4,FALSE)=\"Country not found\",VLOOKUP(C13,PartnerN°Ref,3,FALSE)=0),\"\",VLOOKUP(C13,PartnerN°Ref,3,FALSE)),\"\")","v":"#ERROR!"},"UPS",200.0,"#ERROR!",{"$f":"IF(OR(COUNTIF(WorkPackage,B13)=0,COUNTIF(PartnerN°,C13)=0,D13=\"\",COUNTIF(CountryEligEquip,E13)=0,F13=\"\",ISNUMBER(G13)=FALSE,IF(ISNUMBER(G13)=TRUE,G13=INT(G13*100)/100=FALSE)),\"Error\",\"\")","v":"#ERROR!"}]
[null,"Development","P6",{"$f":"IFERROR(IF(VLOOKUP(C13,PartnerN°Ref,2,FALSE)=0,\"\",VLOOKUP(C13,PartnerN°Ref,2,FALSE)),\"\")","v":"#ERROR!"},{"$f":"IFERROR(IF(OR(VLOOKUP(C13,PartnerN°Ref,4,FALSE)=\"Country not found\",VLOOKUP(C13,PartnerN°Ref,3,FALSE)=0),\"\",VLOOKUP(C13,PartnerN°Ref,3,FALSE)),\"\")","v":"#ERROR!"},"Switch, ruter, network accessories",850.0,"#ERROR!",{"$f":"IF(OR(COUNTIF(WorkPackage,B13)=0,COUNTIF(PartnerN°,C13)=0,D13=\"\",COUNTIF(CountryEligEquip,E13)=0,F13=\"\",ISNUMBER(G13)=FALSE,IF(ISNUMBER(G13)=TRUE,G13=INT(G13*100)/100=FALSE)),\"Error\",\"\")","v":"#ERROR!"}]
[null,"Development","P6",{"$f":"IFERROR(IF(VLOOKUP(C13,PartnerN°Ref,2,FALSE)=0,\"\",VLOOKUP(C13,PartnerN°Ref,2,FALSE)),\"\")","v":"#ERROR!"},{"$f":"IFERROR(IF(OR(VLOOKUP(C13,PartnerN°Ref,4,FALSE)=\"Country not found\",VLOOKUP(C13,PartnerN°Ref,3,FALSE)=0),\"\",VLOOKUP(C13,PartnerN°Ref,3,FALSE)),\"\")","v":"#ERROR!"},"Laptops for curricula develoment - 5 items",4500.0,"#ERROR!",{"$f":"IF(OR(COUNTIF(WorkPackage,B13)=0,COUNTIF(PartnerN°,C13)=0,D13=\"\",COUNTIF(CountryEligEquip,E13)=0,F13=\"\",ISNUMBER(G13)=FALSE,IF(ISNUMBER(G13)=TRUE,G13=INT(G13*100)/100=FALSE)),\"Error\",\"\")","v":"#ERROR!"}]
[null,"Development","P6",{"$f":"IFERROR(IF(VLOOKUP(C13,PartnerN°Ref,2,FALSE)=0,\"\",VLOOKUP(C13,PartnerN°Ref,2,FALSE)),\"\")","v":"#ERROR!"},{"$f":"IFERROR(IF(OR(VLOOKUP(C13,PartnerN°Ref,4,FALSE)=\"Country not found\",VLOOKUP(C13,PartnerN°Ref,3,FALSE)=0),\"\",VLOOKUP(C13,PartnerN°Ref,3,FALSE)),\"\")","v":"#ERROR!"},"Video camera, Multimedia projector 2 items",800.0,"#ERROR!",{"$f":"IF(OR(COUNTIF(WorkPackage,B13)=0,COUNTIF(PartnerN°,C13)=0,D13=\"\",COUNTIF(CountryEligEquip,E13)=0,F13=\"\",ISNUMBER(G13)=FALSE,IF(ISNUMBER(G13)=TRUE,G13=INT(G13*100)/100=FALSE)),\"Error\",\"\")","v":"#ERROR!"}]
[null,"Development","P6",{"$f":"IFERROR(IF(VLOOKUP(C13,PartnerN°Ref,2,FALSE)=0,\"\",VLOOKUP(C13,PartnerN°Ref,2,FALSE)),\"\")","v":"#ERROR!"},{"$f":"IFERROR(IF(OR(VLOOKUP(C13,PartnerN°Ref,4,FALSE)=\"Country not found\",VLOOKUP(C13,PartnerN°Ref,3,FALSE)=0),\"\",VLOOKUP(C13,PartnerN°Ref,3,FALSE)),\"\")","v":"#ERROR!"},"Server for e-learning platform - 1 item",2100.0,"#ERROR!",{"$f":"IF(OR(COUNTIF(WorkPackage,B13)=0,COUNTIF(PartnerN°,C13)=0,D13=\"\",COUNTIF(CountryEligEquip,E13)=0,F13=\"\",ISNUMBER(G13)=FALSE,IF(ISNUMBER(G13)=TRUE,G13=INT(G13*100)/100=FALSE)),\"Error\",\"\")","v":"#ERROR!"}]
[null,"Development","P6",{"$f":"IFERROR(IF(VLOOKUP(C13,PartnerN°Ref,2,FALSE)=0,\"\",VLOOKUP(C13,PartnerN°Ref,2,FALSE)),\"\")","v":"#ERROR!"},{"$f":"IFERROR(IF(OR(VLOOKUP(C13,PartnerN°Ref,4,FALSE)=\"Country not found\",VLOOKUP(C13,PartnerN°Ref,3,FALSE)=0),\"\",VLOOKUP(C13,PartnerN°Ref,3,FALSE)),\"\")","v":"#ERROR!"},"Workstations for curricula experimentation ",11000.0,"#ERROR!",{"$f":"IF(OR(COUNTIF(WorkPackage,B13)=0,COUNTIF(PartnerN°,C13)=0,D13=\"\",COUNTIF(CountryEligEquip,E13)=0,F13=\"\",ISNUMBER(G13)=FALSE,IF(ISNUMBER(G13)=TRUE,G13=INT(G13*100)/100=FALSE)),\"Error\",\"\")","v":"#ERROR!"}]
[null,"Development","P6",{"$f":"IFERROR(IF(VLOOKUP(C13,PartnerN°Ref,2,FALSE)=0,\"\",VLOOKUP(C13,PartnerN°Ref,2,FALSE)),\"\")","v":"#ERROR!"},{"$f":"IFERROR(IF(OR(VLOOKUP(C13,PartnerN°Ref,4,FALSE)=\"Country not found\",VLOOKUP(C13,PartnerN°Ref,3,FALSE)=0),\"\",VLOOKUP(C13,PartnerN°Ref,3,FALSE)),\"\")","v":"#ERROR!"},"ADALTA Mathematica,",1200.0,"#ERROR!",{"$f":"IF(OR(COUNTIF(WorkPackage,B13)=0,COUNTIF(PartnerN°,C13)=0,D13=\"\",COUNTIF(CountryEligEquip,E13)=0,F13=\"\",ISNUMBER(G13)=FALSE,IF(ISNUMBER(G13)=TRUE,G13=INT(G13*100)/100=FALSE)),\"Error\",\"\")","v":"#ERROR!"}]
[null,"Development","P6",{"$f":"IFERROR(IF(VLOOKUP(C13,PartnerN°Ref,2,FALSE)=0,\"\",VLOOKUP(C13,PartnerN°Ref,2,FALSE)),\"\")","v":"#ERROR!"},{"$f":"IFERROR(IF(OR(VLOOKUP(C13,PartnerN°Ref,4,FALSE)=\"Country not found\",VLOOKUP(C13,PartnerN°Ref,3,FALSE)=0),\"\",VLOOKUP(C13,PartnerN°Ref,3,FALSE)),\"\")","v":"#ERROR!"},"ADALTA Microcal Origin",700.0,"#ERROR!",{"$f":"IF(OR(COUNTIF(WorkPackage,B13)=0,COUNTIF(PartnerN°,C13)=0,D13=\"\",COUNTIF(CountryEligEquip,E13)=0,F13=\"\",ISNUMBER(G13)=FALSE,IF(ISNUMBER(G13)=TRUE,G13=INT(G13*100)/100=FALSE)),\"Error\",\"\")","v":"#ERROR!"}]
[null,"Development","P6",{"$f":"IFERROR(IF(VLOOKUP(C13,PartnerN°Ref,2,FALSE)=0,\"\",VLOOKUP(C13,PartnerN°Ref,2,FALSE)),\"\")","v":"#ERROR!"},{"$f":"IFERROR(IF(OR(VLOOKUP(C13,PartnerN°Ref,4,FALSE)=\"Country not found\",VLOOKUP(C13,PartnerN°Ref,3,FALSE)=0),\"\",VLOOKUP(C13,PartnerN°Ref,3,FALSE)),\"\")","v":"#ERROR!"},"Raspberry PI with sensors",100.0,"#ERROR!",{"$f":"IF(OR(COUNTIF(WorkPackage,B13)=0,COUNTIF(PartnerN°,C13)=0,D13=\"\",COUNTIF(CountryEligEquip,E13)=0,F13=\"\",ISNUMBER(G13)=FALSE,IF(ISNUMBER(G13)=TRUE,G13=INT(G13*100)/100=FALSE)),\"Error\",\"\")","v":"#ERROR!"}]
[null,"Development","P6",{"$f":"IFERROR(IF(VLOOKUP(C13,PartnerN°Ref,2,FALSE)=0,\"\",VLOOKUP(C13,PartnerN°Ref,2,FALSE)),\"\")","v":"#ERROR!"},{"$f":"IFERROR(IF(OR(VLOOKUP(C13,PartnerN°Ref,4,FALSE)=\"Country not found\",VLOOKUP(C13,PartnerN°Ref,3,FALSE)=0),\"\",VLOOKUP(C13,PartnerN°Ref,3,FALSE)),\"\")","v":"#ERROR!"},"Arduino e atmel microcontroller ",300.0,"#ERROR!",{"$f":"IF(OR(COUNTIF(WorkPackage,B13)=0,COUNTIF(PartnerN°,C13)=0,D13=\"\",COUNTIF(CountryEligEquip,E13)=0,F13=\"\",ISNUMBER(G13)=FALSE,IF(ISNUMBER(G13)=TRUE,G13=INT(G13*100)/100=FALSE)),\"Error\",\"\")","v":"#ERROR!"}]
[null,"Development","P7",{"$f":"IFERROR(IF(VLOOKUP(C13,PartnerN°Ref,2,FALSE)=0,\"\",VLOOKUP(C13,PartnerN°Ref,2,FALSE)),\"\")","v":"#ERROR!"},{"$f":"IFERROR(IF(OR(VLOOKUP(C13,PartnerN°Ref,4,FALSE)=\"Country not found\",VLOOKUP(C13,PartnerN°Ref,3,FALSE)=0),\"\",VLOOKUP(C13,PartnerN°Ref,3,FALSE)),\"\")","v":"#ERROR!"},"Adobe presenter license 3 years",1000.0,"#ERROR!",{"$f":"IF(OR(COUNTIF(WorkPackage,B13)=0,COUNTIF(PartnerN°,C13)=0,D13=\"\",COUNTIF(CountryEligEquip,E13)=0,F13=\"\",ISNUMBER(G13)=FALSE,IF(ISNUMBER(G13)=TRUE,G13=INT(G13*100)/100=FALSE)),\"Error\",\"\")","v":"#ERROR!"}]
[null,"Development","P7",{"$f":"IFERROR(IF(VLOOKUP(C13,PartnerN°Ref,2,FALSE)=0,\"\",VLOOKUP(C13,PartnerN°Ref,2,FALSE)),\"\")","v":"#ERROR!"},{"$f":"IFERROR(IF(OR(VLOOKUP(C13,PartnerN°Ref,4,FALSE)=\"Country not found\",VLOOKUP(C13,PartnerN°Ref,3,FALSE)=0),\"\",VLOOKUP(C13,PartnerN°Ref,3,FALSE)),\"\")","v":"#ERROR!"},"UPS",200.0,"#ERROR!",{"$f":"IF(OR(COUNTIF(WorkPackage,B13)=0,COUNTIF(PartnerN°,C13)=0,D13=\"\",COUNTIF(CountryEligEquip,E13)=0,F13=\"\",ISNUMBER(G13)=FALSE,IF(ISNUMBER(G13)=TRUE,G13=INT(G13*100)/100=FALSE)),\"Error\",\"\")","v":"#ERROR!"}]
[null,"Development","P7",{"$f":"IFERROR(IF(VLOOKUP(C13,PartnerN°Ref,2,FALSE)=0,\"\",VLOOKUP(C13,PartnerN°Ref,2,FALSE)),\"\")","v":"#ERROR!"},{"$f":"IFERROR(IF(OR(VLOOKUP(C13,PartnerN°Ref,4,FALSE)=\"Country not found\",VLOOKUP(C13,PartnerN°Ref,3,FALSE)=0),\"\",VLOOKUP(C13,PartnerN°Ref,3,FALSE)),\"\")","v":"#ERROR!"},"Switch, ruter, network accessories",850.0,"#ERROR!",{"$f":"IF(OR(COUNTIF(WorkPackage,B13)=0,COUNTIF(PartnerN°,C13)=0,D13=\"\",COUNTIF(CountryEligEquip,E13)=0,F13=\"\",ISNUMBER(G13)=FALSE,IF(ISNUMBER(G13)=TRUE,G13=INT(G13*100)/100=FALSE)),\"Error\",\"\")","v":"#ERROR!"}]
[null,"Development","P7",{"$f":"IFERROR(IF(VLOOKUP(C13,PartnerN°Ref,2,FALSE)=0,\"\",VLOOKUP(C13,PartnerN°Ref,2,FALSE)),\"\")","v":"#ERROR!"},{"$f":"IFERROR(IF(OR(VLOOKUP(C13,PartnerN°Ref,4,FALSE)=\"Country not found\",VLOOKUP(C13,PartnerN°Ref,3,FALSE)=0),\"\",VLOOKUP(C13,PartnerN°Ref,3,FALSE)),\"\")","v":"#ERROR!"},"Laptops for curricula develoment - 5 items",4500.0,"#ERROR!",{"$f":"IF(OR(COUNTIF(WorkPackage,B13)=0,COUNTIF(PartnerN°,C13)=0,D13=\"\",COUNTIF(CountryEligEquip,E13)=0,F13=\"\",ISNUMBER(G13)=FALSE,IF(ISNUMBER(G13)=TRUE,G13=INT(G13*100)/100=FALSE)),\"Error\",\"\")","v":"#ERROR!"}]
[null,"Development","P7",{"$f":"IFERROR(IF(VLOOKUP(C13,PartnerN°Ref,2,FALSE)=0,\"\",VLOOKUP(C13,PartnerN°Ref,2,FALSE)),\"\")","v":"#ERROR!"},{"$f":"IFERROR(IF(OR(VLOOKUP(C13,PartnerN°Ref,4,FALSE)=\"Country not found\",VLOOKUP(C13,PartnerN°Ref,3,FALSE)=0),\"\",VLOOKUP(C13,PartnerN°Ref,3,FALSE)),\"\")","v":"#ERROR!"},"Video camera, Multimedia projector 2 items",800.0,"#ERROR!",{"$f":"IF(OR(COUNTIF(WorkPackage,B13)=0,COUNTIF(PartnerN°,C13)=0,D13=\"\",COUNTIF(CountryEligEquip,E13)=0,F13=\"\",ISNUMBER(G13)=FALSE,IF(ISNUMBER(G13)=TRUE,G13=INT(G13*100)/100=FALSE)),\"Error\",\"\")","v":"#ERROR!"}]
[null,"Development","P7",{"$f":"IFERROR(IF(VLOOKUP(C13,PartnerN°Ref,2,FALSE)=0,\"\",VLOOKUP(C13,PartnerN°Ref,2,FALSE)),\"\")","v":"#ERROR!"},{"$f":"IFERROR(IF(OR(VLOOKUP(C13,PartnerN°Ref,4,FALSE)=\"Country not found\",VLOOKUP(C13,PartnerN°Ref,3,FALSE)=0),\"\",VLOOKUP(C13,PartnerN°Ref,3,FALSE)),\"\")","v":"#ERROR!"},"Server for e-learning platform - 1 item",2100.0,"#ERROR!",{"$f":"IF(OR(COUNTIF(WorkPackage,B13)=0,COUNTIF(PartnerN°,C13)=0,D13=\"\",COUNTIF(CountryEligEquip,E13)=0,F13=\"\",ISNUMBER(G13)=FALSE,IF(ISNUMBER(G13)=TRUE,G13=INT(G13*100)/100=FALSE)),\"Error\",\"\")","v":"#ERROR!"}]
[null,"Development","P7",{"$f":"IFERROR(IF(VLOOKUP(C13,PartnerN°Ref,2,FALSE)=0,\"\",VLOOKUP(C13,PartnerN°Ref,2,FALSE)),\"\")","v":"#ERROR!"},{"$f":"IFERROR(IF(OR(VLOOKUP(C13,PartnerN°Ref,4,FALSE)=\"Country not found\",VLOOKUP(C13,PartnerN°Ref,3,FALSE)=0),\"\",VLOOKUP(C13,PartnerN°Ref,3,FALSE)),\"\")","v":"#ERROR!"},"Workstations for curricula experimentation ",11000.0,"#ERROR!",{"$f":"IF(OR(COUNTIF(WorkPackage,B13)=0,COUNTIF(PartnerN°,C13)=0,D13=\"\",COUNTIF(CountryEligEquip,E13)=0,F13=\"\",ISNUMBER(G13)=FALSE,IF(ISNUMBER(G13)=TRUE,G13=INT(G13*100)/100=FALSE)),\"Error\",\"\")","v":"#ERROR!"}]
[null,"Development","P7",{"$f":"IFERROR(IF(VLOOKUP(C13,PartnerN°Ref,2,FALSE)=0,\"\",VLOOKUP(C13,PartnerN°Ref,2,FALSE)),\"\")","v":"#ERROR!"},{"$f":"IFERROR(IF(OR(VLOOKUP(C13,PartnerN°Ref,4,FALSE)=\"Country not found\",VLOOKUP(C13,PartnerN°Ref,3,FALSE)=0),\"\",VLOOKUP(C13,PartnerN°Ref,3,FALSE)),\"\")","v":"#ERROR!"},"ADALTA Mathematica,",1200.0,"#ERROR!",{"$f":"IF(OR(COUNTIF(WorkPackage,B13)=0,COUNTIF(PartnerN°,C13)=0,D13=\"\",COUNTIF(CountryEligEquip,E13)=0,F13=\"\",ISNUMBER(G13)=FALSE,IF(ISNUMBER(G13)=TRUE,G13=INT(G13*100)/100=FALSE)),\"Error\",\"\")","v":"#ERROR!"}]
[null,"Development","P7",{"$f":"IFERROR(IF(VLOOKUP(C13,PartnerN°Ref,2,FALSE)=0,\"\",VLOOKUP(C13,PartnerN°Ref,2,FALSE)),\"\")","v":"#ERROR!"},{"$f":"IFERROR(IF(OR(VLOOKUP(C13,PartnerN°Ref,4,FALSE)=\"Country not found\",VLOOKUP(C13,PartnerN°Ref,3,FALSE)=0),\"\",VLOOKUP(C13,PartnerN°Ref,3,FALSE)),\"\")","v":"#ERROR!"},"ADALTA Microcal Origin",700.0,"#ERROR!",{"$f":"IF(OR(COUNTIF(WorkPackage,B13)=0,COUNTIF(PartnerN°,C13)=0,D13=\"\",COUNTIF(CountryEligEquip,E13)=0,F13=\"\",ISNUMBER(G13)=FALSE,IF(ISNUMBER(G13)=TRUE,G13=INT(G13*100)/100=FALSE)),\"Error\",\"\")","v":"#ERROR!"}]
[null,"Development","P7",{"$f":"IFERROR(IF(VLOOKUP(C45,PartnerN°Ref,2,FALSE)=0,\"\",VLOOKUP(C45,PartnerN°Ref,2,FALSE)),\"\")","v":"#ERROR!"},{"$f":"IFERROR(IF(OR(VLOOKUP(C45,PartnerN°Ref,4,FALSE)=\"Country not found\",VLOOKUP(C45,PartnerN°Ref,3,FALSE)=0),\"\",VLOOKUP(C45,PartnerN°Ref,3,FALSE)),\"\")","v":"#ERROR!"},"Raspberry PI with sensors",100.0,"#ERROR!",{"$f":"IF(OR(COUNTIF(WorkPackage,B45)=0,COUNTIF(PartnerN°,C45)=0,D45=\"\",COUNTIF(CountryEligEquip,E45)=0,F45=\"\",ISNUMBER(G45)=FALSE,IF(ISNUMBER(G45)=TRUE,G45=INT(G45*100)/100=FALSE)),\"Error\",\"\")","v":"#ERROR!"}]
[null,"Development","P7",{"$f":"IFERROR(IF(VLOOKUP(C45,PartnerN°Ref,2,FALSE)=0,\"\",VLOOKUP(C45,PartnerN°Ref,2,FALSE)),\"\")","v":"#ERROR!"},{"$f":"IFERROR(IF(OR(VLOOKUP(C45,PartnerN°Ref,4,FALSE)=\"Country not found\",VLOOKUP(C45,PartnerN°Ref,3,FALSE)=0),\"\",VLOOKUP(C45,PartnerN°Ref,3,FALSE)),\"\")","v":"#ERROR!"},"Arduino e atmel microcontroller ",300.0,"#ERROR!",{"$f":"IF(OR(COUNTIF(WorkPackage,B45)=0,COUNTIF(PartnerN°,C45)=0,D45=\"\",COUNTIF(CountryEligEquip,E45)=0,F45=\"\",ISNUMBER(G45)=FALSE,IF(ISNUMBER(G45)=TRUE,G45=INT(G45*100)/100=FALSE)),\"Error\",\"\")","v":"#ERROR!"}]
[null,"Development","P8",{"$f":"IFERROR(IF(VLOOKUP(C45,PartnerN°Ref,2,FALSE)=0,\"\",VLOOKUP(C45,PartnerN°Ref,2,FALSE)),\"\")","v":"#ERROR!"},{"$f":"IFERROR(IF(OR(VLOOKUP(C45,PartnerN°Ref,4,FALSE)=\"Country not found\",VLOOKUP(C45,PartnerN°Ref,3,FALSE)=0),\"\",VLOOKUP(C45,PartnerN°Ref,3,FALSE)),\"\")","v":"#ERROR!"},"Adobe presenter license 3 years",1000.0,"#ERROR!",{"$f":"IF(OR(COUNTIF(WorkPackage,B45)=0,COUNTIF(PartnerN°,C45)=0,D45=\"\",COUNTIF(CountryEligEquip,E45)=0,F45=\"\",ISNUMBER(G45)=FALSE,IF(ISNUMBER(G45)=TRUE,G45=INT(G45*100)/100=FALSE)),\"Error\",\"\")","v":"#ERROR!"}]
[null,"Development","P8",{"$f":"IFERROR(IF(VLOOKUP(C45,PartnerN°Ref,2,FALSE)=0,\"\",VLOOKUP(C45,PartnerN°Ref,2,FALSE)),\"\")","v":"#ERROR!"},{"$f":"IFERROR(IF(OR(VLOOKUP(C45,PartnerN°Ref,4,FALSE)=\"Country not found\",VLOOKUP(C45,PartnerN°Ref,3,FALSE)=0),\"\",VLOOKUP(C45,PartnerN°Ref,3,FALSE)),\"\")","v":"#ERROR!"},"UPS",200.0,"#ERROR!",{"$f":"IF(OR(COUNTIF(WorkPackage,B45)=0,COUNTIF(PartnerN°,C45)=0,D45=\"\",COUNTIF(CountryEligEquip,E45)=0,F45=\"\",ISNUMBER(G45)=FALSE,IF(ISNUMBER(G45)=TRUE,G45=INT(G45*100)/100=FALSE)),\"Error\",\"\")","v":"#ERROR!"}]
[null,"Development","P8",{"$f":"IFERROR(IF(VLOOKUP(C45,PartnerN°Ref,2,FALSE)=0,\"\",VLOOKUP(C45,PartnerN°Ref,2,FALSE)),\"\")","v":"#ERROR!"},{"$f":"IFERROR(IF(OR(VLOOKUP(C45,PartnerN°Ref,4,FALSE)=\"Country not found\",VLOOKUP(C45,PartnerN°Ref,3,FALSE)=0),\"\",VLOOKUP(C45,PartnerN°Ref,3,FALSE)),\"\")","v":"#ERROR!"},"Switch, ruter, network accessories",850.0,"#ERROR!",{"$f":"IF(OR(COUNTIF(WorkPackage,B45)=0,COUNTIF(PartnerN°,C45)=0,D45=\"\",COUNTIF(CountryEligEquip,E45)=0,F45=\"\",ISNUMBER(G45)=FALSE,IF(ISNUMBER(G45)=TRUE,G45=INT(G45*100)/100=FALSE)),\"Error\",\"\")","v":"#ERROR!"}]
[null,"Development","P8",{"$f":"IFERROR(IF(VLOOKUP(C45,PartnerN°Ref,2,FALSE)=0,\"\",VLOOKUP(C45,PartnerN°Ref,2,FALSE)),\"\")","v":"#ERROR!"},{"$f":"IFERROR(IF(OR(VLOOKUP(C45,PartnerN°Ref,4,FALSE)=\"Country not found\",VLOOKUP(C45,PartnerN°Ref,3,FALSE)=0),\"\",VLOOKUP(C45,PartnerN°Ref,3,FALSE)),\"\")","v":"#ERROR!"},"Laptops for curricula develoment - 5 items",4500.0,"#ERROR!",{"$f":"IF(OR(COUNTIF(WorkPackage,B45)=0,COUNTIF(PartnerN°,C45)=0,D45=\"\",COUNTIF(CountryEligEquip,E45)=0,F45=\"\",ISNUMBER(G45)=FALSE,IF(ISNUMBER(G45)=TRUE,G45=INT(G45*100)/100=FALSE)),\"Error\",\"\")","v":"#ERROR!"}]
[null,"Development","P8",{"$f":"IFERROR(IF(VLOOKUP(C45,PartnerN°Ref,2,FALSE)=0,\"\",VLOOKUP(C45,PartnerN°Ref,2,FALSE)),\"\")","v":"#ERROR!"},{"$f":"IFERROR(IF(OR(VLOOKUP(C45,PartnerN°Ref,4,FALSE)=\"Country not found\",VLOOKUP(C45,PartnerN°Ref,3,FALSE)=0),\"\",VLOOKUP(C45,PartnerN°Ref,3,FALSE)),\"\")","v":"#ERROR!"},"Video camera, Multimedia projector 2 items",800.0,"#ERROR!",{"$f":"IF(OR(COUNTIF(WorkPackage,B45)=0,COUNTIF(PartnerN°,C45)=0,D45=\"\",COUNTIF(CountryEligEquip,E45)=0,F45=\"\",ISNUMBER(G45)=FALSE,IF(ISNUMBER(G45)=TRUE,G45=INT(G45*100)/100=FALSE)),\"Error\",\"\")","v":"#ERROR!"}]
[null,"Development","P8",{"$f":"IFERROR(IF(VLOOKUP(C45,PartnerN°Ref,2,FALSE)=0,\"\",VLOOKUP(C45,PartnerN°Ref,2,FALSE)),\"\")","v":"#ERROR!"},{"$f":"IFERROR(IF(OR(VLOOKUP(C45,PartnerN°Ref,4,FALSE)=\"Country not found\",VLOOKUP(C45,PartnerN°Ref,3,FALSE)=0),\"\",VLOOKUP(C45,PartnerN°Ref,3,FALSE)),\"\")","v":"#ERROR!"},"Server for e-learning platform - 1 item",2100.0,"#ERROR!",{"$f":"IF(OR(COUNTIF(WorkPackage,B45)=0,COUNTIF(PartnerN°,C45)=0,D45=\"\",COUNTIF(CountryEligEquip,E45)=0,F45=\"\",ISNUMBER(G45)=FALSE,IF(ISNUMBER(G45)=TRUE,G45=INT(G45*100)/100=FALSE)),\"Error\",\"\")","v":"#ERROR!"}]
[null,"Development","P8",{"$f":"IFERROR(IF(VLOOKUP(C45,PartnerN°Ref,2,FALSE)=0,\"\",VLOOKUP(C45,PartnerN°Ref,2,FALSE)),\"\")","v":"#ERROR!"},{"$f":"IFERROR(IF(OR(VLOOKUP(C45,PartnerN°Ref,4,FALSE)=\"Country not found\",VLOOKUP(C45,PartnerN°Ref,3,FALSE)=0),\"\",VLOOKUP(C45,PartnerN°Ref,3,FALSE)),\"\")","v":"#ERROR!"},"Workstations for curricula experimentation ",11000.0,"#ERROR!",{"$f":"IF(OR(COUNTIF(WorkPackage,B45)=0,COUNTIF(PartnerN°,C45)=0,D45=\"\",COUNTIF(CountryEligEquip,E45)=0,F45=\"\",ISNUMBER(G45)=FALSE,IF(ISNUMBER(G45)=TRUE,G45=INT(G45*100)/100=FALSE)),\"Error\",\"\")","v":"#ERROR!"}]
[null,"Development","P8",{"$f":"IFERROR(IF(VLOOKUP(C45,PartnerN°Ref,2,FALSE)=0,\"\",VLOOKUP(C45,PartnerN°Ref,2,FALSE)),\"\")","v":"#ERROR!"},{"$f":"IFERROR(IF(OR(VLOOKUP(C45,PartnerN°Ref,4,FALSE)=\"Country not found\",VLOOKUP(C45,PartnerN°Ref,3,FALSE)=0),\"\",VLOOKUP(C45,PartnerN°Ref,3,FALSE)),\"\")","v":"#ERROR!"},"ADALTA Mathematica,",1200.0,"#ERROR!",{"$f":"IF(OR(COUNTIF(WorkPackage,B45)=0,COUNTIF(PartnerN°,C45)=0,D45=\"\",COUNTIF(CountryEligEquip,E45)=0,F45=\"\",ISNUMBER(G45)=FALSE,IF(ISNUMBER(G45)=TRUE,G45=INT(G45*100)/100=FALSE)),\"Error\",\"\")","v":"#ERROR!"}]
[null,"Development","P8",{"$f":"IFERROR(IF(VLOOKUP(C45,PartnerN°Ref,2,FALSE)=0,\"\",VLOOKUP(C45,PartnerN°Ref,2,FALSE)),\"\")","v":"#ERROR!"},{"$f":"IFERROR(IF(OR(VLOOKUP(C45,PartnerN°Ref,4,FALSE)=\"Country not found\",VLOOKUP(C45,PartnerN°Ref,3,FALSE)=0),\"\",VLOOKUP(C45,PartnerN°Ref,3,FALSE)),\"\")","v":"#ERROR!"},"ADALTA Microcal Origin",700.0,"#ERROR!",{"$f":"IF(OR(COUNTIF(WorkPackage,B45)=0,COUNTIF(PartnerN°,C45)=0,D45=\"\",COUNTIF(CountryEligEquip,E45)=0,F45=\"\",ISNUMBER(G45)=FALSE,IF(ISNUMBER(G45)=TRUE,G45=INT(G45*100)/100=FALSE)),\"Error\",\"\")","v":"#ERROR!"}]
[null,"Development","P8",{"$f":"IFERROR(IF(VLOOKUP(C45,PartnerN°Ref,2,FALSE)=0,\"\",VLOOKUP(C45,PartnerN°Ref,2,FALSE)),\"\")","v":"#ERROR!"},{"$f":"IFERROR(IF(OR(VLOOKUP(C45,PartnerN°Ref,4,FALSE)=\"Country not found\",VLOOKUP(C45,PartnerN°Ref,3,FALSE)=0),\"\",VLOOKUP(C45,PartnerN°Ref,3,FALSE)),\"\")","v":"#ERROR!"},"Raspberry PI with sensors",100.0,"#ERROR!",{"$f":"IF(OR(COUNTIF(WorkPackage,B45)=0,COUNTIF(PartnerN°,C45)=0,D45=\"\",COUNTIF(CountryEligEquip,E45)=0,F45=\"\",ISNUMBER(G45)=FALSE,IF(ISNUMBER(G45)=TRUE,G45=INT(G45*100)/100=FALSE)),\"Error\",\"\")","v":"#ERROR!"}]
[null,"Development","P8",{"$f":"IFERROR(IF(VLOOKUP(C45,PartnerN°Ref,2,FALSE)=0,\"\",VLOOKUP(C45,PartnerN°Ref,2,FALSE)),\"\")","v":"#ERROR!"},{"$f":"IFERROR(IF(OR(VLOOKUP(C45,PartnerN°Ref,4,FALSE)=\"Country not found\",VLOOKUP(C45,PartnerN°Ref,3,FALSE)=0),\"\",VLOOKUP(C45,PartnerN°Ref,3,FALSE)),\"\")","v":"#ERROR!"},"Arduino e atmel microcontroller ",300.0,"#ERROR!",{"$f":"IF(OR(COUNTIF(WorkPackage,B45)=0,COUNTIF(PartnerN°,C45)=0,D45=\"\",COUNTIF(CountryEligEquip,E45)=0,F45=\"\",ISNUMBER(G45)=FALSE,IF(ISNUMBER(G45)=TRUE,G45=INT(G45*100)/100=FALSE)),\"Error\",\"\")","v":"#ERROR!"}]
[null,"Development","P9",{"$f":"IFERROR(IF(VLOOKUP(C45,PartnerN°Ref,2,FALSE)=0,\"\",VLOOKUP(C45,PartnerN°Ref,2,FALSE)),\"\")","v":"#ERROR!"},{"$f":"IFERROR(IF(OR(VLOOKUP(C45,PartnerN°Ref,4,FALSE)=\"Country not found\",VLOOKUP(C45,PartnerN°Ref,3,FALSE)=0),\"\",VLOOKUP(C45,PartnerN°Ref,3,FALSE)),\"\")","v":"#ERROR!"},"Adobe presenter license 3 years",1000.0,"#ERROR!",{"$f":"IF(OR(COUNTIF(WorkPackage,B45)=0,COUNTIF(PartnerN°,C45)=0,D45=\"\",COUNTIF(CountryEligEquip,E45)=0,F45=\"\",ISNUMBER(G45)=FALSE,IF(ISNUMBER(G45)=TRUE,G45=INT(G45*100)/100=FALSE)),\"Error\",\"\")","v":"#ERROR!"}]
[null,"Development","P9",{"$f":"IFERROR(IF(VLOOKUP(C45,PartnerN°Ref,2,FALSE)=0,\"\",VLOOKUP(C45,PartnerN°Ref,2,FALSE)),\"\")","v":"#ERROR!"},{"$f":"IFERROR(IF(OR(VLOOKUP(C45,PartnerN°Ref,4,FALSE)=\"Country not found\",VLOOKUP(C45,PartnerN°Ref,3,FALSE)=0),\"\",VLOOKUP(C45,PartnerN°Ref,3,FALSE)),\"\")","v":"#ERROR!"},"UPS",200.0,"#ERROR!",{"$f":"IF(OR(COUNTIF(WorkPackage,B45)=0,COUNTIF(PartnerN°,C45)=0,D45=\"\",COUNTIF(CountryEligEquip,E45)=0,F45=\"\",ISNUMBER(G45)=FALSE,IF(ISNUMBER(G45)=TRUE,G45=INT(G45*100)/100=FALSE)),\"Error\",\"\")","v":"#ERROR!"}]
[null,"Development","P9",{"$f":"IFERROR(IF(VLOOKUP(C45,PartnerN°Ref,2,FALSE)=0,\"\",VLOOKUP(C45,PartnerN°Ref,2,FALSE)),\"\")","v":"#ERROR!"},{"$f":"IFERROR(IF(OR(VLOOKUP(C45,PartnerN°Ref,4,FALSE)=\"Country not found\",VLOOKUP(C45,PartnerN°Ref,3,FALSE)=0),\"\",VLOOKUP(C45,PartnerN°Ref,3,FALSE)),\"\")","v":"#ERROR!"},"Switch, ruter, network accessories",850.0,"#ERROR!",{"$f":"IF(OR(COUNTIF(WorkPackage,B45)=0,COUNTIF(PartnerN°,C45)=0,D45=\"\",COUNTIF(CountryEligEquip,E45)=0,F45=\"\",ISNUMBER(G45)=FALSE,IF(ISNUMBER(G45)=TRUE,G45=INT(G45*100)/100=FALSE)),\"Error\",\"\")","v":"#ERROR!"}]
[null,"Development","P9",{"$f":"IFERROR(IF(VLOOKUP(C45,PartnerN°Ref,2,FALSE)=0,\"\",VLOOKUP(C45,PartnerN°Ref,2,FALSE)),\"\")","v":"#ERROR!"},{"$f":"IFERROR(IF(OR(VLOOKUP(C45,PartnerN°Ref,4,FALSE)=\"Country not found\",VLOOKUP(C45,PartnerN°Ref,3,FALSE)=0),\"\",VLOOKUP(C45,PartnerN°Ref,3,FALSE)),\"\")","v":"#ERROR!"},"Laptops for curricula develoment - 5 items",4500.0,"#ERROR!",{"$f":"IF(OR(COUNTIF(WorkPackage,B45)=0,COUNTIF(PartnerN°,C45)=0,D45=\"\",COUNTIF(CountryEligEquip,E45)=0,F45=\"\",ISNUMBER(G45)=FALSE,IF(ISNUMBER(G45)=TRUE,G45=INT(G45*100)/100=FALSE)),\"Error\",\"\")","v":"#ERROR!"}]
[null,"Development","P9",{"$f":"IFERROR(IF(VLOOKUP(C45,PartnerN°Ref,2,FALSE)=0,\"\",VLOOKUP(C45,PartnerN°Ref,2,FALSE)),\"\")","v":"#ERROR!"},{"$f":"IFERROR(IF(OR(VLOOKUP(C45,PartnerN°Ref,4,FALSE)=\"Country not found\",VLOOKUP(C45,PartnerN°Ref,3,FALSE)=0),\"\",VLOOKUP(C45,PartnerN°Ref,3,FALSE)),\"\")","v":"#ERROR!"},"Video camera, Multimedia projector 2 items",800.0,"#ERROR!",{"$f":"IF(OR(COUNTIF(WorkPackage,B45)=0,COUNTIF(PartnerN°,C45)=0,D45=\"\",COUNTIF(CountryEligEquip,E45)=0,F45=\"\",ISNUMBER(G45)=FALSE,IF(ISNUMBER(G45)=TRUE,G45=INT(G45*100)/100=FALSE)),\"Error\",\"\")","v":"#ERROR!"}]
[null,"Development","P9",{"$f":"IFERROR(IF(VLOOKUP(C45,PartnerN°Ref,2,FALSE)=0,\"\",VLOOKUP(C45,PartnerN°Ref,2,FALSE)),\"\")","v":"#ERROR!"},{"$f":"IFERROR(IF(OR(VLOOKUP(C45,PartnerN°Ref,4,FALSE)=\"Country not found\",VLOOKUP(C45,PartnerN°Ref,3,FALSE)=0),\"\",VLOOKUP(C45,PartnerN°Ref,3,FALSE)),\"\")","v":"#ERROR!"},"Server for e-learning platform - 1 item",2100.0,"#ERROR!",{"$f":"IF(OR(COUNTIF(WorkPackage,B45)=0,COUNTIF(PartnerN°,C45)=0,D45=\"\",COUNTIF(CountryEligEquip,E45)=0,F45=\"\",ISNUMBER(G45)=FALSE,IF(ISNUMBER(G45)=TRUE,G45=INT(G45*100)/100=FALSE)),\"Error\",\"\")","v":"#ERROR!"}]
[null,"Development","P9",{"$f":"IFERROR(IF(VLOOKUP(C45,PartnerN°Ref,2,FALSE)=0,\"\",VLOOKUP(C45,PartnerN°Ref,2,FALSE)),\"\")","v":"#ERROR!"},{"$f":"IFERROR(IF(OR(VLOOKUP(C45,PartnerN°Ref,4,FALSE)=\"Country not found\",VLOOKUP(C45,PartnerN°Ref,3,FALSE)=0),\"\",VLOOKUP(C45,PartnerN°Ref,3,FALSE)),\"\")","v":"#ERROR!"},"Workstations for curricula experimentation ",11000.0,"#ERROR!",{"$f":"IF(OR(COUNTIF(WorkPackage,B45)=0,COUNTIF(PartnerN°,C45)=0,D45=\"\",COUNTIF(CountryEligEquip,E45)=0,F45=\"\",ISNUMBER(G45)=FALSE,IF(ISNUMBER(G45)=TRUE,G45=INT(G45*100)/100=FALSE)),\"Error\",\"\")","v":"#ERROR!"}]
[null,"Development","P9",{"$f":"IFERROR(IF(VLOOKUP(C45,PartnerN°Ref,2,FALSE)=0,\"\",VLOOKUP(C45,PartnerN°Ref,2,FALSE)),\"\")","v":"#ERROR!"},{"$f":"IFERROR(IF(OR(VLOOKUP(C45,PartnerN°Ref,4,FALSE)=\"Country not found\",VLOOKUP(C45,PartnerN°Ref,3,FALSE)=0),\"\",VLOOKUP(C45,PartnerN°Ref,3,FALSE)),\"\")","v":"#ERROR!"},"ADALTA Mathematica,",1200.0,"#ERROR!",{"$f":"IF(OR(COUNTIF(WorkPackage,B45)=0,COUNTIF(PartnerN°,C45)=0,D45=\"\",COUNTIF(CountryEligEquip,E45)=0,F45=\"\",ISNUMBER(G45)=FALSE,IF(ISNUMBER(G45)=TRUE,G45=INT(G45*100)/100=FALSE)),\"Error\",\"\")","v":"#ERROR!"}]
[null,"Development","P9",{"$f":"IFERROR(IF(VLOOKUP(C45,PartnerN°Ref,2,FALSE)=0,\"\",VLOOKUP(C45,PartnerN°Ref,2,FALSE)),\"\")","v":"#ERROR!"},{"$f":"IFERROR(IF(OR(VLOOKUP(C45,PartnerN°Ref,4,FALSE)=\"Country not found\",VLOOKUP(C45,PartnerN°Ref,3,FALSE)=0),\"\",VLOOKUP(C45,PartnerN°Ref,3,FALSE)),\"\")","v":"#ERROR!"},"ADALTA Microcal Origin",700.0,"#ERROR!",{"$f":"IF(OR(COUNTIF(WorkPackage,B45)=0,COUNTIF(PartnerN°,C45)=0,D45=\"\",COUNTIF(CountryEligEquip,E45)=0,F45=\"\",ISNUMBER(G45)=FALSE,IF(ISNUMBER(G45)=TRUE,G45=INT(G45*100)/100=FALSE)),\"Error\",\"\")","v":"#ERROR!"}]
[null,"Development","P9",{"$f":"IFERROR(IF(VLOOKUP(C45,PartnerN°Ref,2,FALSE)=0,\"\",VLOOKUP(C45,PartnerN°Ref,2,FALSE)),\"\")","v":"#ERROR!"},{"$f":"IFERROR(IF(OR(VLOOKUP(C45,PartnerN°Ref,4,FALSE)=\"Country not found\",VLOOKUP(C45,PartnerN°Ref,3,FALSE)=0),\"\",VLOOKUP(C45,PartnerN°Ref,3,FALSE)),\"\")","v":"#ERROR!"},"Raspberry PI with sensors",100.0,"#ERROR!",{"$f":"IF(OR(COUNTIF(WorkPackage,B45)=0,COUNTIF(PartnerN°,C45)=0,D45=\"\",COUNTIF(CountryEligEquip,E45)=0,F45=\"\",ISNUMBER(G45)=FALSE,IF(ISNUMBER(G45)=TRUE,G45=INT(G45*100)/100=FALSE)),\"Error\",\"\")","v":"#ERROR!"}]
[null,"Development","P9",{"$f":"IFERROR(IF(VLOOKUP(C45,PartnerN°Ref,2,FALSE)=0,\"\",VLOOKUP(C45,PartnerN°Ref,2,FALSE)),\"\")","v":"#ERROR!"},{"$f":"IFERROR(IF(OR(VLOOKUP(C45,PartnerN°Ref,4,FALSE)=\"Country not found\",VLOOKUP(C45,PartnerN°Ref,3,FALSE)=0),\"\",VLOOKUP(C45,PartnerN°Ref,3,FALSE)),\"\")","v":"#ERROR!"},"Arduino e atmel microcontroller ",300.0,"#ERROR!",{"$f":"IF(OR(COUNTIF(WorkPackage,B45)=0,COUNTIF(PartnerN°,C45)=0,D45=\"\",COUNTIF(CountryEligEquip,E45)=0,F45=\"\",ISNUMBER(G45)=FALSE,IF(ISNUMBER(G45)=TRUE,G45=INT(G45*100)/100=FALSE)),\"Error\",\"\")","v":"#ERROR!"}]
[null,"Development","P10",{"$f":"IFERROR(IF(VLOOKUP(C45,PartnerN°Ref,2,FALSE)=0,\"\",VLOOKUP(C45,PartnerN°Ref,2,FALSE)),\"\")","v":"#ERROR!"},{"$f":"IFERROR(IF(OR(VLOOKUP(C45,PartnerN°Ref,4,FALSE)=\"Country not found\",VLOOKUP(C45,PartnerN°Ref,3,FALSE)=0),\"\",VLOOKUP(C45,PartnerN°Ref,3,FALSE)),\"\")","v":"#ERROR!"},"Adobe presenter license 3 years",1000.0,"#ERROR!",{"$f":"IF(OR(COUNTIF(WorkPackage,B45)=0,COUNTIF(PartnerN°,C45)=0,D45=\"\",COUNTIF(CountryEligEquip,E45)=0,F45=\"\",ISNUMBER(G45)=FALSE,IF(ISNUMBER(G45)=TRUE,G45=INT(G45*100)/100=FALSE)),\"Error\",\"\")","v":"#ERROR!"}]
[null,"Development","P10",{"$f":"IFERROR(IF(VLOOKUP(C45,PartnerN°Ref,2,FALSE)=0,\"\",VLOOKUP(C45,PartnerN°Ref,2,FALSE)),\"\")","v":"#ERROR!"},{"$f":"IFERROR(IF(OR(VLOOKUP(C45,PartnerN°Ref,4,FALSE)=\"Country not found\",VLOOKUP(C45,PartnerN°Ref,3,FALSE)=0),\"\",VLOOKUP(C45,PartnerN°Ref,3,FALSE)),\"\")","v":"#ERROR!"},"UPS",200.0,"#ERROR!",{"$f":"IF(OR(COUNTIF(WorkPackage,B45)=0,COUNTIF(PartnerN°,C45)=0,D45=\"\",COUNTIF(CountryEligEquip,E45)=0,F45=\"\",ISNUMBER(G45)=FALSE,IF(ISNUMBER(G45)=TRUE,G45=INT(G45*100)/100=FALSE)),\"Error\",\"\")","v":"#ERROR!"}]
[null,"Development","P10",{"$f":"IFERROR(IF(VLOOKUP(C45,PartnerN°Ref,2,FALSE)=0,\"\",VLOOKUP(C45,PartnerN°Ref,2,FALSE)),\"\")","v":"#ERROR!"},{"$f":"IFERROR(IF(OR(VLOOKUP(C45,PartnerN°Ref,4,FALSE)=\"Country not found\",VLOOKUP(C45,PartnerN°Ref,3,FALSE)=0),\"\",VLOOKUP(C45,PartnerN°Ref,3,FALSE)),\"\")","v":"#ERROR!"},"Switch, ruter, network accessories",850.0,"#ERROR!",{"$f":"IF(OR(COUNTIF(WorkPackage,B45)=0,COUNTIF(PartnerN°,C45)=0,D45=\"\",COUNTIF(CountryEligEquip,E45)=0,F45=\"\",ISNUMBER(G45)=FALSE,IF(ISNUMBER(G45)=TRUE,G45=INT(G45*100)/100=FALSE)),\"Error\",\"\")","v":"#ERROR!"}]
[null,"Development","P10",{"$f":"IFERROR(IF(VLOOKUP(C45,PartnerN°Ref,2,FALSE)=0,\"\",VLOOKUP(C45,PartnerN°Ref,2,FALSE)),\"\")","v":"#ERROR!"},{"$f":"IFERROR(IF(OR(VLOOKUP(C45,PartnerN°Ref,4,FALSE)=\"Country not found\",VLOOKUP(C45,PartnerN°Ref,3,FALSE)=0),\"\",VLOOKUP(C45,PartnerN°Ref,3,FALSE)),\"\")","v":"#ERROR!"},"Laptops for curricula develoment - 5 items",4500.0,"#ERROR!",{"$f":"IF(OR(COUNTIF(WorkPackage,B45)=0,COUNTIF(PartnerN°,C45)=0,D45=\"\",COUNTIF(CountryEligEquip,E45)=0,F45=\"\",ISNUMBER(G45)=FALSE,IF(ISNUMBER(G45)=TRUE,G45=INT(G45*100)/100=FALSE)),\"Error\",\"\")","v":"#ERROR!"}]
[null,"Development","P10",{"$f":"IFERROR(IF(VLOOKUP(C45,PartnerN°Ref,2,FALSE)=0,\"\",VLOOKUP(C45,PartnerN°Ref,2,FALSE)),\"\")","v":"#ERROR!"},{"$f":"IFERROR(IF(OR(VLOOKUP(C45,PartnerN°Ref,4,FALSE)=\"Country not found\",VLOOKUP(C45,PartnerN°Ref,3,FALSE)=0),\"\",VLOOKUP(C45,PartnerN°Ref,3,FALSE)),\"\")","v":"#ERROR!"},"Video camera, Multimedia projector 2 items",800.0,"#ERROR!",{"$f":"IF(OR(COUNTIF(WorkPackage,B45)=0,COUNTIF(PartnerN°,C45)=0,D45=\"\",COUNTIF(CountryEligEquip,E45)=0,F45=\"\",ISNUMBER(G45)=FALSE,IF(ISNUMBER(G45)=TRUE,G45=INT(G45*100)/100=FALSE)),\"Error\",\"\")","v":"#ERROR!"}]
[null,"Development","P10",{"$f":"IFERROR(IF(VLOOKUP(C45,PartnerN°Ref,2,FALSE)=0,\"\",VLOOKUP(C45,PartnerN°Ref,2,FALSE)),\"\")","v":"#ERROR!"},{"$f":"IFERROR(IF(OR(VLOOKUP(C45,PartnerN°Ref,4,FALSE)=\"Country not found\",VLOOKUP(C45,PartnerN°Ref,3,FALSE)=0),\"\",VLOOKUP(C45,PartnerN°Ref,3,FALSE)),\"\")","v":"#ERROR!"},"Server for e-learning platform - 1 item",2100.0,"#ERROR!",{"$f":"IF(OR(COUNTIF(WorkPackage,B45)=0,COUNTIF(PartnerN°,C45)=0,D45=\"\",COUNTIF(CountryEligEquip,E45)=0,F45=\"\",ISNUMBER(G45)=FALSE,IF(ISNUMBER(G45)=TRUE,G45=INT(G45*100)/100=FALSE)),\"Error\",\"\")","v":"#ERROR!"}]
[null,"Development","P10",{"$f":"IFERROR(IF(VLOOKUP(C45,PartnerN°Ref,2,FALSE)=0,\"\",VLOOKUP(C45,PartnerN°Ref,2,FALSE)),\"\")","v":"#ERROR!"},{"$f":"IFERROR(IF(OR(VLOOKUP(C45,PartnerN°Ref,4,FALSE)=\"Country not found\",VLOOKUP(C45,PartnerN°Ref,3,FALSE)=0),\"\",VLOOKUP(C45,PartnerN°Ref,3,FALSE)),\"\")","v":"#ERROR!"},"Workstations for curricula experimentation ",11000.0,"#ERROR!",{"$f":"IF(OR(COUNTIF(WorkPackage,B45)=0,COUNTIF(PartnerN°,C45)=0,D45=\"\",COUNTIF(CountryEligEquip,E45)=0,F45=\"\",ISNUMBER(G45)=FALSE,IF(ISNUMBER(G45)=TRUE,G45=INT(G45*100)/100=FALSE)),\"Error\",\"\")","v":"#ERROR!"}]
[null,"Development","P10",{"$f":"IFERROR(IF(VLOOKUP(C45,PartnerN°Ref,2,FALSE)=0,\"\",VLOOKUP(C45,PartnerN°Ref,2,FALSE)),\"\")","v":"#ERROR!"},{"$f":"IFERROR(IF(OR(VLOOKUP(C45,PartnerN°Ref,4,FALSE)=\"Country not found\",VLOOKUP(C45,PartnerN°Ref,3,FALSE)=0),\"\",VLOOKUP(C45,PartnerN°Ref,3,FALSE)),\"\")","v":"#ERROR!"},"ADALTA Mathematica,",1200.0,"#ERROR!",{"$f":"IF(OR(COUNTIF(WorkPackage,B45)=0,COUNTIF(PartnerN°,C45)=0,D45=\"\",COUNTIF(CountryEligEquip,E45)=0,F45=\"\",ISNUMBER(G45)=FALSE,IF(ISNUMBER(G45)=TRUE,G45=INT(G45*100)/100=FALSE)),\"Error\",\"\")","v":"#ERROR!"}]
[null,"Development","P10",{"$f":"IFERROR(IF(VLOOKUP(C77,PartnerN°Ref,2,FALSE)=0,\"\",VLOOKUP(C77,PartnerN°Ref,2,FALSE)),\"\")","v":"#ERROR!"},{"$f":"IFERROR(IF(OR(VLOOKUP(C77,PartnerN°Ref,4,FALSE)=\"Country not found\",VLOOKUP(C77,PartnerN°Ref,3,FALSE)=0),\"\",VLOOKUP(C77,PartnerN°Ref,3,FALSE)),\"\")","v":"#ERROR!"},"ADALTA Microcal Origin",700.0,"#ERROR!",{"$f":"IF(OR(COUNTIF(WorkPackage,B77)=0,COUNTIF(PartnerN°,C77)=0,D77=\"\",COUNTIF(CountryEligEquip,E77)=0,F77=\"\",ISNUMBER(G77)=FALSE,IF(ISNUMBER(G77)=TRUE,G77=INT(G77*100)/100=FALSE)),\"Error\",\"\")","v":"#ERROR!"}]
[null,"Development","P10",{"$f":"IFERROR(IF(VLOOKUP(C77,PartnerN°Ref,2,FALSE)=0,\"\",VLOOKUP(C77,PartnerN°Ref,2,FALSE)),\"\")","v":"#ERROR!"},{"$f":"IFERROR(IF(OR(VLOOKUP(C77,PartnerN°Ref,4,FALSE)=\"Country not found\",VLOOKUP(C77,PartnerN°Ref,3,FALSE)=0),\"\",VLOOKUP(C77,PartnerN°Ref,3,FALSE)),\"\")","v":"#ERROR!"},"Raspberry PI with sensors",100.0,"#ERROR!",{"$f":"IF(OR(COUNTIF(WorkPackage,B77)=0,COUNTIF(PartnerN°,C77)=0,D77=\"\",COUNTIF(CountryEligEquip,E77)=0,F77=\"\",ISNUMBER(G77)=FALSE,IF(ISNUMBER(G77)=TRUE,G77=INT(G77*100)/100=FALSE)),\"Error\",\"\")","v":"#ERROR!"}]
[null,"Development","P10",{"$f":"IFERROR(IF(VLOOKUP(C77,PartnerN°Ref,2,FALSE)=0,\"\",VLOOKUP(C77,PartnerN°Ref,2,FALSE)),\"\")","v":"#ERROR!"},{"$f":"IFERROR(IF(OR(VLOOKUP(C77,PartnerN°Ref,4,FALSE)=\"Country not found\",VLOOKUP(C77,PartnerN°Ref,3,FALSE)=0),\"\",VLOOKUP(C77,PartnerN°Ref,3,FALSE)),\"\")","v":"#ERROR!"},"Arduino e atmel microcontroller ",300.0,"#ERROR!",{"$f":"IF(OR(COUNTIF(WorkPackage,B77)=0,COUNTIF(PartnerN°,C77)=0,D77=\"\",COUNTIF(CountryEligEquip,E77)=0,F77=\"\",ISNUMBER(G77)=FALSE,IF(ISNUMBER(G77)=TRUE,G77=INT(G77*100)/100=FALSE)),\"Error\",\"\")","v":"#ERROR!"}]
[null,"Development","P11",{"$f":"IFERROR(IF(VLOOKUP(C77,PartnerN°Ref,2,FALSE)=0,\"\",VLOOKUP(C77,PartnerN°Ref,2,FALSE)),\"\")","v":"#ERROR!"},{"$f":"IFERROR(IF(OR(VLOOKUP(C77,PartnerN°Ref,4,FALSE)=\"Country not found\",VLOOKUP(C77,PartnerN°Ref,3,FALSE)=0),\"\",VLOOKUP(C77,PartnerN°Ref,3,FALSE)),\"\")","v":"#ERROR!"},"Adobe presenter license 3 years",1000.0,"#ERROR!",{"$f":"IF(OR(COUNTIF(WorkPackage,B77)=0,COUNTIF(PartnerN°,C77)=0,D77=\"\",COUNTIF(CountryEligEquip,E77)=0,F77=\"\",ISNUMBER(G77)=FALSE,IF(ISNUMBER(G77)=TRUE,G77=INT(G77*100)/100=FALSE)),\"Error\",\"\")","v":"#ERROR!"}]
[null,"Development","P11",{"$f":"IFERROR(IF(VLOOKUP(C77,PartnerN°Ref,2,FALSE)=0,\"\",VLOOKUP(C77,PartnerN°Ref,2,FALSE)),\"\")","v":"#ERROR!"},{"$f":"IFERROR(IF(OR(VLOOKUP(C77,PartnerN°Ref,4,FALSE)=\"Country not found\",VLOOKUP(C77,PartnerN°Ref,3,FALSE)=0),\"\",VLOOKUP(C77,PartnerN°Ref,3,FALSE)),\"\")","v":"#ERROR!"},"UPS",200.0,"#ERROR!",{"$f":"IF(OR(COUNTIF(WorkPackage,B77)=0,COUNTIF(PartnerN°,C77)=0,D77=\"\",COUNTIF(CountryEligEquip,E77)=0,F77=\"\",ISNUMBER(G77)=FALSE,IF(ISNUMBER(G77)=TRUE,G77=INT(G77*100)/100=FALSE)),\"Error\",\"\")","v":"#ERROR!"}]
[null,"Development","P11",{"$f":"IFERROR(IF(VLOOKUP(C77,PartnerN°Ref,2,FALSE)=0,\"\",VLOOKUP(C77,PartnerN°Ref,2,FALSE)),\"\")","v":"#ERROR!"},{"$f":"IFERROR(IF(OR(VLOOKUP(C77,PartnerN°Ref,4,FALSE)=\"Country not found\",VLOOKUP(C77,PartnerN°Ref,3,FALSE)=0),\"\",VLOOKUP(C77,PartnerN°Ref,3,FALSE)),\"\")","v":"#ERROR!"},"Switch, ruter, network accessories",850.0,"#ERROR!",{"$f":"IF(OR(COUNTIF(WorkPackage,B77)=0,COUNTIF(PartnerN°,C77)=0,D77=\"\",COUNTIF(CountryEligEquip,E77)=0,F77=\"\",ISNUMBER(G77)=FALSE,IF(ISNUMBER(G77)=TRUE,G77=INT(G77*100)/100=FALSE)),\"Error\",\"\")","v":"#ERROR!"}]
[null,"Development","P11",{"$f":"IFERROR(IF(VLOOKUP(C77,PartnerN°Ref,2,FALSE)=0,\"\",VLOOKUP(C77,PartnerN°Ref,2,FALSE)),\"\")","v":"#ERROR!"},{"$f":"IFERROR(IF(OR(VLOOKUP(C77,PartnerN°Ref,4,FALSE)=\"Country not found\",VLOOKUP(C77,PartnerN°Ref,3,FALSE)=0),\"\",VLOOKUP(C77,PartnerN°Ref,3,FALSE)),\"\")","v":"#ERROR!"},"Laptops for curricula develoment - 5 items",4500.0,"#ERROR!",{"$f":"IF(OR(COUNTIF(WorkPackage,B77)=0,COUNTIF(PartnerN°,C77)=0,D77=\"\",COUNTIF(CountryEligEquip,E77)=0,F77=\"\",ISNUMBER(G77)=FALSE,IF(ISNUMBER(G77)=TRUE,G77=INT(G77*100)/100=FALSE)),\"Error\",\"\")","v":"#ERROR!"}]
[null,"Development","P11",{"$f":"IFERROR(IF(VLOOKUP(C77,PartnerN°Ref,2,FALSE)=0,\"\",VLOOKUP(C77,PartnerN°Ref,2,FALSE)),\"\")","v":"#ERROR!"},{"$f":"IFERROR(IF(OR(VLOOKUP(C77,PartnerN°Ref,4,FALSE)=\"Country not found\",VLOOKUP(C77,PartnerN°Ref,3,FALSE)=0),\"\",VLOOKUP(C77,PartnerN°Ref,3,FALSE)),\"\")","v":"#ERROR!"},"Video camera, Multimedia projector 2 items",800.0,"#ERROR!",{"$f":"IF(OR(COUNTIF(WorkPackage,B77)=0,COUNTIF(PartnerN°,C77)=0,D77=\"\",COUNTIF(CountryEligEquip,E77)=0,F77=\"\",ISNUMBER(G77)=FALSE,IF(ISNUMBER(G77)=TRUE,G77=INT(G77*100)/100=FALSE)),\"Error\",\"\")","v":"#ERROR!"}]
[null,"Development","P11",{"$f":"IFERROR(IF(VLOOKUP(C77,PartnerN°Ref,2,FALSE)=0,\"\",VLOOKUP(C77,PartnerN°Ref,2,FALSE)),\"\")","v":"#ERROR!"},{"$f":"IFERROR(IF(OR(VLOOKUP(C77,PartnerN°Ref,4,FALSE)=\"Country not found\",VLOOKUP(C77,PartnerN°Ref,3,FALSE)=0),\"\",VLOOKUP(C77,PartnerN°Ref,3,FALSE)),\"\")","v":"#ERROR!"},"Server for e-learning platform - 1 item",2100.0,"#ERROR!",{"$f":"IF(OR(COUNTIF(WorkPackage,B77)=0,COUNTIF(PartnerN°,C77)=0,D77=\"\",COUNTIF(CountryEligEquip,E77)=0,F77=\"\",ISNUMBER(G77)=FALSE,IF(ISNUMBER(G77)=TRUE,G77=INT(G77*100)/100=FALSE)),\"Error\",\"\")","v":"#ERROR!"}]
[null,"Development","P11",{"$f":"IFERROR(IF(VLOOKUP(C77,PartnerN°Ref,2,FALSE)=0,\"\",VLOOKUP(C77,PartnerN°Ref,2,FALSE)),\"\")","v":"#ERROR!"},{"$f":"IFERROR(IF(OR(VLOOKUP(C77,PartnerN°Ref,4,FALSE)=\"Country not found\",VLOOKUP(C77,PartnerN°Ref,3,FALSE)=0),\"\",VLOOKUP(C77,PartnerN°Ref,3,FALSE)),\"\")","v":"#ERROR!"},"Workstations for curricula experimentation ",11000.0,"#ERROR!",{"$f":"IF(OR(COUNTIF(WorkPackage,B77)=0,COUNTIF(PartnerN°,C77)=0,D77=\"\",COUNTIF(CountryEligEquip,E77)=0,F77=\"\",ISNUMBER(G77)=FALSE,IF(ISNUMBER(G77)=TRUE,G77=INT(G77*100)/100=FALSE)),\"Error\",\"\")","v":"#ERROR!"}]
[null,"Development","P11",{"$f":"IFERROR(IF(VLOOKUP(C77,PartnerN°Ref,2,FALSE)=0,\"\",VLOOKUP(C77,PartnerN°Ref,2,FALSE)),\"\")","v":"#ERROR!"},{"$f":"IFERROR(IF(OR(VLOOKUP(C77,PartnerN°Ref,4,FALSE)=\"Country not found\",VLOOKUP(C77,PartnerN°Ref,3,FALSE)=0),\"\",VLOOKUP(C77,PartnerN°Ref,3,FALSE)),\"\")","v":"#ERROR!"},"ADALTA Mathematica,",1200.0,"#ERROR!",{"$f":"IF(OR(COUNTIF(WorkPackage,B77)=0,COUNTIF(PartnerN°,C77)=0,D77=\"\",COUNTIF(CountryEligEquip,E77)=0,F77=\"\",ISNUMBER(G77)=FALSE,IF(ISNUMBER(G77)=TRUE,G77=INT(G77*100)/100=FALSE)),\"Error\",\"\")","v":"#ERROR!"}]
[null,"Development","P11",{"$f":"IFERROR(IF(VLOOKUP(C77,PartnerN°Ref,2,FALSE)=0,\"\",VLOOKUP(C77,PartnerN°Ref,2,FALSE)),\"\")","v":"#ERROR!"},{"$f":"IFERROR(IF(OR(VLOOKUP(C77,PartnerN°Ref,4,FALSE)=\"Country not found\",VLOOKUP(C77,PartnerN°Ref,3,FALSE)=0),\"\",VLOOKUP(C77,PartnerN°Ref,3,FALSE)),\"\")","v":"#ERROR!"},"ADALTA Microcal Origin",700.0,"#ERROR!",{"$f":"IF(OR(COUNTIF(WorkPackage,B77)=0,COUNTIF(PartnerN°,C77)=0,D77=\"\",COUNTIF(CountryEligEquip,E77)=0,F77=\"\",ISNUMBER(G77)=FALSE,IF(ISNUMBER(G77)=TRUE,G77=INT(G77*100)/100=FALSE)),\"Error\",\"\")","v":"#ERROR!"}]
[null,"Development","P11",{"$f":"IFERROR(IF(VLOOKUP(C77,PartnerN°Ref,2,FALSE)=0,\"\",VLOOKUP(C77,PartnerN°Ref,2,FALSE)),\"\")","v":"#ERROR!"},{"$f":"IFERROR(IF(OR(VLOOKUP(C77,PartnerN°Ref,4,FALSE)=\"Country not found\",VLOOKUP(C77,PartnerN°Ref,3,FALSE)=0),\"\",VLOOKUP(C77,PartnerN°Ref,3,FALSE)),\"\")","v":"#ERROR!"},"Raspberry PI with sensors",100.0,"#ERROR!",{"$f":"IF(OR(COUNTIF(WorkPackage,B77)=0,COUNTIF(PartnerN°,C77)=0,D77=\"\",COUNTIF(CountryEligEquip,E77)=0,F77=\"\",ISNUMBER(G77)=FALSE,IF(ISNUMBER(G77)=TRUE,G77=INT(G77*100)/100=FALSE)),\"Error\",\"\")","v":"#ERROR!"}]
[null,"Development","P11",{"$f":"IFERROR(IF(VLOOKUP(C77,PartnerN°Ref,2,FALSE)=0,\"\",VLOOKUP(C77,PartnerN°Ref,2,FALSE)),\"\")","v":"#ERROR!"},{"$f":"IFERROR(IF(OR(VLOOKUP(C77,PartnerN°Ref,4,FALSE)=\"Country not found\",VLOOKUP(C77,PartnerN°Ref,3,FALSE)=0),\"\",VLOOKUP(C77,PartnerN°Ref,3,FALSE)),\"\")","v":"#ERROR!"},"Arduino e atmel microcontroller ",300.0,"#ERROR!",{"$f":"IF(OR(COUNTIF(WorkPackage,B77)=0,COUNTIF(PartnerN°,C77)=0,D77=\"\",COUNTIF(CountryEligEquip,E77)=0,F77=\"\",ISNUMBER(G77)=FALSE,IF(ISNUMBER(G77)=TRUE,G77=INT(G77*100)/100=FALSE)),\"Error\",\"\")","v":"#ERROR!"}]

{"sheet":"5. Subcontracting Costs","index":5,"n_rows":40,"n_cols":9,"rows_kept":40,"cut":false,"hidden":false,"merged":[[10,1,11,1],[10,2,11,2],[10,3,11,3],[10,4,11,4],[10,5,11,5],[10,6,11,6],[10,7,11,7],[10,8,11,8],[0,1,0,8],[1,1,1,8],[2,1,2,8],[3,1,8,1],[3,2,8,3],[3,4,8,8],[9,1,9,8]]}
[]
[null,"5. Subcontracting Costs"]
[]
[null,"Total (EUR)",{"$f":"SUM(H:H)","v":"#ERROR!"}]
[]
[]
[]
[]
[]
[]
[null,"Work\nPackage","Partner \nN°","Name of Partner\n(to encode in overview sheet)","Country\n(to encode in overview sheet)","Nature, type and specifications of the item","Amount\nExcluding VAT\n(EUR)","Total\n(EUR)","Check\nData\nEncoding"]
[]
[null,null,null,{"$f":"IFERROR(IF(VLOOKUP(C13,PartnerN°Ref,2,FALSE)=0,\"\",VLOOKUP(C13,PartnerN°Ref,2,FALSE)),\"\")","v":"#ERROR!"},{"$f":"IFERROR(IF(OR(VLOOKUP(C13,PartnerN°Ref,4,FALSE)=\"Country not found\",VLOOKUP(C13,PartnerN°Ref,3,FALSE)=0),\"\",VLOOKUP(C13,PartnerN°Ref,3,FALSE)),\"\")","v":"#ERROR!"},null,0.0,{"$f":"IF(I13=\"Error\",0,ROUND(G13,2))","v":"#ERROR!"},{"$f":"IF(OR(COUNTIF(WorkPackage,B13)=0,COUNTIF(PartnerN°,C13)=0,D13=\"\",COUNTIF(CountryALL,E13)=0,F13=\"\",ISNUMBER(G13)=FALSE,IF(ISNUMBER(G13)=TRUE,G13=INT(G13*100)/100=FALSE)),\"Error\",\"\")","v":"#ERROR!"}]
[null,"Preparation","P1",{"$f":"IFERROR(IF(VLOOKUP(C13,PartnerN°Ref,2,FALSE)=0,\"\",VLOOKUP(C13,PartnerN°Ref,2,FALSE)),\"\")","v":"#ERROR!"},{"$f":"IFERROR(IF(OR(VLOOKUP(C13,PartnerN°Ref,4,FALSE)=\"Country not found\",VLOOKUP(C13,PartnerN°Ref,3,FALSE)=0),\"\",VLOOKUP(C13,PartnerN°Ref,3,FALSE)),\"\")","v":"#ERROR!"},{"$f":"'[1]BUDGET CB_HE'!$F$65","v":"#REF!"},1000.0,"#ERROR!",{"$f":"IF(OR(COUNTIF(WorkPackage,B13)=0,COUNTIF(PartnerN°,C13)=0,D13=\"\",COUNTIF(CountryALL,E13)=0,F13=\"\",ISNUMBER(G13)=FALSE,IF(ISNUMBER(G13)=TRUE,G13=INT(G13*100)/100=FALSE)),\"Error\",\"\")","v":"#ERROR!"}]
[null,"Management","P1",{"$f":"IFERROR(IF(VLOOKUP(C13,PartnerN°Ref,2,FALSE)=0,\"\",VLOOKUP(C13,PartnerN°Ref,2,FALSE)),\"\")","v":"#ERROR!"},{"$f":"IFERROR(IF(OR(VLOOKUP(C13,PartnerN°Ref,4,FALSE)=\"Country not found\",VLOOKUP(C13,PartnerN°Ref,3,FALSE)=0),\"\",VLOOKUP(C13,PartnerN°Ref,3,FALSE)),\"\")","v":"#ERROR!"},"audit",8500.0,"#ERROR!",{"$f":"IF(OR(COUNTIF(WorkPackage,B13)=0,COUNTIF(PartnerN°,C13)=0,D13=\"\",COUNTIF(CountryALL,E13)=0,F13=\"\",ISNUMBER(G13)=FALSE,IF(ISNUMBER(G13)=TRUE,G13=INT(G13*100)/100=FALSE)),\"Error\",\"\")","v":"#ERROR!"}]
[null,"Preparation","P2",{"$f":"IFERROR(IF(VLOOKUP(C13,PartnerN°Ref,2,FALSE)=0,\"\",VLOOKUP(C13,PartnerN°Ref,2,FALSE)),\"\")","v":"#ERROR!"},{"$f":"IFERROR(IF(OR(VLOOKUP(C13,PartnerN°Ref,4,FALSE)=\"Country not found\",VLOOKUP(C13,PartnerN°Ref,3,FALSE)=0),\"\",VLOOKUP(C13,PartnerN°Ref,3,FALSE)),\"\")","v":"#ERROR!"},{"$f":"'[1]BUDGET CB_HE'!$F$65","v":"#REF!"},1000.0,"#ERROR!",{"$f":"IF(OR(COUNTIF(WorkPackage,B13)=0,COUNTIF(PartnerN°,C13)=0,D13=\"\",COUNTIF(CountryALL,E13)=0,F13=\"\",ISNUMBER(G13)=FALSE,IF(ISNUMBER(G13)=TRUE,G13=INT(G13*100)/100=FALSE)),\"Error\",\"\")","v":"#ERROR!"}]
[null,"Preparation","P3",{"$f":"IFERROR(IF(VLOOKUP(C13,PartnerN°Ref,2,FALSE)=0,\"\",VLOOKUP(C13,PartnerN°Ref,2,FALSE)),\"\")","v":"#ERROR!"},{"$f":"IFERROR(IF(OR(VLOOKUP(C13,PartnerN°Ref,4,FALSE)=\"Country not found\",VLOOKUP(C13,PartnerN°Ref,3,FALSE)=0),\"\",VLOOKUP(C13,PartnerN°Ref,3,FALSE)),\"\")","v":"#ERROR!"},"#REF!",1000.0,"#ERROR!",{"$f":"IF(OR(COUNTIF(WorkPackage,B13)=0,COUNTIF(PartnerN°,C13)=0,D13=\"\",COUNTIF(CountryALL,E13)=0,F13=\"\",ISNUMBER(G13)=FALSE,IF(ISNUMBER(G13)=TRUE,G13=INT(G13*100)/100=FALSE)),\"Error\",\"\")","v":"#ERROR!"}]
[null,"Quality Plan","P3",{"$f":"IFERROR(IF(VLOOKUP(C13,PartnerN°Ref,2,FALSE)=0,\"\",VLOOKUP(C13,PartnerN°Ref,2,FALSE)),\"\")","v":"#ERROR!"},{"$f":"IFERROR(IF(OR(VLOOKUP(C13,PartnerN°Ref,4,FALSE)=\"Country not found\",VLOOKUP(C13,PartnerN°Ref,3,FALSE)=0),\"\",VLOOKUP(C13,PartnerN°Ref,3,FALSE)),\"\")","v":"#ERROR!"},"external quality expert",9000.0,"#ERROR!",{"$f":"IF(OR(COUNTIF(WorkPackage,B13)=0,COUNTIF(PartnerN°,C13)=0,D13=\"\",COUNTIF(CountryALL,E13)=0,F13=\"\",ISNUMBER(G13)=FALSE,IF(ISNUMBER(G13)=TRUE,G13=INT(G13*100)/100=FALSE)),\"Error\",\"\")","v":"#ERROR!"}]
[null,"Preparation","P4",{"$f":"IFERROR(IF(VLOOKUP(C13,PartnerN°Ref,2,FALSE)=0,\"\",VLOOKUP(C13,PartnerN°Ref,2,FALSE)),\"\")","v":"#ERROR!"},{"$f":"IFERROR(IF(OR(VLOOKUP(C13,PartnerN°Ref,4,FALSE)=\"Country not found\",VLOOKUP(C13,PartnerN°Ref,3,FALSE)=0),\"\",VLOOKUP(C13,PartnerN°Ref,3,FALSE)),\"\")","v":"#ERROR!"},{"$f":"'[1]BUDGET CB_HE'!$F$65","v":"#REF!"},3500.0,"#ERROR!",{"$f":"IF(OR(COUNTIF(WorkPackage,B13)=0,COUNTIF(PartnerN°,C13)=0,D13=\"\",COUNTIF(CountryALL,E13)=0,F13=\"\",ISNUMBER(G13)=FALSE,IF(ISNUMBER(G13)=TRUE,G13=INT(G13*100)/100=FALSE)),\"Error\",\"\")","v":"#ERROR!"}]
[null,"Development","P5",{"$f":"IFERROR(IF(VLOOKUP(C13,PartnerN°Ref,2,FALSE)=0,\"\",VLOOKUP(C13,PartnerN°Ref,2,FALSE)),\"\")","v":"#ERROR!"},{"$f":"IFERROR(IF(OR(VLOOKUP(C13,PartnerN°Ref,4,FALSE)=\"Country not found\",VLOOKUP(C13,PartnerN°Ref,3,FALSE)=0),\"\",VLOOKUP(C13,PartnerN°Ref,3,FALSE)),\"\")","v":"#ERROR!"},{"$f":"'[1]BUDGET CB_HE'!$AD$119","v":"#REF!"},3000.0,"#ERROR!",{"$f":"IF(OR(COUNTIF(WorkPackage,B13)=0,COUNTIF(PartnerN°,C13)=0,D13=\"\",COUNTIF(CountryALL,E13)=0,F13=\"\",ISNUMBER(G13)=FALSE,IF(ISNUMBER(G13)=TRUE,G13=INT(G13*100)/100=FALSE)),\"Error\",\"\")","v":"#ERROR!"}]
[null,"Dissemination & Exploitation","P5",{"$f":"IFERROR(IF(VLOOKUP(C13,PartnerN°Ref,2,FALSE)=0,\"\",VLOOKUP(C13,PartnerN°Ref,2,FALSE)),\"\")","v":"#ERROR!"},{"$f":"IFERROR(IF(OR(VLOOKUP(C13,PartnerN°Ref,4,FALSE)=\"Country not found\",VLOOKUP(C13,PartnerN°Ref,3,FALSE)=0),\"\",VLOOKUP(C13,PartnerN°Ref,3,FALSE)),\"\")","v":"#ERROR!"},"printing material ",1500.0,"#ERROR!",{"$f":"IF(OR(COUNTIF(WorkPackage,B13)=0,COUNTIF(PartnerN°,C13)=0,D13=\"\",COUNTIF(CountryALL,E13)=0,F13=\"\",ISNUMBER(G13)=FALSE,IF(ISNUMBER(G13)=TRUE,G13=INT(G13*100)/100=FALSE)),\"Error\",\"\")","v":"#ERROR!"}]
[null,"Dissemination & Exploitation","P5",{"$f":"IFERROR(IF(VLOOKUP(C13,PartnerN°Ref,2,FALSE)=0,\"\",VLOOKUP(C13,PartnerN°Ref,2,FALSE)),\"\")","v":"#ERROR!"},{"$f":"IFERROR(IF(OR(VLOOKUP(C13,PartnerN°Ref,4,FALSE)=\"Country not found\",VLOOKUP(C13,PartnerN°Ref,3,FALSE)=0),\"\",VLOOKUP(C13,PartnerN°Ref,3,FALSE)),\"\")","v":"#ERROR!"},"exploitation events organisation ",2400.0,"#ERROR!",{"$f":"IF(OR(COUNTIF(WorkPackage,B13)=0,COUNTIF(PartnerN°,C13)=0,D13=\"\",COUNTIF(CountryALL,E13)=0,F13=\"\",ISNUMBER(G13)=FALSE,IF(ISNUMBER(G13)=TRUE,G13=INT(G13*100)/100=FALSE)),\"Error\",\"\")","v":"#ERROR!"}]
[null,"Dissemination & Exploitation","P6",{"$f":"IFERROR(IF(VLOOKUP(C13,PartnerN°Ref,2,FALSE)=0,\"\",VLOOKUP(C13,PartnerN°Ref,2,FALSE)),\"\")","v":"#ERROR!"},{"$f":"IFERROR(IF(OR(VLOOKUP(C13,PartnerN°Ref,4,FALSE)=\"Country not found\",VLOOKUP(C13,PartnerN°Ref,3,FALSE)=0),\"\",VLOOKUP(C13,PartnerN°Ref,3,FALSE)),\"\")","v":"#ERROR!"},"printing material ",1500.0,"#ERROR!",{"$f":"IF(OR(COUNTIF(WorkPackage,B13)=0,COUNTIF(PartnerN°,C13)=0,D13=\"\",COUNTIF(CountryALL,E13)=0,F13=\"\",ISNUMBER(G13)=FALSE,IF(ISNUMBER(G13)=TRUE,G13=INT(G13*100)/100=FALSE)),\"Error\",\"\")","v":"#ERROR!"}]
[null,"Dissemination & Exploitation","P6",{"$f":"IFERROR(IF(VLOOKUP(C13,PartnerN°Ref,2,FALSE)=0,\"\",VLOOKUP(C13,PartnerN°Ref,2,FALSE)),\"\")","v":"#ERROR!"},{"$f":"IFERROR(IF(OR(VLOOKUP(C13,PartnerN°Ref,4,FALSE)=\"Country not found\",VLOOKUP(C13,PartnerN°Ref,3,FALSE)=0),\"\",VLOOKUP(C13,PartnerN°Ref,3,FALSE)),\"\")","v":"#ERROR!"},"exploitation events organisation ",2400.0,"#ERROR!",{"$f":"IF(OR(COUNTIF(WorkPackage,B13)=0,COUNTIF(PartnerN°,C13)=0,D13=\"\",COUNTIF(CountryALL,E13)=0,F13=\"\",ISNUMBER(G13)=FALSE,IF(ISNUMBER(G13)=TRUE,G13=INT(G13*100)/100=FALSE)),\"Error\",\"\")","v":"#ERROR!"}]
[null,"Dissemination & Exploitation","P7",{"$f":"IFERROR(IF(VLOOKUP(C13,PartnerN°Ref,2,FALSE)=0,\"\",VLOOKUP(C13,PartnerN°Ref,2,FALSE)),\"\")","v":"#ERROR!"},{"$f":"IFERROR(IF(OR(VLOOKUP(C13,PartnerN°Ref,4,FALSE)=\"Country not found\",VLOOKUP(C13,PartnerN°Ref,3,FALSE)=0),\"\",VLOOKUP(C13,PartnerN°Ref,3,FALSE)),\"\")","v":"#ERROR!"},"printing material ",1500.0,"#ERROR!",{"$f":"IF(OR(COUNTIF(WorkPackage,B13)=0,COUNTIF(PartnerN°,C13)=0,D13=\"\",COUNTIF(CountryALL,E13)=0,F13=\"\",ISNUMBER(G13)=FALSE,IF(ISNUMBER(G13)=TRUE,G13=INT(G13*100)/100=FALSE)),\"Error\",\"\")","v":"#ERROR!"}]
[null,"Dissemination & Exploitation","P7",{"$f":"IFERROR(IF(VLOOKUP(C13,PartnerN°Ref,2,FALSE)=0,\"\",VLOOKUP(C13,PartnerN°Ref,2,FALSE)),\"\")","v":"#ERROR!"},{"$f":"IFERROR(IF(OR(VLOOKUP(C13,PartnerN°Ref,4,FALSE)=\"Country not found\",VLOOKUP(C13,PartnerN°Ref,3,FALSE)=0),\"\",VLOOKUP(C13,PartnerN°Ref,3,FALSE)),\"\")","v":"#ERROR!"},"exploitation events organisation ",2400.0,"#ERROR!",{"$f":"IF(OR(COUNTIF(WorkPackage,B13)=0,COUNTIF(PartnerN°,C13)=0,D13=\"\",COUNTIF(CountryALL,E13)=0,F13=\"\",ISNUMBER(G13)=FALSE,IF(ISNUMBER(G13)=TRUE,G13=INT(G13*100)/100=FALSE)),\"Error\",\"\")","v":"#ERROR!"}]
[null,"Dissemination & Exploitation","P7",{"$f":"IFERROR(IF(VLOOKUP(C13,PartnerN°Ref,2,FALSE)=0,\"\",VLOOKUP(C13,PartnerN°Ref,2,FALSE)),\"\")","v":"#ERROR!"},{"$f":"IFERROR(IF(OR(VLOOKUP(C13,PartnerN°Ref,4,FALSE)=\"Country not found\",VLOOKUP(C13,PartnerN°Ref,3,FALSE)=0),\"\",VLOOKUP(C13,PartnerN°Ref,3,FALSE)),\"\")","v":"#ERROR!"},"graphical design of dissemination materials",2000.0,"#ERROR!",{"$f":"IF(OR(COUNTIF(WorkPackage,B13)=0,COUNTIF(PartnerN°,C13)=0,D13=\"\",COUNTIF(CountryALL,E13)=0,F13=\"\",ISNUMBER(G13)=FALSE,IF(ISNUMBER(G13)=TRUE,G13=INT(G13*100)/100=FALSE)),\"Error\",\"\")","v":"#ERROR!"}]
[null,"Development","P8",{"$f":"IFERROR(IF(VLOOKUP(C13,PartnerN°Ref,2,FALSE)=0,\"\",VLOOKUP(C13,PartnerN°Ref,2,FALSE)),\"\")","v":"#ERROR!"},{"$f":"IFERROR(IF(OR(VLOOKUP(C13,PartnerN°Ref,4,FALSE)=\"Country not found\",VLOOKUP(C13,PartnerN°Ref,3,FALSE)=0),\"\",VLOOKUP(C13,PartnerN°Ref,3,FALSE)),\"\")","v":"#ERROR!"},{"$f":"'[1]BUDGET CB_HE'!$AD$119","v":"#REF!"},3000.0,"#ERROR!",{"$f":"IF(OR(COUNTIF(WorkPackage,B13)=0,COUNTIF(PartnerN°,C13)=0,D13=\"\",COUNTIF(CountryALL,E13)=0,F13=\"\",ISNUMBER(G13)=FALSE,IF(ISNUMBER(G13)=TRUE,G13=INT(G13*100)/100=FALSE)),\"Error\",\"\")","v":"#ERROR!"}]
[null,"Dissemination & Exploitation","P8",{"$f":"IFERROR(IF(VLOOKUP(C13,PartnerN°Ref,2,FALSE)=0,\"\",VLOOKUP(C13,PartnerN°Ref,2,FALSE)),\"\")","v":"#ERROR!"},{"$f":"IFERROR(IF(OR(VLOOKUP(C13,PartnerN°Ref,4,FALSE)=\"Country not found\",VLOOKUP(C13,PartnerN°Ref,3,FALSE)=0),\"\",VLOOKUP(C13,PartnerN°Ref,3,FALSE)),\"\")","v":"#ERROR!"},"printing material ",1500.0,"#ERROR!",{"$f":"IF(OR(COUNTIF(WorkPackage,B13)=0,COUNTIF(PartnerN°,C13)=0,D13=\"\",COUNTIF(CountryALL,E13)=0,F13=\"\",ISNUMBER(G13)=FALSE,IF(ISNUMBER(G13)=TRUE,G13=INT(G13*100)/100=FALSE)),\"Error\",\"\")","v":"#ERROR!"}]
[null,"Dissemination & Exploitation","P8",{"$f":"IFERROR(IF(VLOOKUP(C13,PartnerN°Ref,2,FALSE)=0,\"\",VLOOKUP(C13,PartnerN°Ref,2,FALSE)),\"\")","v":"#ERROR!"},{"$f":"IFERROR(IF(OR(VLOOKUP(C13,PartnerN°Ref,4,FALSE)=\"Country not found\",VLOOKUP(C13,PartnerN°Ref,3,FALSE)=0),\"\",VLOOKUP(C13,PartnerN°Ref,3,FALSE)),\"\")","v":"#ERROR!"},"exploitation events organisation ",2400.0,"#ERROR!",{"$f":"IF(OR(COUNTIF(WorkPackage,B13)=0,COUNTIF(PartnerN°,C13)=0,D13=\"\",COUNTIF(CountryALL,E13)=0,F13=\"\",ISNUMBER(G13)=FALSE,IF(ISNUMBER(G13)=TRUE,G13=INT(G13*100)/100=FALSE)),\"Error\",\"\")","v":"#ERROR!"}]
[null,"Dissemination & Exploitation","P9",{"$f":"IFERROR(IF(VLOOKUP(C13,PartnerN°Ref,2,FALSE)=0,\"\",VLOOKUP(C13,PartnerN°Ref,2,FALSE)),\"\")","v":"#ERROR!"},{"$f":"IFERROR(IF(OR(VLOOKUP(C13,PartnerN°Ref,4,FALSE)=\"Country not found\",VLOOKUP(C13,PartnerN°Ref,3,FALSE)=0),\"\",VLOOKUP(C13,PartnerN°Ref,3,FALSE)),\"\")","v":"#ERROR!"},"printing material ",1500.0,"#ERROR!",{"$f":"IF(OR(COUNTIF(WorkPackage,B13)=0,COUNTIF(PartnerN°,C13)=0,D13=\"\",COUNTIF(CountryALL,E13)=0,F13=\"\",ISNUMBER(G13)=FALSE,IF(ISNUMBER(G13)=TRUE,G13=INT(G13*100)/100=FALSE)),\"Error\",\"\")","v":"#ERROR!"}]
[null,"Dissemination & Exploitation","P9",{"$f":"IFERROR(IF(VLOOKUP(C13,PartnerN°Ref,2,FALSE)=0,\"\",VLOOKUP(C13,PartnerN°Ref,2,FALSE)),\"\")","v":"#ERROR!"},{"$f":"IFERROR(IF(OR(VLOOKUP(C13,PartnerN°Ref,4,FALSE)=\"Country not found\",VLOOKUP(C13,PartnerN°Ref,3,FALSE)=0),\"\",VLOOKUP(C13,PartnerN°Ref,3,FALSE)),\"\")","v":"#ERROR!"},"exploitation events organisation ",2400.0,"#ERROR!",{"$f":"IF(OR(COUNTIF(WorkPackage,B13)=0,COUNTIF(PartnerN°,C13)=0,D13=\"\",COUNTIF(CountryALL,E13)=0,F13=\"\",ISNUMBER(G13)=FALSE,IF(ISNUMBER(G13)=TRUE,G13=INT(G13*100)/100=FALSE)),\"Error\",\"\")","v":"#ERROR!"}]
[null,"Dissemination & Exploitation","P9",{"$f":"IFERROR(IF(VLOOKUP(C13,PartnerN°Ref,2,FALSE)=0,\"\",VLOOKUP(C13,PartnerN°Ref,2,FALSE)),\"\")","v":"#ERROR!"},{"$f":"IFERROR(IF(OR(VLOOKUP(C13,PartnerN°Ref,4,FALSE)=\"Country not found\",VLOOKUP(C13,PartnerN°Ref,3,FALSE)=0),\"\",VLOOKUP(C13,PartnerN°Ref,3,FALSE)),\"\")","v":"#ERROR!"},"organisation of final conference",3500.0,"#ERROR!",{"$f":"IF(OR(COUNTIF(WorkPackage,B13)=0,COUNTIF(PartnerN°,C13)=0,D13=\"\",COUNTIF(CountryALL,E13)=0,F13=\"\",ISNUMBER(G13)=FALSE,IF(ISNUMBER(G13)=TRUE,G13=INT(G13*100)/100=FALSE)),\"Error\",\"\")","v":"#ERROR!"}]
[null,"Development","P10",{"$f":"IFERROR(IF(VLOOKUP(C13,PartnerN°Ref,2,FALSE)=0,\"\",VLOOKUP(C13,PartnerN°Ref,2,FALSE)),\"\")","v":"#ERROR!"},{"$f":"IFERROR(IF(OR(VLOOKUP(C13,PartnerN°Ref,4,FALSE)=\"Country not found\",VLOOKUP(C13,PartnerN°Ref,3,FALSE)=0),\"\",VLOOKUP(C13,PartnerN°Ref,3,FALSE)),\"\")","v":"#ERROR!"},{"$f":"'[1]BUDGET CB_HE'!$AD$119","v":"#REF!"},3000.0,"#ERROR!",{"$f":"IF(OR(COUNTIF(WorkPackage,B13)=0,COUNTIF(PartnerN°,C13)=0,D13=\"\",COUNTIF(CountryALL,E13)=0,F13=\"\",ISNUMBER(G13)=FALSE,IF(ISNUMBER(G13)=TRUE,G13=INT(G13*100)/100=FALSE)),\"Error\",\"\")","v":"#ERROR!"}]
[null,"Dissemination & Exploitation","P10",{"$f":"IFERROR(IF(VLOOKUP(C13,PartnerN°Ref,2,FALSE)=0,\"\",VLOOKUP(C13,PartnerN°Ref,2,FALSE)),\"\")","v":"#ERROR!"},{"$f":"IFERROR(IF(OR(VLOOKUP(C13,PartnerN°Ref,4,FALSE)=\"Country not found\",VLOOKUP(C13,PartnerN°Ref,3,FALSE)=0),\"\",VLOOKUP(C13,PartnerN°Ref,3,FALSE)),\"\")","v":"#ERROR!"},"printing material ",1500.0,"#ERROR!",{"$f":"IF(OR(COUNTIF(WorkPackage,B13)=0,COUNTIF(PartnerN°,C13)=0,D13=\"\",COUNTIF(CountryALL,E13)=0,F13=\"\",ISNUMBER(G13)=FALSE,IF(ISNUMBER(G13)=TRUE,G13=INT(G13*100)/100=FALSE)),\"Error\",\"\")","v":"#ERROR!"}]
[null,"Dissemination & Exploitation","P10",{"$f":"IFERROR(IF(VLOOKUP(C13,PartnerN°Ref,2,FALSE)=0,\"\",VLOOKUP(C13,PartnerN°Ref,2,FALSE)),\"\")","v":"#ERROR!"},{"$f":"IFERROR(IF(OR(VLOOKUP(C13,PartnerN°Ref,4,FALSE)=\"Country not found\",VLOOKUP(C13,PartnerN°Ref,3,FALSE)=0),\"\",VLOOKUP(C13,PartnerN°Ref,3,FALSE)),\"\")","v":"#ERROR!"},"exploitation events organisation ",2400.0,"#ERROR!",{"$f":"IF(OR(COUNTIF(WorkPackage,B13)=0,COUNTIF(PartnerN°,C13)=0,D13=\"\",COUNTIF(CountryALL,E13)=0,F13=\"\",ISNUMBER(G13)=FALSE,IF(ISNUMBER(G13)=TRUE,G13=INT(G13*100)/100=FALSE)),\"Error\",\"\")","v":"#ERROR!"}]
[null,"Dissemination & Exploitation","P11",{"$f":"IFERROR(IF(VLOOKUP(C13,PartnerN°Ref,2,FALSE)=0,\"\",VLOOKUP(C13,PartnerN°Ref,2,FALSE)),\"\")","v":"#ERROR!"},{"$f":"IFERROR(IF(OR(VLOOKUP(C13,PartnerN°Ref,4,FALSE)=\"Country not found\",VLOOKUP(C13,PartnerN°Ref,3,FALSE)=0),\"\",VLOOKUP(C13,PartnerN°Ref,3,FALSE)),\"\")","v":"#ERROR!"},"printing material ",1500.0,"#ERROR!",{"$f":"IF(OR(COUNTIF(WorkPackage,B13)=0,COUNTIF(PartnerN°,C13)=0,D13=\"\",COUNTIF(CountryALL,E13)=0,F13=\"\",ISNUMBER(G13)=FALSE,IF(ISNUMBER(G13)=TRUE,G13=INT(G13*100)/100=FALSE)),\"Error\",\"\")","v":"#ERROR!"}]
[null,"Dissemination & Exploitation","P11",{"$f":"IFERROR(IF(VLOOKUP(C13,PartnerN°Ref,2,FALSE)=0,\"\",VLOOKUP(C13,PartnerN°Ref,2,FALSE)),\"\")","v":"#ERROR!"},{"$f":"IFERROR(IF(OR(VLOOKUP(C13,PartnerN°Ref,4,FALSE)=\"Country not found\",VLOOKUP(C13,PartnerN°Ref,3,FALSE)=0),\"\",VLOOKUP(C13,PartnerN°Ref,3,FALSE)),\"\")","v":"#ERROR!"},"exploitation events organisation ",2400.0,"#ERROR!",{"$f":"IF(OR(COUNTIF(WorkPackage,B13)=0,COUNTIF(PartnerN°,C13)=0,D13=\"\",COUNTIF(CountryALL,E13)=0,F13=\"\",ISNUMBER(G13)=FALSE,IF(ISNUMBER(G13)=TRUE,G13=INT(G13*100)/100=FALSE)),\"Error\",\"\")","v":"#ERROR!"}]
[null,"Preparation","P12",{"$f":"IFERROR(IF(VLOOKUP(C13,PartnerN°Ref,2,FALSE)=0,\"\",VLOOKUP(C13,PartnerN°Ref,2,FALSE)),\"\")","v":"#ERROR!"},{"$f":"IFERROR(IF(OR(VLOOKUP(C13,PartnerN°Ref,4,FALSE)=\"Country not found\",VLOOKUP(C13,PartnerN°Ref,3,FALSE)=0),\"\",VLOOKUP(C13,PartnerN°Ref,3,FALSE)),\"\")","v":"#ERROR!"},{"$f":"'[1]BUDGET CB_HE'!$F$65","v":"#REF!"},2000.0,"#ERROR!",{"$f":"IF(OR(COUNTIF(WorkPackage,B13)=0,COUNTIF(PartnerN°,C13)=0,D13=\"\",COUNTIF(CountryALL,E13)=0,F13=\"\",ISNUMBER(G13)=FALSE,IF(ISNUMBER(G13)=TRUE,G13=INT(G13*100)/100=FALSE)),\"Error\",\"\")","v":"#ERROR!"}]
[null,"Dissemination & Exploitation","P12",{"$f":"IFERROR(IF(VLOOKUP(C13,PartnerN°Ref,2,FALSE)=0,\"\",VLOOKUP(C13,PartnerN°Ref,2,FALSE)),\"\")","v":"#ERROR!"},{"$f":"IFERROR(IF(OR(VLOOKUP(C13,PartnerN°Ref,4,FALSE)=\"Country not found\",VLOOKUP(C13,PartnerN°Ref,3,FALSE)=0),\"\",VLOOKUP(C13,PartnerN°Ref,3,FALSE)),\"\")","v":"#ERROR!"},"printing material ",1500.0,"#ERROR!",{"$f":"IF(OR(COUNTIF(WorkPackage,B13)=0,COUNTIF(PartnerN°,C13)=0,D13=\"\",COUNTIF(CountryALL,E13)=0,F13=\"\",ISNUMBER(G13)=FALSE,IF(ISNUMBER(G13)=TRUE,G13=INT(G13*100)/100=FALSE)),\"Error\",\"\")","v":"#ERROR!"}]

{"sheet":"Co-financing","index":6,"n_rows":29,"n_cols":10,"rows_kept":29,"cut":false,"hidden":false,"merged":[[0,1,0,9],[1,1,1,9],[2,1,2,9],[3,1,8,1],[3,2,8,2],[3,3,8,9],[9,1,9,9],[10,8,11,8],[10,9,11,9],[10,1,11,1],[10,2,11,2],[10,3,11,3],[10,4,11,4],[10,5,11,5],[10,6,11,6],[10,7,11,7]]}
[]
[null,"Information for the Co-financing"]
[]
[null,"Total (EUR)",{"$f":"SUM(I:I)","v":"#ERROR!"}]
[]
[]
[]
[]
[]
[]
[null,"Partner \nN°","Name of Partner\n(to encode in overview sheet)","Country\n(to encode in overview sheet)","Item*","Source of Co-financing**","Justification***","Amount\nExcluding VAT\n(EUR)","Total\n(EUR)","Check\nData\nEncoding"]
[]
[null,null,{"$f":"IFERROR(IF(VLOOKUP(B13,PartnerN°Ref,2,FALSE)=0,\"\",VLOOKUP(B13,PartnerN°Ref,2,FALSE)),\"\")","v":"#ERROR!"},{"$f":"IFERROR(IF(OR(VLOOKUP(B13,PartnerN°Ref,4,FALSE)=\"Country not found\",VLOOKUP(B13,PartnerN°Ref,3,FALSE)=0),\"\",VLOOKUP(B13,PartnerN°Ref,3,FALSE)),\"\")","v":"#ERROR!"},null,null,null,0.0,{"$f":"IF(J13=\"Error\",0,ROUND(H13,2))","v":"#ERROR!"},{"$f":"IF(OR(COUNTIF(PartnerN°,B13)=0,C13=\"\",COUNTIF(CountryALL,D13)=0,E13=\"\",F13=\"\",G13=\"\",ISNUMBER(H13)=FALSE,IF(ISNUMBER(H13)=TRUE,H13=INT(H13*100)/100=FALSE)),\"Error\",\"\")","v":"#ERROR!"}]
[null,"P1",{"$f":"IFERROR(IF(VLOOKUP(B13,PartnerN°Ref,2,FALSE)=0,\"\",VLOOKUP(B13,PartnerN°Ref,2,FALSE)),\"\")","v":"#ERROR!"},{"$f":"IFERROR(IF(OR(VLOOKUP(B13,PartnerN°Ref,4,FALSE)=\"Country not found\",VLOOKUP(B13,PartnerN°Ref,3,FALSE)=0),\"\",VLOOKUP(B13,PartnerN°Ref,3,FALSE)),\"\")","v":"#ERROR!"},"staff costs","Organisation's own resources","Estates, overheads and real staff costs vs. Unit costs (10%)",8800.0,"#ERROR!",{"$f":"IF(OR(COUNTIF(PartnerN°,B13)=0,C13=\"\",COUNTIF(CountryALL,D13)=0,E13=\"\",F13=\"\",G13=\"\",ISNUMBER(H13)=FALSE,IF(ISNUMBER(H13)=TRUE,H13=INT(H13*100)/100=FALSE)),\"Error\",\"\")","v":"#ERROR!"}]
[null,"P2",{"$f":"IFERROR(IF(VLOOKUP(B13,PartnerN°Ref,2,FALSE)=0,\"\",VLOOKUP(B13,PartnerN°Ref,2,FALSE)),\"\")","v":"#ERROR!"},{"$f":"IFERROR(IF(OR(VLOOKUP(B13,PartnerN°Ref,4,FALSE)=\"Country not found\",VLOOKUP(B13,PartnerN°Ref,3,FALSE)=0),\"\",VLOOKUP(B13,PartnerN°Ref,3,FALSE)),\"\")","v":"#ERROR!"},"staff costs","Organisation's own resources","Estates, overheads and real staff costs vs. Unit costs (10%)",6700.0,"#ERROR!",{"$f":"IF(OR(COUNTIF(PartnerN°,B13)=0,C13=\"\",COUNTIF(CountryALL,D13)=0,E13=\"\",F13=\"\",G13=\"\",ISNUMBER(H13)=FALSE,IF(ISNUMBER(H13)=TRUE,H13=INT(H13*100)/100=FALSE)),\"Error\",\"\")","v":"#ERROR!"}]
[null,"P3",{"$f":"IFERROR(IF(VLOOKUP(B13,PartnerN°Ref,2,FALSE)=0,\"\",VLOOKUP(B13,PartnerN°Ref,2,FALSE)),\"\")","v":"#ERROR!"},{"$f":"IFERROR(IF(OR(VLOOKUP(B13,PartnerN°Ref,4,FALSE)=\"Country not found\",VLOOKUP(B13,PartnerN°Ref,3,FALSE)=0),\"\",VLOOKUP(B13,PartnerN°Ref,3,FALSE)),\"\")","v":"#ERROR!"},"staff costs","Organisation's own resources","Estates, overheads and real staff costs vs. Unit costs (10%)",7000.0,"#ERROR!",{"$f":"IF(OR(COUNTIF(PartnerN°,B13)=0,C13=\"\",COUNTIF(CountryALL,D13)=0,E13=\"\",F13=\"\",G13=\"\",ISNUMBER(H13)=FALSE,IF(ISNUMBER(H13)=TRUE,H13=INT(H13*100)/100=FALSE)),\"Error\",\"\")","v":"#ERROR!"}]
[null,"P4",{"$f":"IFERROR(IF(VLOOKUP(B13,PartnerN°Ref,2,FALSE)=0,\"\",VLOOKUP(B13,PartnerN°Ref,2,FALSE)),\"\")","v":"#ERROR!"},{"$f":"IFERROR(IF(OR(VLOOKUP(B13,PartnerN°Ref,4,FALSE)=\"Country not found\",VLOOKUP(B13,PartnerN°Ref,3,FALSE)=0),\"\",VLOOKUP(B13,PartnerN°Ref,3,FALSE)),\"\")","v":"#ERROR!"},"staff costs","Organisation's own resources","Estates, overheads and real staff costs vs. Unit costs (10%)",6900.0,"#ERROR!",{"$f":"IF(OR(COUNTIF(PartnerN°,B13)=0,C13=\"\",COUNTIF(CountryALL,D13)=0,E13=\"\",F13=\"\",G13=\"\",ISNUMBER(H13)=FALSE,IF(ISNUMBER(H13)=TRUE,H13=INT(H13*100)/100=FALSE)),\"Error\",\"\")","v":"#ERROR!"}]
[null,"P5",{"$f":"IFERROR(IF(VLOOKUP(B13,PartnerN°Ref,2,FALSE)=0,\"\",VLOOKUP(B13,PartnerN°Ref,2,FALSE)),\"\")","v":"#ERROR!"},{"$f":"IFERROR(IF(OR(VLOOKUP(B13,PartnerN°Ref,4,FALSE)=\"Country not found\",VLOOKUP(B13,PartnerN°Ref,3,FALSE)=0),\"\",VLOOKUP(B13,PartnerN°Ref,3,FALSE)),\"\")","v":"#ERROR!"},"staff costs","Organisation's own resources","Estates, overheads and real staff costs vs. Unit costs (10%)",6900.0,"#ERROR!",{"$f":"IF(OR(COUNTIF(PartnerN°,B13)=0,C13=\"\",COUNTIF(CountryALL,D13)=0,E13=\"\",F13=\"\",G13=\"\",ISNUMBER(H13)=FALSE,IF(ISNUMBER(H13)=TRUE,H13=INT(H13*100)/100=FALSE)),\"Error\",\"\")","v":"#ERROR!"}]
[null,"P6",{"$f":"IFERROR(IF(VLOOKUP(B13,PartnerN°Ref,2,FALSE)=0,\"\",VLOOKUP(B13,PartnerN°Ref,2,FALSE)),\"\")","v":"#ERROR!"},{"$f":"IFERROR(IF(OR(VLOOKUP(B13,PartnerN°Ref,4,FALSE)=\"Country not found\",VLOOKUP(B13,PartnerN°Ref,3,FALSE)=0),\"\",VLOOKUP(B13,PartnerN°Ref,3,FALSE)),\"\")","v":"#ERROR!"},"staff costs","Organisation's own resources","Estates, overheads and real staff costs vs. Unit costs (10%)",7400.0,"#ERROR!",{"$f":"IF(OR(COUNTIF(PartnerN°,B13)=0,C13=\"\",COUNTIF(CountryALL,D13)=0,E13=\"\",F13=\"\",G13=\"\",ISNUMBER(H13)=FALSE,IF(ISNUMBER(H13)=TRUE,H13=INT(H13*100)/100=FALSE)),\"Error\",\"\")","v":"#ERROR!"}]
[null,"P7",{"$f":"IFERROR(IF(VLOOKUP(B13,PartnerN°Ref,2,FALSE)=0,\"\",VLOOKUP(B13,PartnerN°Ref,2,FALSE)),\"\")","v":"#ERROR!"},{"$f":"IFERROR(IF(OR(VLOOKUP(B13,PartnerN°Ref,4,FALSE)=\"Country not found\",VLOOKUP(B13,PartnerN°Ref,3,FALSE)=0),\"\",VLOOKUP(B13,PartnerN°Ref,3,FALSE)),\"\")","v":"#ERROR!"},"staff costs","Organisation's own resources","Estates, overheads and real staff costs vs. Unit costs (10%)",7500.0,"#ERROR!",{"$f":"IF(OR(COUNTIF(PartnerN°,B13)=0,C13=\"\",COUNTIF(CountryALL,D13)=0,E13=\"\",F13=\"\",G13=\"\",ISNUMBER(H13)=FALSE,IF(ISNUMBER(H13)=TRUE,H13=INT(H13*100)/100=FALSE)),\"Error\",\"\")","v":"#ERROR!"}]
[null,"P8",{"$f":"IFERROR(IF(VLOOKUP(B13,PartnerN°Ref,2,FALSE)=0,\"\",VLOOKUP(B13,PartnerN°Ref,2,FALSE)),\"\")","v":"#ERROR!"},{"$f":"IFERROR(IF(OR(VLOOKUP(B13,PartnerN°Ref,4,FALSE)=\"Country not found\",VLOOKUP(B13,PartnerN°Ref,3,FALSE)=0),\"\",VLOOKUP(B13,PartnerN°Ref,3,FALSE)),\"\")","v":"#ERROR!"},"staff costs","Organisation's own resources","Estates, overheads and real staff costs vs. Unit costs (10%)",7000.0,"#ERROR!",{"$f":"IF(OR(COUNTIF(PartnerN°,B13)=0,C13=\"\",COUNTIF(CountryALL,D13)=0,E13=\"\",F13=\"\",G13=\"\",ISNUMBER(H13)=FALSE,IF(ISNUMBER(H13)=TRUE,H13=INT(H13*100)/100=FALSE)),\"Error\",\"\")","v":"#ERROR!"}]
[null,"P9",{"$f":"IFERROR(IF(VLOOKUP(B13,PartnerN°Ref,2,FALSE)=0,\"\",VLOOKUP(B13,PartnerN°Ref,2,FALSE)),\"\")","v":"#ERROR!"},{"$f":"IFERROR(IF(OR(VLOOKUP(B13,PartnerN°Ref,4,FALSE)=\"Country not found\",VLOOKUP(B13,PartnerN°Ref,3,FALSE)=0),\"\",VLOOKUP(B13,PartnerN°Ref,3,FALSE)),\"\")","v":"#ERROR!"},"staff costs","Organisation's own resources","Estates, overheads and real staff costs vs. Unit costs (10%)",7500.0,"#ERROR!",{"$f":"IF(OR(COUNTIF(PartnerN°,B13)=0,C13=\"\",COUNTIF(CountryALL,D13)=0,E13=\"\",F13=\"\",G13=\"\",ISNUMBER(H13)=FALSE,IF(ISNUMBER(H13)=TRUE,H13=INT(H13*100)/100=FALSE)),\"Error\",\"\")","v":"#ERROR!"}]
[null,"P10",{"$f":"IFERROR(IF(VLOOKUP(B13,PartnerN°Ref,2,FALSE)=0,\"\",VLOOKUP(B13,PartnerN°Ref,2,FALSE)),\"\")","v":"#ERROR!"},{"$f":"IFERROR(IF(OR(VLOOKUP(B13,PartnerN°Ref,4,FALSE)=\"Country not found\",VLOOKUP(B13,PartnerN°Ref,3,FALSE)=0),\"\",VLOOKUP(B13,PartnerN°Ref,3,FALSE)),\"\")","v":"#ERROR!"},"staff costs","Organisation's own resources","Estates, overheads and real staff costs vs. Unit costs (10%)",7200.0,"#ERROR!",{"$f":"IF(OR(COUNTIF(PartnerN°,B13)=0,C13=\"\",COUNTIF(CountryALL,D13)=0,E13=\"\",F13=\"\",G13=\"\",ISNUMBER(H13)=FALSE,IF(ISNUMBER(H13)=TRUE,H13=INT(H13*100)/100=FALSE)),\"Error\",\"\")","v":"#ERROR!"}]
[null,"P11",{"$f":"IFERROR(IF(VLOOKUP(B13,PartnerN°Ref,2,FALSE)=0,\"\",VLOOKUP(B13,PartnerN°Ref,2,FALSE)),\"\")","v":"#ERROR!"},{"$f":"IFERROR(IF(OR(VLOOKUP(B13,PartnerN°Ref,4,FALSE)=\"Country not found\",VLOOKUP(B13,PartnerN°Ref,3,FALSE)=0),\"\",VLOOKUP(B13,PartnerN°Ref,3,FALSE)),\"\")","v":"#ERROR!"},"staff costs","Organisation's own resources","Estates, overheads and real staff costs vs. Unit costs (10%)",7300.0,"#ERROR!",{"$f":"IF(OR(COUNTIF(PartnerN°,B13)=0,C13=\"\",COUNTIF(CountryALL,D13)=0,E13=\"\",F13=\"\",G13=\"\",ISNUMBER(H13)=FALSE,IF(ISNUMBER(H13)=TRUE,H13=INT(H13*100)/100=FALSE)),\"Error\",\"\")","v":"#ERROR!"}]
[null,"P12",{"$f":"IFERROR(IF(VLOOKUP(B13,PartnerN°Ref,2,FALSE)=0,\"\",VLOOKUP(B13,PartnerN°Ref,2,FALSE)),\"\")","v":"#ERROR!"},{"$f":"IFERROR(IF(OR(VLOOKUP(B13,PartnerN°Ref,4,FALSE)=\"Country not found\",VLOOKUP(B13,PartnerN°Ref,3,FALSE)=0),\"\",VLOOKUP(B13,PartnerN°Ref,3,FALSE)),\"\")","v":"#ERROR!"},"staff costs","Organisation's own resources","Estates, overheads and real staff costs vs. Unit costs (10%)",4200.0,"#ERROR!",{"$f":"IF(OR(COUNTIF(PartnerN°,B13)=0,C13=\"\",COUNTIF(CountryALL,D13)=0,E13=\"\",F13=\"\",G13=\"\",ISNUMBER(H13)=FALSE,IF(ISNUMBER(H13)=TRUE,H13=INT(H13*100)/100=FALSE)),\"Error\",\"\")","v":"#ERROR!"}]
[]
[null,"* e.g.: Equipment,  Staff costs, travel costs and/or costs of stay, printing & publishing"]
[null,"** e.g.: governmental grant, organisation/institution's own resources"]
[null,"*** e.g.: Preparation of training materials - 2 days x 7,5 hours x 3 persons x € 25"]

{"sheet":"Breakdown & Project Funding","index":7,"n_rows":77,"n_cols":9,"rows_kept":77,"cut":false,"hidden":false,"merged":[[60,7,60,8],[61,7,61,8],[62,7,62,8],[63,7,63,8],[64,7,64,8],[65,7,65,8],[66,7,66,8],[74,7,74,8],[75,7,75,8],[76,7,76,8],[67,7,67,8],[68,7,68,8],[69,7,69,8],[70,7,70,8],[71,7,71,8],[72,7,72,8],[73,7,73,8],[0,1,0,8],[1,1,1,8],[2,1,2,8],[10,1,10,8],[11,1,11,8],[12,1,12,8],[17,1,17,8],[18,1,18,8],[19,1,19,8],[20,7,20,8],[21,7,21,8],[22,7,22,8],[23,7,23,8],[24,7,24,8],[25,7,25,8],[26,7,26,8],[27,7,27,8],[28,7,28,8],[29,7,29,8],[30,7,30,8],[31,7,31,8],[32,7,32,8],[33,7,33,8],[34,7,34,8],[35,7,35,8],[36,7,36,8],[37,7,37,8],[38,7,38,8],[39,7,39,8],[40,7,40,8],[41,7,41,8],[42,7,42,8],[43,7,43,8],[44,7,44,8],[45,7,45,8],[46,7,46,8],[47,7,47,8],[48,7,48,8],[49,7,49,8],[50,7,50,8],[51,7,51,8],[52,7,52,8],[53,7,53,8],[54,7,54,8],[55,7,55,8],[56,7,56,8],[57,7,57,8],[58,7,58,8],[59,7,59,8]]}
[]
[null,"Budget Breakdown by Workpackage / Budget Headings"]
[]
[null,"Work\nPackage","1. Staff \nCosts","2. Travel \nCosts","3. Costs \nof Stay","4. Equipment\nCosts","5. Subcontracting\nCosts","6. Exceptional Costs","Total\n(EUR)"]
[null,{"$f":"'Unit Costs & Funding Rule'!P10","v":"Preparation"},{"$f":"SUMIF('1. Staff costs'!B:B,B5,'1. Staff costs'!S:S)","v":"#ERROR!"},{"$f":"SUMIF(' 2-3-6. Travel&Costs of Stay'!B:B,B5,' 2-3-6. Travel&Costs of Stay'!O:O)","v":"#ERROR!"},{"$f":"SUMIF(' 2-3-6. Travel&Costs of Stay'!B:B,B5,' 2-3-6. Travel&Costs of Stay'!P:P)","v":"#ERROR!"},{"$f":"SUMIF('4. Equipment Costs'!B:B,B5,'4. Equipment Costs'!H:H)","v":0},{"$f":"SUMIF('5. Subcontracting Costs'!B:B,B5,'5. Subcontracting Costs'!H:H)","v":"#ERROR!"},{"$f":"SUMIF(' 2-3-6. Travel&Costs of Stay'!B:B,B5,' 2-3-6. Travel&Costs of Stay'!N:N)","v":0},{"$f":"SUM(C5:H5)","v":"#ERROR!"}]
[null,{"$f":"'Unit Costs & Funding Rule'!P11","v":"Development"},{"$f":"SUMIF('1. Staff costs'!B:B,B6,'1. Staff costs'!S:S)","v":"#ERROR!"},{"$f":"SUMIF(' 2-3-6. Travel&Costs of Stay'!B:B,B6,' 2-3-6. Travel&Costs of Stay'!O:O)","v":"#ERROR!"},{"$f":"SUMIF(' 2-3-6. Travel&Costs of Stay'!B:B,B6,' 2-3-6. Travel&Costs of Stay'!P:P)","v":"#ERROR!"},{"$f":"SUMIF('4. Equipment Costs'!B:B,B6,'4. Equipment Costs'!H:H)","v":"#ERROR!"},{"$f":"SUMIF('5. Subcontracting Costs'!B:B,B6,'5. Subcontracting Costs'!H:H)","v":"#ERROR!"},{"$f":"SUMIF(' 2-3-6. Travel&Costs of Stay'!B:B,B6,' 2-3-6. Travel&Costs of Stay'!N:N)","v":0},"#ERROR!"]
[null,{"$f":"'Unit Costs & Funding Rule'!P12","v":"Quality Plan"},{"$f":"SUMIF('1. Staff costs'!B:B,B7,'1. Staff costs'!S:S)","v":"#ERROR!"},{"$f":"SUMIF(' 2-3-6. Travel&Costs of Stay'!B:B,B7,' 2-3-6. Travel&Costs of Stay'!O:O)","v":0},{"$f":"SUMIF(' 2-3-6. Travel&Costs of Stay'!B:B,B7,' 2-3-6. Travel&Costs of Stay'!P:P)","v":0},{"$f":"SUMIF('4. Equipment Costs'!B:B,B7,'4. Equipment Costs'!H:H)","v":0},{"$f":"SUMIF('5. Subcontracting Costs'!B:B,B7,'5. Subcontracting Costs'!H:H)","v":"#ERROR!"},{"$f":"SUMIF(' 2-3-6. Travel&Costs of Stay'!B:B,B7,' 2-3-6. Travel&Costs of Stay'!N:N)","v":0},"#ERROR!"]
[null,{"$f":"'Unit Costs & Funding Rule'!P13","v":"Dissemination & Exploitation"},{"$f":"SUMIF('1. Staff costs'!B:B,B8,'1. Staff costs'!S:S)","v":"#ERROR!"},{"$f":"SUMIF(' 2-3-6. Travel&Costs of Stay'!B:B,B8,' 2-3-6. Travel&Costs of Stay'!O:O)","v":"#ERROR!"},{"$f":"SUMIF(' 2-3-6. Travel&Costs of Stay'!B:B,B8,' 2-3-6. Travel&Costs of Stay'!P:P)","v":"#ERROR!"},{"$f":"SUMIF('4. Equipment Costs'!B:B,B8,'4. Equipment Costs'!H:H)","v":0},{"$f":"SUMIF('5. Subcontracting Costs'!B:B,B8,'5. Subcontracting Costs'!H:H)","v":"#ERROR!"},{"$f":"SUMIF(' 2-3-6. Travel&Costs of Stay'!B:B,B8,' 2-3-6. Travel&Costs of Stay'!N:N)","v":0},"#ERROR!"]
[null,{"$f":"'Unit Costs & Funding Rule'!P14","v":"Management"},{"$f":"SUMIF('1. Staff costs'!B:B,B9,'1. Staff costs'!S:S)","v":"#ERROR!"},{"$f":"SUMIF(' 2-3-6. Travel&Costs of Stay'!B:B,B9,' 2-3-6. Travel&Costs of Stay'!O:O)","v":"#ERROR!"},{"$f":"SUMIF(' 2-3-6. Travel&Costs of Stay'!B:B,B9,' 2-3-6. Travel&Costs of Stay'!P:P)","v":"#ERROR!"},{"$f":"SUMIF('4. Equipment Costs'!B:B,B9,'4. Equipment Costs'!H:H)","v":0},{"$f":"SUMIF('5. Subcontracting Costs'!B:B,B9,'5. Subcontracting Costs'!H:H)","v":"#ERROR!"},{"$f":"SUMIF(' 2-3-6. Travel&Costs of Stay'!B:B,B9,' 2-3-6. Travel&Costs of Stay'!N:N)","v":0},"#ERROR!"]
[null,"Total",{"$f":"SUM(C5:C9)","v":"#ERROR!"},"#ERROR!","#ERROR!","#ERROR!","#ERROR!",0,"#ERROR!"]
[]
[null,"Budget Breakdown by Programme or Partner Countries / Budget Headings"]
[]
[null,"Countries","1. Staff \nCosts","2. Travel \nCosts","3. Costs \nof Stay","4. Equipment\nCosts","5. Subcontracting\nCosts","6. Exceptional Costs","Total\n(EUR)"]
[null,"Programme Countries",{"$f":"SUMIF(Overview!$E$27:$E$81,B15,Overview!$F$27:$F$81)","v":"#ERROR!"},{"$f":"SUMIF(Overview!$E$27:$E$81,B15,Overview!$G$27:$G$81)","v":"#ERROR!"},{"$f":"SUMIF(Overview!$E$27:$E$81,B15,Overview!$H$27:$H$81)","v":"#ERROR!"},{"$f":"SUMIF(Overview!$E$27:$E$81,B15,Overview!$I$27:$I$81)","v":0},{"$f":"SUMIF(Overview!$E$27:$E$81,B15,Overview!$J$27:$J$81)","v":"#ERROR!"},{"$f":"SUMIF(Overview!$E$27:$E$81,B15,Overview!$K$27:$K$81)","v":0},{"$f":"SUM(C15:H15)","v":"#ERROR!"}]
[null,"Partner Countries",{"$f":"SUMIF(Overview!$E$27:$E$81,B16,Overview!$F$27:$F$81)","v":"#ERROR!"},{"$f":"SUMIF(Overview!$E$27:$E$81,B16,Overview!$G$27:$G$81)","v":"#ERROR!"},{"$f":"SUMIF(Overview!$E$27:$E$81,B16,Overview!$H$27:$H$81)","v":"#ERROR!"},{"$f":"SUMIF(Overview!$E$27:$E$81,B16,Overview!$I$27:$I$81)","v":"#ERROR!"},{"$f":"SUMIF(Overview!$E$27:$E$81,B16,Overview!$J$27:$J$81)","v":"#ERROR!"},{"$f":"SUMIF(Overview!$E$27:$E$81,B16,Overview!$K$27:$K$81)","v":0},"#ERROR!"]
[null,"Total",{"$f":"SUM(C15:C16)","v":"#ERROR!"},"#ERROR!","#ERROR!","#ERROR!","#ERROR!",0,"#ERROR!"]
[]
[null,"Budget Breakdown by Partner / Work Package"]
[]
[null,"Partner\nN°",{"$f":"'Unit Costs & Funding Rule'!P10","v":"Preparation"},{"$f":"'Unit Costs & Funding Rule'!P11","v":"Development"},{"$f":"'Unit Costs & Funding Rule'!P12","v":"Quality Plan"},{"$f":"'Unit Costs & Funding Rule'!P13","v":"Dissemination & Exploitation"},{"$f":"'Unit Costs & Funding Rule'!P14","v":"Management"},"Total\n(EUR)"]
[null,"P1",{"$f":"SUMIFS('1. Staff costs'!S:S,'1. Staff costs'!C:C,B22,'1. Staff costs'!B:B,$C$21)\n+SUMIFS(' 2-3-6. Travel&Costs of Stay'!O:O,' 2-3-6. Travel&Costs of Stay'!C:C,B22,' 2-3-6. Travel&Costs of Stay'!B:B,$C$21)\n+SUMIFS(' 2-3-6. Travel&Costs of Stay'!P:P,' 2-3-6. Travel&Costs of Stay'!C:C,B22,' 2-3-6. Travel&Costs of Stay'!B:B,$C$21)\n+SUMIFS('4. Equipment Costs'!H:H,'4. Equipment Costs'!C:C,B22,'4. Equipment Costs'!B:B,$C$21)\n+SUMIFS('5. Subcontracting Costs'!H:H,'5. Subcontracting Costs'!C:C,B22,'5. Subcontracting Costs'!B:B,$C$21)\n+SUMIFS(' 2-3-6. Travel&Costs of Stay'!N:N,' 2-3-6. Travel&Costs of Stay'!C:C,B22,' 2-3-6. Travel&Costs of Stay'!B:B,$C$21)","v":"#ERROR!"},{"$f":"SUMIFS('1. Staff costs'!S:S,'1. Staff costs'!C:C,B22,'1. Staff costs'!B:B,$D$21)\n+SUMIFS(' 2-3-6. Travel&Costs of Stay'!O:O,' 2-3-6. Travel&Costs of Stay'!C:C,B22,' 2-3-6. Travel&Costs of Stay'!B:B,$D$21)\n+SUMIFS(' 2-3-6. Travel&Costs of Stay'!P:P,' 2-3-6. Travel&Costs of Stay'!C:C,B22,' 2-3-6. Travel&Costs of Stay'!B:B,$D$21)\n+SUMIFS('4. Equipment Costs'!H:H,'4. Equipment Costs'!C:C,B22,'4. Equipment Costs'!B:B,$D$21)\n+SUMIFS('5. Subcontracting Costs'!H:H,'5. Subcontracting Costs'!C:C,B22,'5. Subcontracting Costs'!B:B,$D$21)\n+SUMIFS(' 2-3-6. Travel&Costs of Stay'!N:N,' 2-3-6. Travel&Costs of Stay'!C:C,B22,' 2-3-6. Travel&Costs of Stay'!B:B,$D$21)","v":"#ERROR!"},{"$f":"SUMIFS('1. Staff costs'!S:S,'1. Staff costs'!C:C,B22,'1. Staff costs'!B:B,$E$21)\n+SUMIFS(' 2-3-6. Travel&Costs of Stay'!O:O,' 2-3-6. Travel&Costs of Stay'!C:C,B22,' 2-3-6. Travel&Costs of Stay'!B:B,$E$21)\n+SUMIFS(' 2-3-6. Travel&Costs of Stay'!P:P,' 2-3-6. Travel&Costs of Stay'!C:C,B22,' 2-3-6. Travel&Costs of Stay'!B:B,$E$21)\n+SUMIFS('4. Equipment Costs'!H:H,'4. Equipment Costs'!C:C,B22,'4. Equipment Costs'!B:B,$E$21)\n+SUMIFS('5. Subcontracting Costs'!H:H,'5. Subcontracting Costs'!C:C,B22,'5. Subcontracting Costs'!B:B,$E$21)\n+SUMIFS(' 2-3-6. Travel&Costs of Stay'!N:N,' 2-3-6. Travel&Costs of Stay'!C:C,B22,' 2-3-6. Travel&Costs of Stay'!B:B,$E$21)","v":"#ERROR!"},{"$f":"SUMIFS('1. Staff costs'!S:S,'1. Staff costs'!C:C,B22,'1. Staff costs'!B:B,$F$21)\n+SUMIFS(' 2-3-6. Travel&Costs of Stay'!O:O,' 2-3-6. Travel&Costs of Stay'!C:C,B22,' 2-3-6. Travel&Costs of Stay'!B:B,$F$21)\n+SUMIFS(' 2-3-6. Travel&Costs of Stay'!P:P,' 2-3-6. Travel&Costs of Stay'!C:C,B22,' 2-3-6. Travel&Costs of Stay'!B:B,$F$21)\n+SUMIFS('4. Equipment Costs'!H:H,'4. Equipment Costs'!C:C,B22,'4. Equipment Costs'!B:B,$F$21)\n+SUMIFS('5. Subcontracting Costs'!H:H,'5. Subcontracting Costs'!C:C,B22,'5. Subcontracting Costs'!B:B,$F$21)\n+SUMIFS(' 2-3-6. Travel&Costs of Stay'!N:N,' 2-3-6. Travel&Costs of Stay'!C:C,B22,' 2-3-6. Travel&Costs of Stay'!B:B,$F$21)","v":"#ERROR!"},{"$f":"SUMIFS('1. Staff costs'!S:S,'1. Staff costs'!C:C,B22,'1. Staff costs'!B:B,$G$21)\n+SUMIFS(' 2-3-6. Travel&Costs of Stay'!O:O,' 2-3-6. Travel&Costs of Stay'!C:C,B22,' 2-3-6. Travel&Costs of Stay'!B:B,$G$21)\n+SUMIFS(' 2-3-6. Travel&Costs of Stay'!P:P,' 2-3-6. Travel&Costs of Stay'!C:C,B22,' 2-3-6. Travel&Costs of Stay'!B:B,$G$21)\n+SUMIFS('4. Equipment Costs'!H:H,'4. Equipment Costs'!C:C,B22,'4. Equipment Costs'!B:B,$G$21)\n+SUMIFS('5. Subcontracting Costs'!H:H,'5. Subcontracting Costs'!C:C,B22,'5. Subcontracting Costs'!B:B,$G$21)\n+SUMIFS(' 2-3-6. Travel&Costs of Stay'!N:N,' 2-3-6. Travel&Costs of Stay'!C:C,B22,' 2-3-6. Travel&Costs of Stay'!B:B,$G$21)","v":"#ERROR!"},{"$f":"SUM(C22:G22)","v":"#ERROR!"}]
[null,"P2",{"$f":"SUMIFS('1. Staff costs'!S:S,'1. Staff costs'!C:C,B23,'1. Staff costs'!B:B,$C$21)\n+SUMIFS(' 2-3-6. Travel&Costs of Stay'!O:O,' 2-3-6. Travel&Costs of Stay'!C:C,B23,' 2-3-6. Travel&Costs of Stay'!B:B,$C$21)\n+SUMIFS(' 2-3-6. Travel&Costs of Stay'!P:P,' 2-3-6. Travel&Costs of Stay'!C:C,B23,' 2-3-6. Travel&Costs of Stay'!B:B,$C$21)\n+SUMIFS('4. Equipment Costs'!H:H,'4. Equipment Costs'!C:C,B23,'4. Equipment Costs'!B:B,$C$21)\n+SUMIFS('5. Subcontracting Costs'!H:H,'5. Subcontracting Costs'!C:C,B23,'5. Subcontracting Costs'!B:B,$C$21)\n+SUMIFS(' 2-3-6. Travel&Costs of Stay'!N:N,' 2-3-6. Travel&Costs of Stay'!C:C,B23,' 2-3-6. Travel&Costs of Stay'!B:B,$C$21)","v":"#ERROR!"},{"$f":"SUMIFS('1. Staff costs'!S:S,'1. Staff costs'!C:C,B23,'1. Staff costs'!B:B,$D$21)\n+SUMIFS(' 2-3-6. Travel&Costs of Stay'!O:O,' 2-3-6. Travel&Costs of Stay'!C:C,B23,' 2-3-6. Travel&Costs of Stay'!B:B,$D$21)\n+SUMIFS(' 2-3-6. Travel&Costs of Stay'!P:P,' 2-3-6. Travel&Costs of Stay'!C:C,B23,' 2-3-6. Travel&Costs of Stay'!B:B,$D$21)\n+SUMIFS('4. Equipment Costs'!H:H,'4. Equipment Costs'!C:C,B23,'4. Equipment Costs'!B:B,$D$21)\n+SUMIFS('5. Subcontracting Costs'!H:H,'5. Subcontracting Costs'!C:C,B23,'5. Subcontracting Costs'!B:B,$D$21)\n+SUMIFS(' 2-3-6. Travel&Costs of Stay'!N:N,' 2-3-6. Travel&Costs of Stay'!C:C,B23,' 2-3-6. Travel&Costs of Stay'!B:B,$D$21)","v":"#ERROR!"},{"$f":"SUMIFS('1. Staff costs'!S:S,'1. Staff costs'!C:C,B23,'1. Staff costs'!B:B,$E$21)\n+SUMIFS(' 2-3-6. Travel&Costs of Stay'!O:O,' 2-3-6. Travel&Costs of Stay'!C:C,B23,' 2-3-6. Travel&Costs of Stay'!B:B,$E$21)\n+SUMIFS(' 2-3-6. Travel&Costs of Stay'!P:P,' 2-3-6. Travel&Costs of Stay'!C:C,B23,' 2-3-6. Travel&Costs of Stay'!B:B,$E$21)\n+SUMIFS('4. Equipment Costs'!H:H,'4. Equipment Costs'!C:C,B23,'4. Equipment Costs'!B:B,$E$21)\n+SUMIFS('5. Subcontracting Costs'!H:H,'5. Subcontracting Costs'!C:C,B23,'5. Subcontracting Costs'!B:B,$E$21)\n+SUMIFS(' 2-3-6. Travel&Costs of Stay'!N:N,' 2-3-6. Travel&Costs of Stay'!C:C,B23,' 2-3-6. Travel&Costs of Stay'!B:B,$E$21)","v":"#ERROR!"},{"$f":"SUMIFS('1. Staff costs'!S:S,'1. Staff costs'!C:C,B23,'1. Staff costs'!B:B,$F$21)\n+SUMIFS(' 2-3-6. Travel&Costs of Stay'!O:O,' 2-3-6. Travel&Costs of Stay'!C:C,B23,' 2-3-6. Travel&Costs of Stay'!B:B,$F$21)\n+SUMIFS(' 2-3-6. Travel&Costs of Stay'!P:P,' 2-3-6. Travel&Costs of Stay'!C:C,B23,' 2-3-6. Travel&Costs of Stay'!B:B,$F$21)\n+SUMIFS('4. Equipment Costs'!H:H,'4. Equipment Costs'!C:C,B23,'4. Equipment Costs'!B:B,$F$21)\n+SUMIFS('5. Subcontracting Costs'!H:H,'5. Subcontracting Costs'!C:C,B23,'5. Subcontracting Costs'!B:B,$F$21)\n+SUMIFS(' 2-3-6. Travel&Costs of Stay'!N:N,' 2-3-6. Travel&Costs of Stay'!C:C,B23,' 2-3-6. Travel&Costs of Stay'!B:B,$F$21)","v":"#ERROR!"},{"$f":"SUMIFS('1. Staff costs'!S:S,'1. Staff costs'!C:C,B23,'1. Staff costs'!B:B,$G$21)\n+SUMIFS(' 2-3-6. Travel&Costs of Stay'!O:O,' 2-3-6. Travel&Costs of Stay'!C:C,B23,' 2-3-6. Travel&Costs of Stay'!B:B,$G$21)\n+SUMIFS(' 2-3-6. Travel&Costs of Stay'!P:P,' 2-3-6. Travel&Costs of Stay'!C:C,B23,' 2-3-6. Travel&Costs of Stay'!B:B,$G$21)\n+SUMIFS('4. Equipment Costs'!H:H,'4. Equipment Costs'!C:C,B23,'4. Equipment Costs'!B:B,$G$21)\n+SUMIFS('5. Subcontracting Costs'!H:H,'5. Subcontracting Costs'!C:C,B23,'5. Subcontracting Costs'!B:B,$G$21)\n+SUMIFS(' 2-3-6. Travel&Costs of Stay'!N:N,' 2-3-6. Travel&Costs of Stay'!C:C,B23,' 2-3-6. Travel&Costs of Stay'!B:B,$G$21)","v":"#ERROR!"},"#ERROR!"]
[null,"P3",{"$f":"SUMIFS('1. Staff costs'!S:S,'1. Staff costs'!C:C,B24,'1. Staff costs'!B:B,$C$21)\n+SUMIFS(' 2-3-6. Travel&Costs of Stay'!O:O,' 2-3-6. Travel&Costs of Stay'!C:C,B24,' 2-3-6. Travel&Costs of Stay'!B:B,$C$21)\n+SUMIFS(' 2-3-6. Travel&Costs of Stay'!P:P,' 2-3-6. Travel&Costs of Stay'!C:C,B24,' 2-3-6. Travel&Costs of Stay'!B:B,$C$21)\n+SUMIFS('4. Equipment Costs'!H:H,'4. Equipment Costs'!C:C,B24,'4. Equipment Costs'!B:B,$C$21)\n+SUMIFS('5. Subcontracting Costs'!H:H,'5. Subcontracting Costs'!C:C,B24,'5. Subcontracting Costs'!B:B,$C$21)\n+SUMIFS(' 2-3-6. Travel&Costs of Stay'!N:N,' 2-3-6. Travel&Costs of Stay'!C:C,B24,' 2-3-6. Travel&Costs of Stay'!B:B,$C$21)","v":"#ERROR!"},{"$f":"SUMIFS('1. Staff costs'!S:S,'1. Staff costs'!C:C,B24,'1. Staff costs'!B:B,$D$21)\n+SUMIFS(' 2-3-6. Travel&Costs of Stay'!O:O,' 2-3-6. Travel&Costs of Stay'!C:C,B24,' 2-3-6. Travel&Costs of Stay'!B:B,$D$21)\n+SUMIFS(' 2-3-6. Travel&Costs of Stay'!P:P,' 2-3-6. Travel&Costs of Stay'!C:C,B24,' 2-3-6. Travel&Costs of Stay'!B:B,$D$21)\n+SUMIFS('4. Equipment Costs'!H:H,'4. Equipment Costs'!C:C,B24,'4. Equipment Costs'!B:B,$D$21)\n+SUMIFS('5. Subcontracting Costs'!H:H,'5. Subcontracting Costs'!C:C,B24,'5. Subcontracting Costs'!B:B,$D$21)\n+SUMIFS(' 2-3-6. Travel&Costs of Stay'!N:N,' 2-3-6. Travel&Costs of Stay'!C:C,B24,' 2-3-6. Travel&Costs of Stay'!B:B,$D$21)","v":"#ERROR!"},{"$f":"SUMIFS('1. Staff costs'!S:S,'1. Staff costs'!C:C,B24,'1. Staff costs'!B:B,$E$21)\n+SUMIFS(' 2-3-6. Travel&Costs of Stay'!O:O,' 2-3-6. Travel&Costs of Stay'!C:C,B24,' 2-3-6. Travel&Costs of Stay'!B:B,$E$21)\n+SUMIFS(' 2-3-6. Travel&Costs of Stay'!P:P,' 2-3-6. Travel&Costs of Stay'!C:C,B24,' 2-3-6. Travel&Costs of Stay'!B:B,$E$21)\n+SUMIFS('4. Equipment Costs'!H:H,'4. Equipment Costs'!C:C,B24,'4. Equipment Costs'!B:B,$E$21)\n+SUMIFS('5. Subcontracting Costs'!H:H,'5. Subcontracting Costs'!C:C,B24,'5. Subcontracting Costs'!B:B,$E$21)\n+SUMIFS(' 2-3-6. Travel&Costs of Stay'!N:N,' 2-3-6. Travel&Costs of Stay'!C:C,B24,' 2-3-6. Travel&Costs of Stay'!B:B,$E$21)","v":"#ERROR!"},{"$f":"SUMIFS('1. Staff costs'!S:S,'1. Staff costs'!C:C,B24,'1. Staff costs'!B:B,$F$21)\n+SUMIFS(' 2-3-6. Travel&Costs of Stay'!O:O,' 2-3-6. Travel&Costs of Stay'!C:C,B24,' 2-3-6. Travel&Costs of Stay'!B:B,$F$21)\n+SUMIFS(' 2-3-6. Travel&Costs of Stay'!P:P,' 2-3-6. Travel&Costs of Stay'!C:C,B24,' 2-3-6. Travel&Costs of Stay'!B:B,$F$21)\n+SUMIFS('4. Equipment Costs'!H:H,'4. Equipment Costs'!C:C,B24,'4. Equipment Costs'!B:B,$F$21)\n+SUMIFS('5. Subcontracting Costs'!H:H,'5. Subcontracting Costs'!C:C,B24,'5. Subcontracting Costs'!B:B,$F$21)\n+SUMIFS(' 2-3-6. Travel&Costs of Stay'!N:N,' 2-3-6. Travel&Costs of Stay'!C:C,B24,' 2-3-6. Travel&Costs of Stay'!B:B,$F$21)","v":"#ERROR!"},{"$f":"SUMIFS('1. Staff costs'!S:S,'1. Staff costs'!C:C,B24,'1. Staff costs'!B:B,$G$21)\n+SUMIFS(' 2-3-6. Travel&Costs of Stay'!O:O,' 2-3-6. Travel&Costs of Stay'!C:C,B24,' 2-3-6. Travel&Costs of Stay'!B:B,$G$21)\n+SUMIFS(' 2-3-6. Travel&Costs of Stay'!P:P,' 2-3-6. Travel&Costs of Stay'!C:C,B24,' 2-3-6. Travel&Costs of Stay'!B:B,$G$21)\n+SUMIFS('4. Equipment Costs'!H:H,'4. Equipment Costs'!C:C,B24,'4. Equipment Costs'!B:B,$G$21)\n+SUMIFS('5. Subcontracting Costs'!H:H,'5. Subcontracting Costs'!C:C,B24,'5. Subcontracting Costs'!B:B,$G$21)\n+SUMIFS(' 2-3-6. Travel&Costs of Stay'!N:N,' 2-3-6. Travel&Costs of Stay'!C:C,B24,' 2-3-6. Travel&Costs of Stay'!B:B,$G$21)","v":"#ERROR!"},"#ERROR!"]
[null,"P4",{"$f":"SUMIFS('1. Staff costs'!S:S,'1. Staff costs'!C:C,B25,'1. Staff costs'!B:B,$C$21)\n+SUMIFS(' 2-3-6. Travel&Costs of Stay'!O:O,' 2-3-6. Travel&Costs of Stay'!C:C,B25,' 2-3-6. Travel&Costs of Stay'!B:B,$C$21)\n+SUMIFS(' 2-3-6. Travel&Costs of Stay'!P:P,' 2-3-6. Travel&Costs of Stay'!C:C,B25,' 2-3-6. Travel&Costs of Stay'!B:B,$C$21)\n+SUMIFS('4. Equipment Costs'!H:H,'4. Equipment Costs'!C:C,B25,'4. Equipment Costs'!B:B,$C$21)\n+SUMIFS('5. Subcontracting Costs'!H:H,'5. Subcontracting Costs'!C:C,B25,'5. Subcontracting Costs'!B:B,$C$21)\n+SUMIFS(' 2-3-6. Travel&Costs of Stay'!N:N,' 2-3-6. Travel&Costs of Stay'!C:C,B25,' 2-3-6. Travel&Costs of Stay'!B:B,$C$21)","v":"#ERROR!"},{"$f":"SUMIFS('1. Staff costs'!S:S,'1. Staff costs'!C:C,B25,'1. Staff costs'!B:B,$D$21)\n+SUMIFS(' 2-3-6. Travel&Costs of Stay'!O:O,' 2-3-6. Travel&Costs of Stay'!C:C,B25,' 2-3-6. Travel&Costs of Stay'!B:B,$D$21)\n+SUMIFS(' 2-3-6. Travel&Costs of Stay'!P:P,' 2-3-6. Travel&Costs of Stay'!C:C,B25,' 2-3-6. Travel&Costs of Stay'!B:B,$D$21)\n+SUMIFS('4. Equipment Costs'!H:H,'4. Equipment Costs'!C:C,B25,'4. Equipment Costs'!B:B,$D$21)\n+SUMIFS('5. Subcontracting Costs'!H:H,'5. Subcontracting Costs'!C:C,B25,'5. Subcontracting Costs'!B:B,$D$21)\n+SUMIFS(' 2-3-6. Travel&Costs of Stay'!N:N,' 2-3-6. Travel&Costs of Stay'!C:C,B25,' 2-3-6. Travel&Costs of Stay'!B:B,$D$21)","v":"#ERROR!"},{"$f":"SUMIFS('1. Staff costs'!S:S,'1. Staff costs'!C:C,B25,'1. Staff costs'!B:B,$E$21)\n+SUMIFS(' 2-3-6. Travel&Costs of Stay'!O:O,' 2-3-6. Travel&Costs of Stay'!C:C,B25,' 2-3-6. Travel&Costs of Stay'!B:B,$E$21)\n+SUMIFS(' 2-3-6. Travel&Costs of Stay'!P:P,' 2-3-6. Travel&Costs of Stay'!C:C,B25,' 2-3-6. Travel&Costs of Stay'!B:B,$E$21)\n+SUMIFS('4. Equipment Costs'!H:H,'4. Equipment Costs'!C:C,B25,'4. Equipment Costs'!B:B,$E$21)\n+SUMIFS('5. Subcontracting Costs'!H:H,'5. Subcontracting Costs'!C:C,B25,'5. Subcontracting Costs'!B:B,$E$21)\n+SUMIFS(' 2-3-6. Travel&Costs of Stay'!N:N,' 2-3-6. Travel&Costs of Stay'!C:C,B25,' 2-3-6. Travel&Costs of Stay'!B:B,$E$21)","v":"#ERROR!"},{"$f":"SUMIFS('1. Staff costs'!S:S,'1. Staff costs'!C:C,B25,'1. Staff costs'!B:B,$F$21)\n+SUMIFS(' 2-3-6. Travel&Costs of Stay'!O:O,' 2-3-6. Travel&Costs of Stay'!C:C,B25,' 2-3-6. Travel&Costs of Stay'!B:B,$F$21)\n+SUMIFS(' 2-3-6. Travel&Costs of Stay'!P:P,' 2-3-6. Travel&Costs of Stay'!C:C,B25,' 2-3-6. Travel&Costs of Stay'!B:B,$F$21)\n+SUMIFS('4. Equipment Costs'!H:H,'4. Equipment Costs'!C:C,B25,'4. Equipment Costs'!B:B,$F$21)\n+SUMIFS('5. Subcontracting Costs'!H:H,'5. Subcontracting Costs'!C:C,B25,'5. Subcontracting Costs'!B:B,$F$21)\n+SUMIFS(' 2-3-6. Travel&Costs of Stay'!N:N,' 2-3-6. Travel&Costs of Stay'!C:C,B25,' 2-3-6. Travel&Costs of Stay'!B:B,$F$21)","v":"#ERROR!"},{"$f":"SUMIFS('1. Staff costs'!S:S,'1. Staff costs'!C:C,B25,'1. Staff costs'!B:B,$G$21)\n+SUMIFS(' 2-3-6. Travel&Costs of Stay'!O:O,' 2-3-6. Travel&Costs of Stay'!C:C,B25,' 2-3-6. Travel&Costs of Stay'!B:B,$G$21)\n+SUMIFS(' 2-3-6. Travel&Costs of Stay'!P:P,' 2-3-6. Travel&Costs of Stay'!C:C,B25,' 2-3-6. Travel&Costs of Stay'!B:B,$G$21)\n+SUMIFS('4. Equipment Costs'!H:H,'4. Equipment Costs'!C:C,B25,'4. Equipment Costs'!B:B,$G$21)\n+SUMIFS('5. Subcontracting Costs'!H:H,'5. Subcontracting Costs'!C:C,B25,'5. Subcontracting Costs'!B:B,$G$21)\n+SUMIFS(' 2-3-6. Travel&Costs of Stay'!N:N,' 2-3-6. Travel&Costs of Stay'!C:C,B25,' 2-3-6. Travel&Costs of Stay'!B:B,$G$21)","v":"#ERROR!"},"#ERROR!"]
[null,"P5",{"$f":"SUMIFS('1. Staff costs'!S:S,'1. Staff costs'!C:C,B26,'1. Staff costs'!B:B,$C$21)\n+SUMIFS(' 2-3-6. Travel&Costs of Stay'!O:O,' 2-3-6. Travel&Costs of Stay'!C:C,B26,' 2-3-6. Travel&Costs of Stay'!B:B,$C$21)\n+SUMIFS(' 2-3-6. Travel&Costs of Stay'!P:P,' 2-3-6. Travel&Costs of Stay'!C:C,B26,' 2-3-6. Travel&Costs of Stay'!B:B,$C$21)\n+SUMIFS('4. Equipment Costs'!H:H,'4. Equipment Costs'!C:C,B26,'4. Equipment Costs'!B:B,$C$21)\n+SUMIFS('5. Subcontracting Costs'!H:H,'5. Subcontracting Costs'!C:C,B26,'5. Subcontracting Costs'!B:B,$C$21)\n+SUMIFS(' 2-3-6. Travel&Costs of Stay'!N:N,' 2-3-6. Travel&Costs of Stay'!C:C,B26,' 2-3-6. Travel&Costs of Stay'!B:B,$C$21)","v":"#ERROR!"},{"$f":"SUMIFS('1. Staff costs'!S:S,'1. Staff costs'!C:C,B26,'1. Staff costs'!B:B,$D$21)\n+SUMIFS(' 2-3-6. Travel&Costs of Stay'!O:O,' 2-3-6. Travel&Costs of Stay'!C:C,B26,' 2-3-6. Travel&Costs of Stay'!B:B,$D$21)\n+SUMIFS(' 2-3-6. Travel&Costs of Stay'!P:P,' 2-3-6. Travel&Costs of Stay'!C:C,B26,' 2-3-6. Travel&Costs of Stay'!B:B,$D$21)\n+SUMIFS('4. Equipment Costs'!H:H,'4. Equipment Costs'!C:C,B26,'4. Equipment Costs'!B:B,$D$21)\n+SUMIFS('5. Subcontracting Costs'!H:H,'5. Subcontracting Costs'!C:C,B26,'5. Subcontracting Costs'!B:B,$D$21)\n+SUMIFS(' 2-3-6. Travel&Costs of Stay'!N:N,' 2-3-6. Travel&Costs of Stay'!C:C,B26,' 2-3-6. Travel&Costs of Stay'!B:B,$D$21)","v":"#ERROR!"},{"$f":"SUMIFS('1. Staff costs'!S:S,'1. Staff costs'!C:C,B26,'1. Staff costs'!B:B,$E$21)\n+SUMIFS(' 2-3-6. Travel&Costs of Stay'!O:O,' 2-3-6. Travel&Costs of Stay'!C:C,B26,' 2-3-6. Travel&Costs of Stay'!B:B,$E$21)\n+SUMIFS(' 2-3-6. Travel&Costs of Stay'!P:P,' 2-3-6. Travel&Costs of Stay'!C:C,B26,' 2-3-6. Travel&Costs of Stay'!B:B,$E$21)\n+SUMIFS('4. Equipment Costs'!H:H,'4. Equipment Costs'!C:C,B26,'4. Equipment Costs'!B:B,$E$21)\n+SUMIFS('5. Subcontracting Costs'!H:H,'5. Subcontracting Costs'!C:C,B26,'5. Subcontracting Costs'!B:B,$E$21)\n+SUMIFS(' 2-3-6. Travel&Costs of Stay'!N:N,' 2-3-6. Travel&Costs of Stay'!C:C,B26,' 2-3-6. Travel&Costs of Stay'!B:B,$E$21)","v":"#ERROR!"},{"$f":"SUMIFS('1. Staff costs'!S:S,'1. Staff costs'!C:C,B26,'1. Staff costs'!B:B,$F$21)\n+SUMIFS(' 2-3-6. Travel&Costs of Stay'!O:O,' 2-3-6. Travel&Costs of Stay'!C:C,B26,' 2-3-6. Travel&Costs of Stay'!B:B,$F$21)\n+SUMIFS(' 2-3-6. Travel&Costs of Stay'!P:P,' 2-3-6. Travel&Costs of Stay'!C:C,B26,' 2-3-6. Travel&Costs of Stay'!B:B,$F$21)\n+SUMIFS('4. Equipment Costs'!H:H,'4. Equipment Costs'!C:C,B26,'4. Equipment Costs'!B:B,$F$21)\n+SUMIFS('5. Subcontracting Costs'!H:H,'5. Subcontracting Costs'!C:C,B26,'5. Subcontracting Costs'!B:B,$F$21)\n+SUMIFS(' 2-3-6. Travel&Costs of Stay'!N:N,' 2-3-6. Travel&Costs of Stay'!C:C,B26,' 2-3-6. Travel&Costs of Stay'!B:B,$F$21)","v":"#ERROR!"},{"$f":"SUMIFS('1. Staff costs'!S:S,'1. Staff costs'!C:C,B26,'1. Staff costs'!B:B,$G$21)\n+SUMIFS(' 2-3-6. Travel&Costs of Stay'!O:O,' 2-3-6. Travel&Costs of Stay'!C:C,B26,' 2-3-6. Travel&Costs of Stay'!B:B,$G$21)\n+SUMIFS(' 2-3-6. Travel&Costs of Stay'!P:P,' 2-3-6. Travel&Costs of Stay'!C:C,B26,' 2-3-6. Travel&Costs of Stay'!B:B,$G$21)\n+SUMIFS('4. Equipment Costs'!H:H,'4. Equipment Costs'!C:C,B26,'4. Equipment Costs'!B:B,$G$21)\n+SUMIFS('5. Subcontracting Costs'!H:H,'5. Subcontracting Costs'!C:C,B26,'5. Subcontracting Costs'!B:B,$G$21)\n+SUMIFS(' 2-3-6. Travel&Costs of Stay'!N:N,' 2-3-6. Travel&Costs of Stay'!C:C,B26,' 2-3-6. Travel&Costs of Stay'!B:B,$G$21)","v":"#ERROR!"},"#ERROR!"]
[null,"P6",{"$f":"SUMIFS('1. Staff costs'!S:S,'1. Staff costs'!C:C,B27,'1. Staff costs'!B:B,$C$21)\n+SUMIFS(' 2-3-6. Travel&Costs of Stay'!O:O,' 2-3-6. Travel&Costs of Stay'!C:C,B27,' 2-3-6. Travel&Costs of Stay'!B:B,$C$21)\n+SUMIFS(' 2-3-6. Travel&Costs of Stay'!P:P,' 2-3-6. Travel&Costs of Stay'!C:C,B27,' 2-3-6. Travel&Costs of Stay'!B:B,$C$21)\n+SUMIFS('4. Equipment Costs'!H:H,'4. Equipment Costs'!C:C,B27,'4. Equipment Costs'!B:B,$C$21)\n+SUMIFS('5. Subcontracting Costs'!H:H,'5. Subcontracting Costs'!C:C,B27,'5. Subcontracting Costs'!B:B,$C$21)\n+SUMIFS(' 2-3-6. Travel&Costs of Stay'!N:N,' 2-3-6. Travel&Costs of Stay'!C:C,B27,' 2-3-6. Travel&Costs of Stay'!B:B,$C$21)","v":"#ERROR!"},{"$f":"SUMIFS('1. Staff costs'!S:S,'1. Staff costs'!C:C,B27,'1. Staff costs'!B:B,$D$21)\n+SUMIFS(' 2-3-6. Travel&Costs of Stay'!O:O,' 2-3-6. Travel&Costs of Stay'!C:C,B27,' 2-3-6. Travel&Costs of Stay'!B:B,$D$21)\n+SUMIFS(' 2-3-6. Travel&Costs of Stay'!P:P,' 2-3-6. Travel&Costs of Stay'!C:C,B27,' 2-3-6. Travel&Costs of Stay'!B:B,$D$21)\n+SUMIFS('4. Equipment Costs'!H:H,'4. Equipment Costs'!C:C,B27,'4. Equipment Costs'!B:B,$D$21)\n+SUMIFS('5. Subcontracting Costs'!H:H,'5. Subcontracting Costs'!C:C,B27,'5. Subcontracting Costs'!B:B,$D$21)\n+SUMIFS(' 2-3-6. Travel&Costs of Stay'!N:N,' 2-3-6. Travel&Costs of Stay'!C:C,B27,' 2-3-6. Travel&Costs of Stay'!B:B,$D$21)","v":"#ERROR!"},{"$f":"SUMIFS('1. Staff costs'!S:S,'1. Staff costs'!C:C,B27,'1. Staff costs'!B:B,$E$21)\n+SUMIFS(' 2-3-6. Travel&Costs of Stay'!O:O,' 2-3-6. Travel&Costs of Stay'!C:C,B27,' 2-3-6. Travel&Costs of Stay'!B:B,$E$21)\n+SUMIFS(' 2-3-6. Travel&Costs of Stay'!P:P,' 2-3-6. Travel&Costs of Stay'!C:C,B27,' 2-3-6. Travel&Costs of Stay'!B:B,$E$21)\n+SUMIFS('4. Equipment Costs'!H:H,'4. Equipment Costs'!C:C,B27,'4. Equipment Costs'!B:B,$E$21)\n+SUMIFS('5. Subcontracting Costs'!H:H,'5. Subcontracting Costs'!C:C,B27,'5. Subcontracting Costs'!B:B,$E$21)\n+SUMIFS(' 2-3-6. Travel&Costs of Stay'!N:N,' 2-3-6. Travel&Costs of Stay'!C:C,B27,' 2-3-6. Travel&Costs of Stay'!B:B,$E$21)","v":"#ERROR!"},{"$f":"SUMIFS('1. Staff costs'!S:S,'1. Staff costs'!C:C,B27,'1. Staff costs'!B:B,$F$21)\n+SUMIFS(' 2-3-6. Travel&Costs of Stay'!O:O,' 2-3-6. Travel&Costs of Stay'!C:C,B27,' 2-3-6. Travel&Costs of Stay'!B:B,$F$21)\n+SUMIFS(' 2-3-6. Travel&Costs of Stay'!P:P,' 2-3-6. Travel&Costs of Stay'!C:C,B27,' 2-3-6. Travel&Costs of Stay'!B:B,$F$21)\n+SUMIFS('4. Equipment Costs'!H:H,'4. Equipment Costs'!C:C,B27,'4. Equipment Costs'!B:B,$F$21)\n+SUMIFS('5. Subcontracting Costs'!H:H,'5. Subcontracting Costs'!C:C,B27,'5. Subcontracting Costs'!B:B,$F$21)\n+SUMIFS(' 2-3-6. Travel&Costs of Stay'!N:N,' 2-3-6. Travel&Costs of Stay'!C:C,B27,' 2-3-6. Travel&Costs of Stay'!B:B,$F$21)","v":"#ERROR!"},{"$f":"SUMIFS('1. Staff costs'!S:S,'1. Staff costs'!C:C,B27,'1. Staff costs'!B:B,$G$21)\n+SUMIFS(' 2-3-6. Travel&Costs of Stay'!O:O,' 2-3-6. Travel&Costs of Stay'!C:C,B27,' 2-3-6. Travel&Costs of Stay'!B:B,$G$21)\n+SUMIFS(' 2-3-6. Travel&Costs of Stay'!P:P,' 2-3-6. Travel&Costs of Stay'!C:C,B27,' 2-3-6. Travel&Costs of Stay'!B:B,$G$21)\n+SUMIFS('4. Equipment Costs'!H:H,'4. Equipment Costs'!C:C,B27,'4. Equipment Costs'!B:B,$G$21)\n+SUMIFS('5. Subcontracting Costs'!H:H,'5. Subcontracting Costs'!C:C,B27,'5. Subcontracting Costs'!B:B,$G$21)\n+SUMIFS(' 2-3-6. Travel&Costs of Stay'!N:N,' 2-3-6. Travel&Costs of Stay'!C:C,B27,' 2-3-6. Travel&Costs of Stay'!B:B,$G$21)","v":"#ERROR!"},"#ERROR!"]
[null,"P7",{"$f":"SUMIFS('1. Staff costs'!S:S,'1. Staff costs'!C:C,B28,'1. Staff costs'!B:B,$C$21)\n+SUMIFS(' 2-3-6. Travel&Costs of Stay'!O:O,' 2-3-6. Travel&Costs of Stay'!C:C,B28,' 2-3-6. Travel&Costs of Stay'!B:B,$C$21)\n+SUMIFS(' 2-3-6. Travel&Costs of Stay'!P:P,' 2-3-6. Travel&Costs of Stay'!C:C,B28,' 2-3-6. Travel&Costs of Stay'!B:B,$C$21)\n+SUMIFS('4. Equipment Costs'!H:H,'4. Equipment Costs'!C:C,B28,'4. Equipment Costs'!B:B,$C$21)\n+SUMIFS('5. Subcontracting Costs'!H:H,'5. Subcontracting Costs'!C:C,B28,'5. Subcontracting Costs'!B:B,$C$21)\n+SUMIFS(' 2-3-6. Travel&Costs of Stay'!N:N,' 2-3-6. Travel&Costs of Stay'!C:C,B28,' 2-3-6. Travel&Costs of Stay'!B:B,$C$21)","v":"#ERROR!"},{"$f":"SUMIFS('1. Staff costs'!S:S,'1. Staff costs'!C:C,B28,'1. Staff costs'!B:B,$D$21)\n+SUMIFS(' 2-3-6. Travel&Costs of Stay'!O:O,' 2-3-6. Travel&Costs of Stay'!C:C,B28,' 2-3-6. Travel&Costs of Stay'!B:B,$D$21)\n+SUMIFS(' 2-3-6. Travel&Costs of Stay'!P:P,' 2-3-6. Travel&Costs of Stay'!C:C,B28,' 2-3-6. Travel&Costs of Stay'!B:B,$D$21)\n+SUMIFS('4. Equipment Costs'!H:H,'4. Equipment Costs'!C:C,B28,'4. Equipment Costs'!B:B,$D$21)\n+SUMIFS('5. Subcontracting Costs'!H:H,'5. Subcontracting Costs'!C:C,B28,'5. Subcontracting Costs'!B:B,$D$21)\n+SUMIFS(' 2-3-6. Travel&Costs of Stay'!N:N,' 2-3-6. Travel&Costs of Stay'!C:C,B28,' 2-3-6. Travel&Costs of Stay'!B:B,$D$21)","v":"#ERROR!"},{"$f":"SUMIFS('1. Staff costs'!S:S,'1. Staff costs'!C:C,B28,'1. Staff costs'!B:B,$E$21)\n+SUMIFS(' 2-3-6. Travel&Costs of Stay'!O:O,' 2-3-6. Travel&Costs of Stay'!C:C,B28,' 2-3-6. Travel&Costs of Stay'!B:B,$E$21)\n+SUMIFS(' 2-3-6. Travel&Costs of Stay'!P:P,' 2-3-6. Travel&Costs of Stay'!C:C,B28,' 2-3-6. Travel&Costs of Stay'!B:B,$E$21)\n+SUMIFS('4. Equipment Costs'!H:H,'4. Equipment Costs'!C:C,B28,'4. Equipment Costs'!B:B,$E$21)\n+SUMIFS('5. Subcontracting Costs'!H:H,'5. Subcontracting Costs'!C:C,B28,'5. Subcontracting Costs'!B:B,$E$21)\n+SUMIFS(' 2-3-6. Travel&Costs of Stay'!N:N,' 2-3-6. Travel&Costs of Stay'!C:C,B28,' 2-3-6. Travel&Costs of Stay'!B:B,$E$21)","v":"#ERROR!"},{"$f":"SUMIFS('1. Staff costs'!S:S,'1. Staff costs'!C:C,B28,'1. Staff costs'!B:B,$F$21)\n+SUMIFS(' 2-3-6. Travel&Costs of Stay'!O:O,' 2-3-6. Travel&Costs of Stay'!C:C,B28,' 2-3-6. Travel&Costs of Stay'!B:B,$F$21)\n+SUMIFS(' 2-3-6. Travel&Costs of Stay'!P:P,' 2-3-6. Travel&Costs of Stay'!C:C,B28,' 2-3-6. Travel&Costs of Stay'!B:B,$F$21)\n+SUMIFS('4. Equipment Costs'!H:H,'4. Equipment Costs'!C:C,B28,'4. Equipment Costs'!B:B,$F$21)\n+SUMIFS('5. Subcontracting Costs'!H:H,'5. Subcontracting Costs'!C:C,B28,'5. Subcontracting Costs'!B:B,$F$21)\n+SUMIFS(' 2-3-6. Travel&Costs of Stay'!N:N,' 2-3-6. Travel&Costs of Stay'!C:C,B28,' 2-3-6. Travel&Costs of Stay'!B:B,$F$21)","v":"#ERROR!"},{"$f":"SUMIFS('1. Staff costs'!S:S,'1. Staff costs'!C:C,B28,'1. Staff costs'!B:B,$G$21)\n+SUMIFS(' 2-3-6. Travel&Costs of Stay'!O:O,' 2-3-6. Travel&Costs of Stay'!C:C,B28,' 2-3-6. Travel&Costs of Stay'!B:B,$G$21)\n+SUMIFS(' 2-3-6. Travel&Costs of Stay'!P:P,' 2-3-6. Travel&Costs of Stay'!C:C,B28,' 2-3-6. Travel&Costs of Stay'!B:B,$G$21)\n+SUMIFS('4. Equipment Costs'!H:H,'4. Equipment Costs'!C:C,B28,'4. Equipment Costs'!B:B,$G$21)\n+SUMIFS('5. Subcontracting Costs'!H:H,'5. Subcontracting Costs'!C:C,B28,'5. Subcontracting Costs'!B:B,$G$21)\n+SUMIFS(' 2-3-6. Travel&Costs of Stay'!N:N,' 2-3-6. Travel&Costs of Stay'!C:C,B28,' 2-3-6. Travel&Costs of Stay'!B:B,$G$21)","v":"#ERROR!"},"#ERROR!"]
[null,"P8",{"$f":"SUMIFS('1. Staff costs'!S:S,'1. Staff costs'!C:C,B29,'1. Staff costs'!B:B,$C$21)\n+SUMIFS(' 2-3-6. Travel&Costs of Stay'!O:O,' 2-3-6. Travel&Costs of Stay'!C:C,B29,' 2-3-6. Travel&Costs of Stay'!B:B,$C$21)\n+SUMIFS(' 2-3-6. Travel&Costs of Stay'!P:P,' 2-3-6. Travel&Costs of Stay'!C:C,B29,' 2-3-6. Travel&Costs of Stay'!B:B,$C$21)\n+SUMIFS('4. Equipment Costs'!H:H,'4. Equipment Costs'!C:C,B29,'4. Equipment Costs'!B:B,$C$21)\n+SUMIFS('5. Subcontracting Costs'!H:H,'5. Subcontracting Costs'!C:C,B29,'5. Subcontracting Costs'!B:B,$C$21)\n+SUMIFS(' 2-3-6. Travel&Costs of Stay'!N:N,' 2-3-6. Travel&Costs of Stay'!C:C,B29,' 2-3-6. Travel&Costs of Stay'!B:B,$C$21)","v":"#ERROR!"},{"$f":"SUMIFS('1. Staff costs'!S:S,'1. Staff costs'!C:C,B29,'1. Staff costs'!B:B,$D$21)\n+SUMIFS(' 2-3-6. Travel&Costs of Stay'!O:O,' 2-3-6. Travel&Costs of Stay'!C:C,B29,' 2-3-6. Travel&Costs of Stay'!B:B,$D$21)\n+SUMIFS(' 2-3-6. Travel&Costs of Stay'!P:P,' 2-3-6. Travel&Costs of Stay'!C:C,B29,' 2-3-6. Travel&Costs of Stay'!B:B,$D$21)\n+SUMIFS('4. Equipment Costs'!H:H,'4. Equipment Costs'!C:C,B29,'4. Equipment Costs'!B:B,$D$21)\n+SUMIFS('5. Subcontracting Costs'!H:H,'5. Subcontracting Costs'!C:C,B29,'5. Subcontracting Costs'!B:B,$D$21)\n+SUMIFS(' 2-3-6. Travel&Costs of Stay'!N:N,' 2-3-6. Travel&Costs of Stay'!C:C,B29,' 2-3-6. Travel&Costs of Stay'!B:B,$D$21)","v":"#ERROR!"},{"$f":"SUMIFS('1. Staff costs'!S:S,'1. Staff costs'!C:C,B29,'1. Staff costs'!B:B,$E$21)\n+SUMIFS(' 2-3-6. Travel&Costs of Stay'!O:O,' 2-3-6. Travel&Costs of Stay'!C:C,B29,' 2-3-6. Travel&Costs of Stay'!B:B,$E$21)\n+SUMIFS(' 2-3-6. Travel&Costs of Stay'!P:P,' 2-3-6. Travel&Costs of Stay'!C:C,B29,' 2-3-6. Travel&Costs of Stay'!B:B,$E$21)\n+SUMIFS('4. Equipment Costs'!H:H,'4. Equipment Costs'!C:C,B29,'4. Equipment Costs'!B:B,$E$21)\n+SUMIFS('5. Subcontracting Costs'!H:H,'5. Subcontracting Costs'!C:C,B29,'5. Subcontracting Costs'!B:B,$E$21)\n+SUMIFS(' 2-3-6. Travel&Costs of Stay'!N:N,' 2-3-6. Travel&Costs of Stay'!C:C,B29,' 2-3-6. Travel&Costs of Stay'!B:B,$E$21)","v":"#ERROR!"},{"$f":"SUMIFS('1. Staff costs'!S:S,'1. Staff costs'!C:C,B29,'1. Staff costs'!B:B,$F$21)\n+SUMIFS(' 2-3-6. Travel&Costs of Stay'!O:O,' 2-3-6. Travel&Costs of Stay'!C:C,B29,' 2-3-6. Travel&Costs of Stay'!B:B,$F$21)\n+SUMIFS(' 2-3-6. Travel&Costs of Stay'!P:P,' 2-3-6. Travel&Costs of Stay'!C:C,B29,' 2-3-6. Travel&Costs of Stay'!B:B,$F$21)\n+SUMIFS('4. Equipment Costs'!H:H,'4. Equipment Costs'!C:C,B29,'4. Equipment Costs'!B:B,$F$21)\n+SUMIFS('5. Subcontracting Costs'!H:H,'5. Subcontracting Costs'!C:C,B29,'5. Subcontracting Costs'!B:B,$F$21)\n+SUMIFS(' 2-3-6. Travel&Costs of Stay'!N:N,' 2-3-6. Travel&Costs of Stay'!C:C,B29,' 2-3-6. Travel&Costs of Stay'!B:B,$F$21)","v":"#ERROR!"},{"$f":"SUMIFS('1. Staff costs'!S:S,'1. Staff costs'!C:C,B29,'1. Staff costs'!B:B,$G$21)\n+SUMIFS(' 2-3-6. Travel&Costs of Stay'!O:O,' 2-3-6. Travel&Costs of Stay'!C:C,B29,' 2-3-6. Travel&Costs of Stay'!B:B,$G$21)\n+SUMIFS(' 2-3-6. Travel&Costs of Stay'!P:P,' 2-3-6. Travel&Costs of Stay'!C:C,B29,' 2-3-6. Travel&Costs of Stay'!B:B,$G$21)\n+SUMIFS('4. Equipment Costs'!H:H,'4. Equipment Costs'!C:C,B29,'4. Equipment Costs'!B:B,$G$21)\n+SUMIFS('5. Subcontracting Costs'!H:H,'5. Subcontracting Costs'!C:C,B29,'5. Subcontracting Costs'!B:B,$G$21)\n+SUMIFS(' 2-3-6. Travel&Costs of Stay'!N:N,' 2-3-6. Travel&Costs of Stay'!C:C,B29,' 2-3-6. Travel&Costs of Stay'!B:B,$G$21)","v":"#ERROR!"},"#ERROR!"]
[null,"P9",{"$f":"SUMIFS('1. Staff costs'!S:S,'1. Staff costs'!C:C,B30,'1. Staff costs'!B:B,$C$21)\n+SUMIFS(' 2-3-6. Travel&Costs of Stay'!O:O,' 2-3-6. Travel&Costs of Stay'!C:C,B30,' 2-3-6. Travel&Costs of Stay'!B:B,$C$21)\n+SUMIFS(' 2-3-6. Travel&Costs of Stay'!P:P,' 2-3-6. Travel&Costs of Stay'!C:C,B30,' 2-3-6. Travel&Costs of Stay'!B:B,$C$21)\n+SUMIFS('4. Equipment Costs'!H:H,'4. Equipment Costs'!C:C,B30,'4. Equipment Costs'!B:B,$C$21)\n+SUMIFS('5. Subcontracting Costs'!H:H,'5. Subcontracting Costs'!C:C,B30,'5. Subcontracting Costs'!B:B,$C$21)\n+SUMIFS(' 2-3-6. Travel&Costs of Stay'!N:N,' 2-3-6. Travel&Costs of Stay'!C:C,B30,' 2-3-6. Travel&Costs of Stay'!B:B,$C$21)","v":"#ERROR!"},{"$f":"SUMIFS('1. Staff costs'!S:S,'1. Staff costs'!C:C,B30,'1. Staff costs'!B:B,$D$21)\n+SUMIFS(' 2-3-6. Travel&Costs of Stay'!O:O,' 2-3-6. Travel&Costs of Stay'!C:C,B30,' 2-3-6. Travel&Costs of Stay'!B:B,$D$21)\n+SUMIFS(' 2-3-6. Travel&Costs of Stay'!P:P,' 2-3-6. Travel&Costs of Stay'!C:C,B30,' 2-3-6. Travel&Costs of Stay'!B:B,$D$21)\n+SUMIFS('4. Equipment Costs'!H:H,'4. Equipment Costs'!C:C,B30,'4. Equipment Costs'!B:B,$D$21)\n+SUMIFS('5. Subcontracting Costs'!H:H,'5. Subcontracting Costs'!C:C,B30,'5. Subcontracting Costs'!B:B,$D$21)\n+SUMIFS(' 2-3-6. Travel&Costs of Stay'!N:N,' 2-3-6. Travel&Costs of Stay'!C:C,B30,' 2-3-6. Travel&Costs of Stay'!B:B,$D$21)","v":"#ERROR!"},{"$f":"SUMIFS('1. Staff costs'!S:S,'1. Staff costs'!C:C,B30,'1. Staff costs'!B:B,$E$21)\n+SUMIFS(' 2-3-6. Travel&Costs of Stay'!O:O,' 2-3-6. Travel&Costs of Stay'!C:C,B30,' 2-3-6. Travel&Costs of Stay'!B:B,$E$21)\n+SUMIFS(' 2-3-6. Travel&Costs of Stay'!P:P,' 2-3-6. Travel&Costs of Stay'!C:C,B30,' 2-3-6. Travel&Costs of Stay'!B:B,$E$21)\n+SUMIFS('4. Equipment Costs'!H:H,'4. Equipment Costs'!C:C,B30,'4. Equipment Costs'!B:B,$E$21)\n+SUMIFS('5. Subcontracting Costs'!H:H,'5. Subcontracting Costs'!C:C,B30,'5. Subcontracting Costs'!B:B,$E$21)\n+SUMIFS(' 2-3-6. Travel&Costs of Stay'!N:N,' 2-3-6. Travel&Costs of Stay'!C:C,B30,' 2-3-6. Travel&Costs of Stay'!B:B,$E$21)","v":"#ERROR!"},{"$f":"SUMIFS('1. Staff costs'!S:S,'1. Staff costs'!C:C,B30,'1. Staff costs'!B:B,$F$21)\n+SUMIFS(' 2-3-6. Travel&Costs of Stay'!O:O,' 2-3-6. Travel&Costs of Stay'!C:C,B30,' 2-3-6. Travel&Costs of Stay'!B:B,$F$21)\n+SUMIFS(' 2-3-6. Travel&Costs of Stay'!P:P,' 2-3-6. Travel&Costs of Stay'!C:C,B30,' 2-3-6. Travel&Costs of Stay'!B:B,$F$21)\n+SUMIFS('4. Equipment Costs'!H:H,'4. Equipment Costs'!C:C,B30,'4. Equipment Costs'!B:B,$F$21)\n+SUMIFS('5. Subcontracting Costs'!H:H,'5. Subcontracting Costs'!C:C,B30,'5. Subcontracting Costs'!B:B,$F$21)\n+SUMIFS(' 2-3-6. Travel&Costs of Stay'!N:N,' 2-3-6. Travel&Costs of Stay'!C:C,B30,' 2-3-6. Travel&Costs of Stay'!B:B,$F$21)","v":"#ERROR!"},{"$f":"SUMIFS('1. Staff costs'!S:S,'1. Staff costs'!C:C,B30,'1. Staff costs'!B:B,$G$21)\n+SUMIFS(' 2-3-6. Travel&Costs of Stay'!O:O,' 2-3-6. Travel&Costs of Stay'!C:C,B30,' 2-3-6. Travel&Costs of Stay'!B:B,$G$21)\n+SUMIFS(' 2-3-6. Travel&Costs of Stay'!P:P,' 2-3-6. Travel&Costs of Stay'!C:C,B30,' 2-3-6. Travel&Costs of Stay'!B:B,$G$21)\n+SUMIFS('4. Equipment Costs'!H:H,'4. Equipment Costs'!C:C,B30,'4. Equipment Costs'!B:B,$G$21)\n+SUMIFS('5. Subcontracting Costs'!H:H,'5. Subcontracting Costs'!C:C,B30,'5. Subcontracting Costs'!B:B,$G$21)\n+SUMIFS(' 2-3-6. Travel&Costs of Stay'!N:N,' 2-3-6. Travel&Costs of Stay'!C:C,B30,' 2-3-6. Travel&Costs of Stay'!B:B,$G$21)","v":"#ERROR!"},"#ERROR!"]
[null,"P10",{"$f":"SUMIFS('1. Staff costs'!S:S,'1. Staff costs'!C:C,B31,'1. Staff costs'!B:B,$C$21)\n+SUMIFS(' 2-3-6. Travel&Costs of Stay'!O:O,' 2-3-6. Travel&Costs of Stay'!C:C,B31,' 2-3-6. Travel&Costs of Stay'!B:B,$C$21)\n+SUMIFS(' 2-3-6. Travel&Costs of Stay'!P:P,' 2-3-6. Travel&Costs of Stay'!C:C,B31,' 2-3-6. Travel&Costs of Stay'!B:B,$C$21)\n+SUMIFS('4. Equipment Costs'!H:H,'4. Equipment Costs'!C:C,B31,'4. Equipment Costs'!B:B,$C$21)\n+SUMIFS('5. Subcontracting Costs'!H:H,'5. Subcontracting Costs'!C:C,B31,'5. Subcontracting Costs'!B:B,$C$21)\n+SUMIFS(' 2-3-6. Travel&Costs of Stay'!N:N,' 2-3-6. Travel&Costs of Stay'!C:C,B31,' 2-3-6. Travel&Costs of Stay'!B:B,$C$21)","v":"#ERROR!"},{"$f":"SUMIFS('1. Staff costs'!S:S,'1. Staff costs'!C:C,B31,'1. Staff costs'!B:B,$D$21)\n+SUMIFS(' 2-3-6. Travel&Costs of Stay'!O:O,' 2-3-6. Travel&Costs of Stay'!C:C,B31,' 2-3-6. Travel&Costs of Stay'!B:B,$D$21)\n+SUMIFS(' 2-3-6. Travel&Costs of Stay'!P:P,' 2-3-6. Travel&Costs of Stay'!C:C,B31,' 2-3-6. Travel&Costs of Stay'!B:B,$D$21)\n+SUMIFS('4. Equipment Costs'!H:H,'4. Equipment Costs'!C:C,B31,'4. Equipment Costs'!B:B,$D$21)\n+SUMIFS('5. Subcontracting Costs'!H:H,'5. Subcontracting Costs'!C:C,B31,'5. Subcontracting Costs'!B:B,$D$21)\n+SUMIFS(' 2-3-6. Travel&Costs of Stay'!N:N,' 2-3-6. Travel&Costs of Stay'!C:C,B31,' 2-3-6. Travel&Costs of Stay'!B:B,$D$21)","v":"#ERROR!"},{"$f":"SUMIFS('1. Staff costs'!S:S,'1. Staff costs'!C:C,B31,'1. Staff costs'!B:B,$E$21)\n+SUMIFS(' 2-3-6. Travel&Costs of Stay'!O:O,' 2-3-6. Travel&Costs of Stay'!C:C,B31,' 2-3-6. Travel&Costs of Stay'!B:B,$E$21)\n+SUMIFS(' 2-3-6. Travel&Costs of Stay'!P:P,' 2-3-6. Travel&Costs of Stay'!C:C,B31,' 2-3-6. Travel&Costs of Stay'!B:B,$E$21)\n+SUMIFS('4. Equipment Costs'!H:H,'4. Equipment Costs'!C:C,B31,'4. Equipment Costs'!B:B,$E$21)\n+SUMIFS('5. Subcontracting Costs'!H:H,'5. Subcontracting Costs'!C:C,B31,'5. Subcontracting Costs'!B:B,$E$21)\n+SUMIFS(' 2-3-6. Travel&Costs of Stay'!N:N,' 2-3-6. Travel&Costs of Stay'!C:C,B31,' 2-3-6. Travel&Costs of Stay'!B:B,$E$21)","v":"#ERROR!"},{"$f":"SUMIFS('1. Staff costs'!S:S,'1. Staff costs'!C:C,B31,'1. Staff costs'!B:B,$F$21)\n+SUMIFS(' 2-3-6. Travel&Costs of Stay'!O:O,' 2-3-6. Travel&Costs of Stay'!C:C,B31,' 2-3-6. Travel&Costs of Stay'!B:B,$F$21)\n+SUMIFS(' 2-3-6. Travel&Costs of Stay'!P:P,' 2-3-6. Travel&Costs of Stay'!C:C,B31,' 2-3-6. Travel&Costs of Stay'!B:B,$F$21)\n+SUMIFS('4. Equipment Costs'!H:H,'4. Equipment Costs'!C:C,B31,'4. Equipment Costs'!B:B,$F$21)\n+SUMIFS('5. Subcontracting Costs'!H:H,'5. Subcontracting Costs'!C:C,B31,'5. Subcontracting Costs'!B:B,$F$21)\n+SUMIFS(' 2-3-6. Travel&Costs of Stay'!N:N,' 2-3-6. Travel&Costs of Stay'!C:C,B31,' 2-3-6. Travel&Costs of Stay'!B:B,$F$21)","v":"#ERROR!"},{"$f":"SUMIFS('1. Staff costs'!S:S,'1. Staff costs'!C:C,B31,'1. Staff costs'!B:B,$G$21)\n+SUMIFS(' 2-3-6. Travel&Costs of Stay'!O:O,' 2-3-6. Travel&Costs of Stay'!C:C,B31,' 2-3-6. Travel&Costs of Stay'!B:B,$G$21)\n+SUMIFS(' 2-3-6. Travel&Costs of Stay'!P:P,' 2-3-6. Travel&Costs of Stay'!C:C,B31,' 2-3-6. Travel&Costs of Stay'!B:B,$G$21)\n+SUMIFS('4. Equipment Costs'!H:H,'4. Equipment Costs'!C:C,B31,'4. Equipment Costs'!B:B,$G$21)\n+SUMIFS('5. Subcontracting Costs'!H:H,'5. Subcontracting Costs'!C:C,B31,'5. Subcontracting Costs'!B:B,$G$21)\n+SUMIFS(' 2-3-6. Travel&Costs of Stay'!N:N,' 2-3-6. Travel&Costs of Stay'!C:C,B31,' 2-3-6. Travel&Costs of Stay'!B:B,$G$21)","v":"#ERROR!"},"#ERROR!"]
[null,"P11",{"$f":"SUMIFS('1. Staff costs'!S:S,'1. Staff costs'!C:C,B32,'1. Staff costs'!B:B,$C$21)\n+SUMIFS(' 2-3-6. Travel&Costs of Stay'!O:O,' 2-3-6. Travel&Costs of Stay'!C:C,B32,' 2-3-6. Travel&Costs of Stay'!B:B,$C$21)\n+SUMIFS(' 2-3-6. Travel&Costs of Stay'!P:P,' 2-3-6. Travel&Costs of Stay'!C:C,B32,' 2-3-6. Travel&Costs of Stay'!B:B,$C$21)\n+SUMIFS('4. Equipment Costs'!H:H,'4. Equipment Costs'!C:C,B32,'4. Equipment Costs'!B:B,$C$21)\n+SUMIFS('5. Subcontracting Costs'!H:H,'5. Subcontracting Costs'!C:C,B32,'5. Subcontracting Costs'!B:B,$C$21)\n+SUMIFS(' 2-3-6. Travel&Costs of Stay'!N:N,' 2-3-6. Travel&Costs of Stay'!C:C,B32,' 2-3-6. Travel&Costs of Stay'!B:B,$C$21)","v":"#ERROR!"},{"$f":"SUMIFS('1. Staff costs'!S:S,'1. Staff costs'!C:C,B32,'1. Staff costs'!B:B,$D$21)\n+SUMIFS(' 2-3-6. Travel&Costs of Stay'!O:O,' 2-3-6. Travel&Costs of Stay'!C:C,B32,' 2-3-6. Travel&Costs of Stay'!B:B,$D$21)\n+SUMIFS(' 2-3-6. Travel&Costs of Stay'!P:P,' 2-3-6. Travel&Costs of Stay'!C:C,B32,' 2-3-6. Travel&Costs of Stay'!B:B,$D$21)\n+SUMIFS('4. Equipment Costs'!H:H,'4. Equipment Costs'!C:C,B32,'4. Equipment Costs'!B:B,$D$21)\n+SUMIFS('5. Subcontracting Costs'!H:H,'5. Subcontracting Costs'!C:C,B32,'5. Subcontracting Costs'!B:B,$D$21)\n+SUMIFS(' 2-3-6. Travel&Costs of Stay'!N:N,' 2-3-6. Travel&Costs of Stay'!C:C,B32,' 2-3-6. Travel&Costs of Stay'!B:B,$D$21)","v":"#ERROR!"},{"$f":"SUMIFS('1. Staff costs'!S:S,'1. Staff costs'!C:C,B32,'1. Staff costs'!B:B,$E$21)\n+SUMIFS(' 2-3-6. Travel&Costs of Stay'!O:O,' 2-3-6. Travel&Costs of Stay'!C:C,B32,' 2-3-6. Travel&Costs of Stay'!B:B,$E$21)\n+SUMIFS(' 2-3-6. Travel&Costs of Stay'!P:P,' 2-3-6. Travel&Costs of Stay'!C:C,B32,' 2-3-6. Travel&Costs of Stay'!B:B,$E$21)\n+SUMIFS('4. Equipment Costs'!H:H,'4. Equipment Costs'!C:C,B32,'4. Equipment Costs'!B:B,$E$21)\n+SUMIFS('5. Subcontracting Costs'!H:H,'5. Subcontracting Costs'!C:C,B32,'5. Subcontracting Costs'!B:B,$E$21)\n+SUMIFS(' 2-3-6. Travel&Costs of Stay'!N:N,' 2-3-6. Travel&Costs of Stay'!C:C,B32,' 2-3-6. Travel&Costs of Stay'!B:B,$E$21)","v":"#ERROR!"},{"$f":"SUMIFS('1. Staff costs'!S:S,'1. Staff costs'!C:C,B32,'1. Staff costs'!B:B,$F$21)\n+SUMIFS(' 2-3-6. Travel&Costs of Stay'!O:O,' 2-3-6. Travel&Costs of Stay'!C:C,B32,' 2-3-6. Travel&Costs of Stay'!B:B,$F$21)\n+SUMIFS(' 2-3-6. Travel&Costs of Stay'!P:P,' 2-3-6. Travel&Costs of Stay'!C:C,B32,' 2-3-6. Travel&Costs of Stay'!B:B,$F$21)\n+SUMIFS('4. Equipment Costs'!H:H,'4. Equipment Costs'!C:C,B32,'4. Equipment Costs'!B:B,$F$21)\n+SUMIFS('5. Subcontracting Costs'!H:H,'5. Subcontracting Costs'!C:C,B32,'5. Subcontracting Costs'!B:B,$F$21)\n+SUMIFS(' 2-3-6. Travel&Costs of Stay'!N:N,' 2-3-6. Travel&Costs of Stay'!C:C,B32,' 2-3-6. Travel&Costs of Stay'!B:B,$F$21)","v":"#ERROR!"},{"$f":"SUMIFS('1. Staff costs'!S:S,'1. Staff costs'!C:C,B32,'1. Staff costs'!B:B,$G$21)\n+SUMIFS(' 2-3-6. Travel&Costs of Stay'!O:O,' 2-3-6. Travel&Costs of Stay'!C:C,B32,' 2-3-6. Travel&Costs of Stay'!B:B,$G$21)\n+SUMIFS(' 2-3-6. Travel&Costs of Stay'!P:P,' 2-3-6. Travel&Costs of Stay'!C:C,B32,' 2-3-6. Travel&Costs of Stay'!B:B,$G$21)\n+SUMIFS('4. Equipment Costs'!H:H,'4. Equipment Costs'!C:C,B32,'4. Equipment Costs'!B:B,$G$21)\n+SUMIFS('5. Subcontracting Costs'!H:H,'5. Subcontracting Costs'!C:C,B32,'5. Subcontracting Costs'!B:B,$G$21)\n+SUMIFS(' 2-3-6. Travel&Costs of Stay'!N:N,' 2-3-6. Travel&Costs of Stay'!C:C,B32,' 2-3-6. Travel&Costs of Stay'!B:B,$G$21)","v":"#ERROR!"},"#ERROR!"]
[null,"P12",{"$f":"SUMIFS('1. Staff costs'!S:S,'1. Staff costs'!C:C,B33,'1. Staff costs'!B:B,$C$21)\n+SUMIFS(' 2-3-6. Travel&Costs of Stay'!O:O,' 2-3-6. Travel&Costs of Stay'!C:C,B33,' 2-3-6. Travel&Costs of Stay'!B:B,$C$21)\n+SUMIFS(' 2-3-6. Travel&Costs of Stay'!P:P,' 2-3-6. Travel&Costs of Stay'!C:C,B33,' 2-3-6. Travel&Costs of Stay'!B:B,$C$21)\n+SUMIFS('4. Equipment Costs'!H:H,'4. Equipment Costs'!C:C,B33,'4. Equipment Costs'!B:B,$C$21)\n+SUMIFS('5. Subcontracting Costs'!H:H,'5. Subcontracting Costs'!C:C,B33,'5. Subcontracting Costs'!B:B,$C$21)\n+SUMIFS(' 2-3-6. Travel&Costs of Stay'!N:N,' 2-3-6. Travel&Costs of Stay'!C:C,B33,' 2-3-6. Travel&Costs of Stay'!B:B,$C$21)","v":"#ERROR!"},{"$f":"SUMIFS('1. Staff costs'!S:S,'1. Staff costs'!C:C,B33,'1. Staff costs'!B:B,$D$21)\n+SUMIFS(' 2-3-6. Travel&Costs of Stay'!O:O,' 2-3-6. Travel&Costs of Stay'!C:C,B33,' 2-3-6. Travel&Costs of Stay'!B:B,$D$21)\n+SUMIFS(' 2-3-6. Travel&Costs of Stay'!P:P,' 2-3-6. Travel&Costs of Stay'!C:C,B33,' 2-3-6. Travel&Costs of Stay'!B:B,$D$21)\n+SUMIFS('4. Equipment Costs'!H:H,'4. Equipment Costs'!C:C,B33,'4. Equipment Costs'!B:B,$D$21)\n+SUMIFS('5. Subcontracting Costs'!H:H,'5. Subcontracting Costs'!C:C,B33,'5. Subcontracting Costs'!B:B,$D$21)\n+SUMIFS(' 2-3-6. Travel&Costs of Stay'!N:N,' 2-3-6. Travel&Costs of Stay'!C:C,B33,' 2-3-6. Travel&Costs of Stay'!B:B,$D$21)","v":"#ERROR!"},{"$f":"SUMIFS('1. Staff costs'!S:S,'1. Staff costs'!C:C,B33,'1. Staff costs'!B:B,$E$21)\n+SUMIFS(' 2-3-6. Travel&Costs of Stay'!O:O,' 2-3-6. Travel&Costs of Stay'!C:C,B33,' 2-3-6. Travel&Costs of Stay'!B:B,$E$21)\n+SUMIFS(' 2-3-6. Travel&Costs of Stay'!P:P,' 2-3-6. Travel&Costs of Stay'!C:C,B33,' 2-3-6. Travel&Costs of Stay'!B:B,$E$21)\n+SUMIFS('4. Equipment Costs'!H:H,'4. Equipment Costs'!C:C,B33,'4. Equipment Costs'!B:B,$E$21)\n+SUMIFS('5. Subcontracting Costs'!H:H,'5. Subcontracting Costs'!C:C,B33,'5. Subcontracting Costs'!B:B,$E$21)\n+SUMIFS(' 2-3-6. Travel&Costs of Stay'!N:N,' 2-3-6. Travel&Costs of Stay'!C:C,B33,' 2-3-6. Travel&Costs of Stay'!B:B,$E$21)","v":"#ERROR!"},{"$f":"SUMIFS('1. Staff costs'!S:S,'1. Staff costs'!C:C,B33,'1. Staff costs'!B:B,$F$21)\n+SUMIFS(' 2-3-6. Travel&Costs of Stay'!O:O,' 2-3-6. Travel&Costs of Stay'!C:C,B33,' 2-3-6. Travel&Costs of Stay'!B:B,$F$21)\n+SUMIFS(' 2-3-6. Travel&Costs of Stay'!P:P,' 2-3-6. Travel&Costs of Stay'!C:C,B33,' 2-3-6. Travel&Costs of Stay'!B:B,$F$21)\n+SUMIFS('4. Equipment Costs'!H:H,'4. Equipment Costs'!C:C,B33,'4. Equipment Costs'!B:B,$F$21)\n+SUMIFS('5. Subcontracting Costs'!H:H,'5. Subcontracting Costs'!C:C,B33,'5. Subcontracting Costs'!B:B,$F$21)\n+SUMIFS(' 2-3-6. Travel&Costs of Stay'!N:N,' 2-3-6. Travel&Costs of Stay'!C:C,B33,' 2-3-6. Travel&Costs of Stay'!B:B,$F$21)","v":"#ERROR!"},{"$f":"SUMIFS('1. Staff costs'!S:S,'1. Staff costs'!C:C,B33,'1. Staff costs'!B:B,$G$21)\n+SUMIFS(' 2-3-6. Travel&Costs of Stay'!O:O,' 2-3-6. Travel&Costs of Stay'!C:C,B33,' 2-3-6. Travel&Costs of Stay'!B:B,$G$21)\n+SUMIFS(' 2-3-6. Travel&Costs of Stay'!P:P,' 2-3-6. Travel&Costs of Stay'!C:C,B33,' 2-3-6. Travel&Costs of Stay'!B:B,$G$21)\n+SUMIFS('4. Equipment Costs'!H:H,'4. Equipment Costs'!C:C,B33,'4. Equipment Costs'!B:B,$G$21)\n+SUMIFS('5. Subcontracting Costs'!H:H,'5. Subcontracting Costs'!C:C,B33,'5. Subcontracting Costs'!B:B,$G$21)\n+SUMIFS(' 2-3-6. Travel&Costs of Stay'!N:N,' 2-3-6. Travel&Costs of Stay'!C:C,B33,' 2-3-6. Travel&Costs of Stay'!B:B,$G$21)","v":"#ERROR!"},"#ERROR!"]
[null,"P13",{"$f":"SUMIFS('1. Staff costs'!S:S,'1. Staff costs'!C:C,B34,'1. Staff costs'!B:B,$C$21)\n+SUMIFS(' 2-3-6. Travel&Costs of Stay'!O:O,' 2-3-6. Travel&Costs of Stay'!C:C,B34,' 2-3-6. Travel&Costs of Stay'!B:B,$C$21)\n+SUMIFS(' 2-3-6. Travel&Costs of Stay'!P:P,' 2-3-6. Travel&Costs of Stay'!C:C,B34,' 2-3-6. Travel&Costs of Stay'!B:B,$C$21)\n+SUMIFS('4. Equipment Costs'!H:H,'4. Equipment Costs'!C:C,B34,'4. Equipment Costs'!B:B,$C$21)\n+SUMIFS('5. Subcontracting Costs'!H:H,'5. Subcontracting Costs'!C:C,B34,'5. Subcontracting Costs'!B:B,$C$21)\n+SUMIFS(' 2-3-6. Travel&Costs of Stay'!N:N,' 2-3-6. Travel&Costs of Stay'!C:C,B34,' 2-3-6. Travel&Costs of Stay'!B:B,$C$21)","v":0},{"$f":"SUMIFS('1. Staff costs'!S:S,'1. Staff costs'!C:C,B34,'1. Staff costs'!B:B,$D$21)\n+SUMIFS(' 2-3-6. Travel&Costs of Stay'!O:O,' 2-3-6. Travel&Costs of Stay'!C:C,B34,' 2-3-6. Travel&Costs of Stay'!B:B,$D$21)\n+SUMIFS(' 2-3-6. Travel&Costs of Stay'!P:P,' 2-3-6. Travel&Costs of Stay'!C:C,B34,' 2-3-6. Travel&Costs of Stay'!B:B,$D$21)\n+SUMIFS('4. Equipment Costs'!H:H,'4. Equipment Costs'!C:C,B34,'4. Equipment Costs'!B:B,$D$21)\n+SUMIFS('5. Subcontracting Costs'!H:H,'5. Subcontracting Costs'!C:C,B34,'5. Subcontracting Costs'!B:B,$D$21)\n+SUMIFS(' 2-3-6. Travel&Costs of Stay'!N:N,' 2-3-6. Travel&Costs of Stay'!C:C,B34,' 2-3-6. Travel&Costs of Stay'!B:B,$D$21)","v":0},{"$f":"SUMIFS('1. Staff costs'!S:S,'1. Staff costs'!C:C,B34,'1. Staff costs'!B:B,$E$21)\n+SUMIFS(' 2-3-6. Travel&Costs of Stay'!O:O,' 2-3-6. Travel&Costs of Stay'!C:C,B34,' 2-3-6. Travel&Costs of Stay'!B:B,$E$21)\n+SUMIFS(' 2-3-6. Travel&Costs of Stay'!P:P,' 2-3-6. Travel&Costs of Stay'!C:C,B34,' 2-3-6. Travel&Costs of Stay'!B:B,$E$21)\n+SUMIFS('4. Equipment Costs'!H:H,'4. Equipment Costs'!C:C,B34,'4. Equipment Costs'!B:B,$E$21)\n+SUMIFS('5. Subcontracting Costs'!H:H,'5. Subcontracting Costs'!C:C,B34,'5. Subcontracting Costs'!B:B,$E$21)\n+SUMIFS(' 2-3-6. Travel&Costs of Stay'!N:N,' 2-3-6. Travel&Costs of Stay'!C:C,B34,' 2-3-6. Travel&Costs of Stay'!B:B,$E$21)","v":0},{"$f":"SUMIFS('1. Staff costs'!S:S,'1. Staff costs'!C:C,B34,'1. Staff costs'!B:B,$F$21)\n+SUMIFS(' 2-3-6. Travel&Costs of Stay'!O:O,' 2-3-6. Travel&Costs of Stay'!C:C,B34,' 2-3-6. Travel&Costs of Stay'!B:B,$F$21)\n+SUMIFS(' 2-3-6. Travel&Costs of Stay'!P:P,' 2-3-6. Travel&Costs of Stay'!C:C,B34,' 2-3-6. Travel&Costs of Stay'!B:B,$F$21)\n+SUMIFS('4. Equipment Costs'!H:H,'4. Equipment Costs'!C:C,B34,'4. Equipment Costs'!B:B,$F$21)\n+SUMIFS('5. Subcontracting Costs'!H:H,'5. Subcontracting Costs'!C:C,B34,'5. Subcontracting Costs'!B:B,$F$21)\n+SUMIFS(' 2-3-6. Travel&Costs of Stay'!N:N,' 2-3-6. Travel&Costs of Stay'!C:C,B34,' 2-3-6. Travel&Costs of Stay'!B:B,$F$21)","v":0},{"$f":"SUMIFS('1. Staff costs'!S:S,'1. Staff costs'!C:C,B34,'1. Staff costs'!B:B,$G$21)\n+SUMIFS(' 2-3-6. Travel&Costs of Stay'!O:O,' 2-3-6. Travel&Costs of Stay'!C:C,B34,' 2-3-6. Travel&Costs of Stay'!B:B,$G$21)\n+SUMIFS(' 2-3-6. Travel&Costs of Stay'!P:P,' 2-3-6. Travel&Costs of Stay'!C:C,B34,' 2-3-6. Travel&Costs of Stay'!B:B,$G$21)\n+SUMIFS('4. Equipment Costs'!H:H,'4. Equipment Costs'!C:C,B34,'4. Equipment Costs'!B:B,$G$21)\n+SUMIFS('5. Subcontracting Costs'!H:H,'5. Subcontracting Costs'!C:C,B34,'5. Subcontracting Costs'!B:B,$G$21)\n+SUMIFS(' 2-3-6. Travel&Costs of Stay'!N:N,' 2-3-6. Travel&Costs of Stay'!C:C,B34,' 2-3-6. Travel&Costs of Stay'!B:B,$G$21)","v":0},0]
[null,"P14",{"$f":"SUMIFS('1. Staff costs'!S:S,'1. Staff costs'!C:C,B35,'1. Staff costs'!B:B,$C$21)\n+SUMIFS(' 2-3-6. Travel&Costs of Stay'!O:O,' 2-3-6. Travel&Costs of Stay'!C:C,B35,' 2-3-6. Travel&Costs of Stay'!B:B,$C$21)\n+SUMIFS(' 2-3-6. Travel&Costs of Stay'!P:P,' 2-3-6. Travel&Costs of Stay'!C:C,B35,' 2-3-6. Travel&Costs of Stay'!B:B,$C$21)\n+SUMIFS('4. Equipment Costs'!H:H,'4. Equipment Costs'!C:C,B35,'4. Equipment Costs'!B:B,$C$21)\n+SUMIFS('5. Subcontracting Costs'!H:H,'5. Subcontracting Costs'!C:C,B35,'5. Subcontracting Costs'!B:B,$C$21)\n+SUMIFS(' 2-3-6. Travel&Costs of Stay'!N:N,' 2-3-6. Travel&Costs of Stay'!C:C,B35,' 2-3-6. Travel&Costs of Stay'!B:B,$C$21)","v":0},{"$f":"SUMIFS('1. Staff costs'!S:S,'1. Staff costs'!C:C,B35,'1. Staff costs'!B:B,$D$21)\n+SUMIFS(' 2-3-6. Travel&Costs of Stay'!O:O,' 2-3-6. Travel&Costs of Stay'!C:C,B35,' 2-3-6. Travel&Costs of Stay'!B:B,$D$21)\n+SUMIFS(' 2-3-6. Travel&Costs of Stay'!P:P,' 2-3-6. Travel&Costs of Stay'!C:C,B35,' 2-3-6. Travel&Costs of Stay'!B:B,$D$21)\n+SUMIFS('4. Equipment Costs'!H:H,'4. Equipment Costs'!C:C,B35,'4. Equipment Costs'!B:B,$D$21)\n+SUMIFS('5. Subcontracting Costs'!H:H,'5. Subcontracting Costs'!C:C,B35,'5. Subcontracting Costs'!B:B,$D$21)\n+SUMIFS(' 2-3-6. Travel&Costs of Stay'!N:N,' 2-3-6. Travel&Costs of Stay'!C:C,B35,' 2-3-6. Travel&Costs of Stay'!B:B,$D$21)","v":0},{"$f":"SUMIFS('1. Staff costs'!S:S,'1. Staff costs'!C:C,B35,'1. Staff costs'!B:B,$E$21)\n+SUMIFS(' 2-3-6. Travel&Costs of Stay'!O:O,' 2-3-6. Travel&Costs of Stay'!C:C,B35,' 2-3-6. Travel&Costs of Stay'!B:B,$E$21)\n+SUMIFS(' 2-3-6. Travel&Costs of Stay'!P:P,' 2-3-6. Travel&Costs of Stay'!C:C,B35,' 2-3-6. Travel&Costs of Stay'!B:B,$E$21)\n+SUMIFS('4. Equipment Costs'!H:H,'4. Equipment Costs'!C:C,B35,'4. Equipment Costs'!B:B,$E$21)\n+SUMIFS('5. Subcontracting Costs'!H:H,'5. Subcontracting Costs'!C:C,B35,'5. Subcontracting Costs'!B:B,$E$21)\n+SUMIFS(' 2-3-6. Travel&Costs of Stay'!N:N,' 2-3-6. Travel&Costs of Stay'!C:C,B35,' 2-3-6. Travel&Costs of Stay'!B:B,$E$21)","v":0},{"$f":"SUMIFS('1. Staff costs'!S:S,'1. Staff costs'!C:C,B35,'1. Staff costs'!B:B,$F$21)\n+SUMIFS(' 2-3-6. Travel&Costs of Stay'!O:O,' 2-3-6. Travel&Costs of Stay'!C:C,B35,' 2-3-6. Travel&Costs of Stay'!B:B,$F$21)\n+SUMIFS(' 2-3-6. Travel&Costs of Stay'!P:P,' 2-3-6. Travel&Costs of Stay'!C:C,B35,' 2-3-6. Travel&Costs of Stay'!B:B,$F$21)\n+SUMIFS('4. Equipment Costs'!H:H,'4. Equipment Costs'!C:C,B35,'4. Equipment Costs'!B:B,$F$21)\n+SUMIFS('5. Subcontracting Costs'!H:H,'5. Subcontracting Costs'!C:C,B35,'5. Subcontracting Costs'!B:B,$F$21)\n+SUMIFS(' 2-3-6. Travel&Costs of Stay'!N:N,' 2-3-6. Travel&Costs of Stay'!C:C,B35,' 2-3-6. Travel&Costs of Stay'!B:B,$F$21)","v":0},{"$f":"SUMIFS('1. Staff costs'!S:S,'1. Staff costs'!C:C,B35,'1. Staff costs'!B:B,$G$21)\n+SUMIFS(' 2-3-6. Travel&Costs of Stay'!O:O,' 2-3-6. Travel&Costs of Stay'!C:C,B35,' 2-3-6. Travel&Costs of Stay'!B:B,$G$21)\n+SUMIFS(' 2-3-6. Travel&Costs of Stay'!P:P,' 2-3-6. Travel&Costs of Stay'!C:C,B35,' 2-3-6. Travel&Costs of Stay'!B:B,$G$21)\n+SUMIFS('4. Equipment Costs'!H:H,'4. Equipment Costs'!C:C,B35,'4. Equipment Costs'!B:B,$G$21)\n+SUMIFS('5. Subcontracting Costs'!H:H,'5. Subcontracting Costs'!C:C,B35,'5. Subcontracting Costs'!B:B,$G$21)\n+SUMIFS(' 2-3-6. Travel&Costs of Stay'!N:N,' 2-3-6. Travel&Costs of Stay'!C:C,B35,' 2-3-6. Travel&Costs of Stay'!B:B,$G$21)","v":0},0]
[null,"P15",{"$f":"SUMIFS('1. Staff costs'!S:S,'1. Staff costs'!C:C,B36,'1. Staff costs'!B:B,$C$21)\n+SUMIFS(' 2-3-6. Travel&Costs of Stay'!O:O,' 2-3-6. Travel&Costs of Stay'!C:C,B36,' 2-3-6. Travel&Costs of Stay'!B:B,$C$21)\n+SUMIFS(' 2-3-6. Travel&Costs of Stay'!P:P,' 2-3-6. Travel&Costs of Stay'!C:C,B36,' 2-3-6. Travel&Costs of Stay'!B:B,$C$21)\n+SUMIFS('4. Equipment Costs'!H:H,'4. Equipment Costs'!C:C,B36,'4. Equipment Costs'!B:B,$C$21)\n+SUMIFS('5. Subcontracting Costs'!H:H,'5. Subcontracting Costs'!C:C,B36,'5. Subcontracting Costs'!B:B,$C$21)\n+SUMIFS(' 2-3-6. Travel&Costs of Stay'!N:N,' 2-3-6. Travel&Costs of Stay'!C:C,B36,' 2-3-6. Travel&Costs of Stay'!B:B,$C$21)","v":0},{"$f":"SUMIFS('1. Staff costs'!S:S,'1. Staff costs'!C:C,B36,'1. Staff costs'!B:B,$D$21)\n+SUMIFS(' 2-3-6. Travel&Costs of Stay'!O:O,' 2-3-6. Travel&Costs of Stay'!C:C,B36,' 2-3-6. Travel&Costs of Stay'!B:B,$D$21)\n+SUMIFS(' 2-3-6. Travel&Costs of Stay'!P:P,' 2-3-6. Travel&Costs of Stay'!C:C,B36,' 2-3-6. Travel&Costs of Stay'!B:B,$D$21)\n+SUMIFS('4. Equipment Costs'!H:H,'4. Equipment Costs'!C:C,B36,'4. Equipment Costs'!B:B,$D$21)\n+SUMIFS('5. Subcontracting Costs'!H:H,'5. Subcontracting Costs'!C:C,B36,'5. Subcontracting Costs'!B:B,$D$21)\n+SUMIFS(' 2-3-6. Travel&Costs of Stay'!N:N,' 2-3-6. Travel&Costs of Stay'!C:C,B36,' 2-3-6. Travel&Costs of Stay'!B:B,$D$21)","v":0},{"$f":"SUMIFS('1. Staff costs'!S:S,'1. Staff costs'!C:C,B36,'1. Staff costs'!B:B,$E$21)\n+SUMIFS(' 2-3-6. Travel&Costs of Stay'!O:O,' 2-3-6. Travel&Costs of Stay'!C:C,B36,' 2-3-6. Travel&Costs of Stay'!B:B,$E$21)\n+SUMIFS(' 2-3-6. Travel&Costs of Stay'!P:P,' 2-3-6. Travel&Costs of Stay'!C:C,B36,' 2-3-6. Travel&Costs of Stay'!B:B,$E$21)\n+SUMIFS('4. Equipment Costs'!H:H,'4. Equipment Costs'!C:C,B36,'4. Equipment Costs'!B:B,$E$21)\n+SUMIFS('5. Subcontracting Costs'!H:H,'5. Subcontracting Costs'!C:C,B36,'5. Subcontracting Costs'!B:B,$E$21)\n+SUMIFS(' 2-3-6. Travel&Costs of Stay'!N:N,' 2-3-6. Travel&Costs of Stay'!C:C,B36,' 2-3-6. Travel&Costs of Stay'!B:B,$E$21)","v":0},{"$f":"SUMIFS('1. Staff costs'!S:S,'1. Staff costs'!C:C,B36,'1. Staff costs'!B:B,$F$21)\n+SUMIFS(' 2-3-6. Travel&Costs of Stay'!O:O,' 2-3-6. Travel&Costs of Stay'!C:C,B36,' 2-3-6. Travel&Costs of Stay'!B:B,$F$21)\n+SUMIFS(' 2-3-6. Travel&Costs of Stay'!P:P,' 2-3-6. Travel&Costs of Stay'!C:C,B36,' 2-3-6. Travel&Costs of Stay'!B:B,$F$21)\n+SUMIFS('4. Equipment Costs'!H:H,'4. Equipment Costs'!C:C,B36,'4. Equipment Costs'!B:B,$F$21)\n+SUMIFS('5. Subcontracting Costs'!H:H,'5. Subcontracting Costs'!C:C,B36,'5. Subcontracting Costs'!B:B,$F$21)\n+SUMIFS(' 2-3-6. Travel&Costs of Stay'!N:N,' 2-3-6. Travel&Costs of Stay'!C:C,B36,' 2-3-6. Travel&Costs of Stay'!B:B,$F$21)","v":0},{"$f":"SUMIFS('1. Staff costs'!S:S,'1. Staff costs'!C:C,B36,'1. Staff costs'!B:B,$G$21)\n+SUMIFS(' 2-3-6. Travel&Costs of Stay'!O:O,' 2-3-6. Travel&Costs of Stay'!C:C,B36,' 2-3-6. Travel&Costs of Stay'!B:B,$G$21)\n+SUMIFS(' 2-3-6. Travel&Costs of Stay'!P:P,' 2-3-6. Travel&Costs of Stay'!C:C,B36,' 2-3-6. Travel&Costs of Stay'!B:B,$G$21)\n+SUMIFS('4. Equipment Costs'!H:H,'4. Equipment Costs'!C:C,B36,'4. Equipment Costs'!B:B,$G$21)\n+SUMIFS('5. Subcontracting Costs'!H:H,'5. Subcontracting Costs'!C:C,B36,'5. Subcontracting Costs'!B:B,$G$21)\n+SUMIFS(' 2-3-6. Travel&Costs of Stay'!N:N,' 2-3-6. Travel&Costs of Stay'!C:C,B36,' 2-3-6. Travel&Costs of Stay'!B:B,$G$21)","v":0},0]
[null,"P16",{"$f":"SUMIFS('1. Staff costs'!S:S,'1. Staff costs'!C:C,B37,'1. Staff costs'!B:B,$C$21)\n+SUMIFS(' 2-3-6. Travel&Costs of Stay'!O:O,' 2-3-6. Travel&Costs of Stay'!C:C,B37,' 2-3-6. Travel&Costs of Stay'!B:B,$C$21)\n+SUMIFS(' 2-3-6. Travel&Costs of Stay'!P:P,' 2-3-6. Travel&Costs of Stay'!C:C,B37,' 2-3-6. Travel&Costs of Stay'!B:B,$C$21)\n+SUMIFS('4. Equipment Costs'!H:H,'4. Equipment Costs'!C:C,B37,'4. Equipment Costs'!B:B,$C$21)\n+SUMIFS('5. Subcontracting Costs'!H:H,'5. Subcontracting Costs'!C:C,B37,'5. Subcontracting Costs'!B:B,$C$21)\n+SUMIFS(' 2-3-6. Travel&Costs of Stay'!N:N,' 2-3-6. Travel&Costs of Stay'!C:C,B37,' 2-3-6. Travel&Costs of Stay'!B:B,$C$21)","v":0},{"$f":"SUMIFS('1. Staff costs'!S:S,'1. Staff costs'!C:C,B37,'1. Staff costs'!B:B,$D$21)\n+SUMIFS(' 2-3-6. Travel&Costs of Stay'!O:O,' 2-3-6. Travel&Costs of Stay'!C:C,B37,' 2-3-6. Travel&Costs of Stay'!B:B,$D$21)\n+SUMIFS(' 2-3-6. Travel&Costs of Stay'!P:P,' 2-3-6. Travel&Costs of Stay'!C:C,B37,' 2-3-6. Travel&Costs of Stay'!B:B,$D$21)\n+SUMIFS('4. Equipment Costs'!H:H,'4. Equipment Costs'!C:C,B37,'4. Equipment Costs'!B:B,$D$21)\n+SUMIFS('5. Subcontracting Costs'!H:H,'5. Subcontracting Costs'!C:C,B37,'5. Subcontracting Costs'!B:B,$D$21)\n+SUMIFS(' 2-3-6. Travel&Costs of Stay'!N:N,' 2-3-6. Travel&Costs of Stay'!C:C,B37,' 2-3-6. Travel&Costs of Stay'!B:B,$D$21)","v":0},{"$f":"SUMIFS('1. Staff costs'!S:S,'1. Staff costs'!C:C,B37,'1. Staff costs'!B:B,$E$21)\n+SUMIFS(' 2-3-6. Travel&Costs of Stay'!O:O,' 2-3-6. Travel&Costs of Stay'!C:C,B37,' 2-3-6. Travel&Costs of Stay'!B:B,$E$21)\n+SUMIFS(' 2-3-6. Travel&Costs of Stay'!P:P,' 2-3-6. Travel&Costs of Stay'!C:C,B37,' 2-3-6. Travel&Costs of Stay'!B:B,$E$21)\n+SUMIFS('4. Equipment Costs'!H:H,'4. Equipment Costs'!C:C,B37,'4. Equipment Costs'!B:B,$E$21)\n+SUMIFS('5. Subcontracting Costs'!H:H,'5. Subcontracting Costs'!C:C,B37,'5. Subcontracting Costs'!B:B,$E$21)\n+SUMIFS(' 2-3-6. Travel&Costs of Stay'!N:N,' 2-3-6. Travel&Costs of Stay'!C:C,B37,' 2-3-6. Travel&Costs of Stay'!B:B,$E$21)","v":0},{"$f":"SUMIFS('1. Staff costs'!S:S,'1. Staff costs'!C:C,B37,'1. Staff costs'!B:B,$F$21)\n+SUMIFS(' 2-3-6. Travel&Costs of Stay'!O:O,' 2-3-6. Travel&Costs of Stay'!C:C,B37,' 2-3-6. Travel&Costs of Stay'!B:B,$F$21)\n+SUMIFS(' 2-3-6. Travel&Costs of Stay'!P:P,' 2-3-6. Travel&Costs of Stay'!C:C,B37,' 2-3-6. Travel&Costs of Stay'!B:B,$F$21)\n+SUMIFS('4. Equipment Costs'!H:H,'4. Equipment Costs'!C:C,B37,'4. Equipment Costs'!B:B,$F$21)\n+SUMIFS('5. Subcontracting Costs'!H:H,'5. Subcontracting Costs'!C:C,B37,'5. Subcontracting Costs'!B:B,$F$21)\n+SUMIFS(' 2-3-6. Travel&Costs of Stay'!N:N,' 2-3-6. Travel&Costs of Stay'!C:C,B37,' 2-3-6. Travel&Costs of Stay'!B:B,$F$21)","v":0},{"$f":"SUMIFS('1. Staff costs'!S:S,'1. Staff costs'!C:C,B37,'1. Staff costs'!B:B,$G$21)\n+SUMIFS(' 2-3-6. Travel&Costs of Stay'!O:O,' 2-3-6. Travel&Costs of Stay'!C:C,B37,' 2-3-6. Travel&Costs of Stay'!B:B,$G$21)\n+SUMIFS(' 2-3-6. Travel&Costs of Stay'!P:P,' 2-3-6. Travel&Costs of Stay'!C:C,B37,' 2-3-6. Travel&Costs of Stay'!B:B,$G$21)\n+SUMIFS('4. Equipment Costs'!H:H,'4. Equipment Costs'!C:C,B37,'4. Equipment Costs'!B:B,$G$21)\n+SUMIFS('5. Subcontracting Costs'!H:H,'5. Subcontracting Costs'!C:C,B37,'5. Subcontracting Costs'!B:B,$G$21)\n+SUMIFS(' 2-3-6. Travel&Costs of Stay'!N:N,' 2-3-6. Travel&Costs of Stay'!C:C,B37,' 2-3-6. Travel&Costs of Stay'!B:B,$G$21)","v":0},0]
[null,"P17",{"$f":"SUMIFS('1. Staff costs'!S:S,'1. Staff costs'!C:C,B38,'1. Staff costs'!B:B,$C$21)\n+SUMIFS(' 2-3-6. Travel&Costs of Stay'!O:O,' 2-3-6. Travel&Costs of Stay'!C:C,B38,' 2-3-6. Travel&Costs of Stay'!B:B,$C$21)\n+SUMIFS(' 2-3-6. Travel&Costs of Stay'!P:P,' 2-3-6. Travel&Costs of Stay'!C:C,B38,' 2-3-6. Travel&Costs of Stay'!B:B,$C$21)\n+SUMIFS('4. Equipment Costs'!H:H,'4. Equipment Costs'!C:C,B38,'4. Equipment Costs'!B:B,$C$21)\n+SUMIFS('5. Subcontracting Costs'!H:H,'5. Subcontracting Costs'!C:C,B38,'5. Subcontracting Costs'!B:B,$C$21)\n+SUMIFS(' 2-3-6. Travel&Costs of Stay'!N:N,' 2-3-6. Travel&Costs of Stay'!C:C,B38,' 2-3-6. Travel&Costs of Stay'!B:B,$C$21)","v":0},{"$f":"SUMIFS('1. Staff costs'!S:S,'1. Staff costs'!C:C,B38,'1. Staff costs'!B:B,$D$21)\n+SUMIFS(' 2-3-6. Travel&Costs of Stay'!O:O,' 2-3-6. Travel&Costs of Stay'!C:C,B38,' 2-3-6. Travel&Costs of Stay'!B:B,$D$21)\n+SUMIFS(' 2-3-6. Travel&Costs of Stay'!P:P,' 2-3-6. Travel&Costs of Stay'!C:C,B38,' 2-3-6. Travel&Costs of Stay'!B:B,$D$21)\n+SUMIFS('4. Equipment Costs'!H:H,'4. Equipment Costs'!C:C,B38,'4. Equipment Costs'!B:B,$D$21)\n+SUMIFS('5. Subcontracting Costs'!H:H,'5. Subcontracting Costs'!C:C,B38,'5. Subcontracting Costs'!B:B,$D$21)\n+SUMIFS(' 2-3-6. Travel&Costs of Stay'!N:N,' 2-3-6. Travel&Costs of Stay'!C:C,B38,' 2-3-6. Travel&Costs of Stay'!B:B,$D$21)","v":0},{"$f":"SUMIFS('1. Staff costs'!S:S,'1. Staff costs'!C:C,B38,'1. Staff costs'!B:B,$E$21)\n+SUMIFS(' 2-3-6. Travel&Costs of Stay'!O:O,' 2-3-6. Travel&Costs of Stay'!C:C,B38,' 2-3-6. Travel&Costs of Stay'!B:B,$E$21)\n+SUMIFS(' 2-3-6. Travel&Costs of Stay'!P:P,' 2-3-6. Travel&Costs of Stay'!C:C,B38,' 2-3-6. Travel&Costs of Stay'!B:B,$E$21)\n+SUMIFS('4. Equipment Costs'!H:H,'4. Equipment Costs'!C:C,B38,'4. Equipment Costs'!B:B,$E$21)\n+SUMIFS('5. Subcontracting Costs'!H:H,'5. Subcontracting Costs'!C:C,B38,'5. Subcontracting Costs'!B:B,$E$21)\n+SUMIFS(' 2-3-6. Travel&Costs of Stay'!N:N,' 2-3-6. Travel&Costs of Stay'!C:C,B38,' 2-3-6. Travel&Costs of Stay'!B:B,$E$21)","v":0},{"$f":"SUMIFS('1. Staff costs'!S:S,'1. Staff costs'!C:C,B38,'1. Staff costs'!B:B,$F$21)\n+SUMIFS(' 2-3-6. Travel&Costs of Stay'!O:O,' 2-3-6. Travel&Costs of Stay'!C:C,B38,' 2-3-6. Travel&Costs of Stay'!B:B,$F$21)\n+SUMIFS(' 2-3-6. Travel&Costs of Stay'!P:P,' 2-3-6. Travel&Costs of Stay'!C:C,B38,' 2-3-6. Travel&Costs of Stay'!B:B,$F$21)\n+SUMIFS('4. Equipment Costs'!H:H,'4. Equipment Costs'!C:C,B38,'4. Equipment Costs'!B:B,$F$21)\n+SUMIFS('5. Subcontracting Costs'!H:H,'5. Subcontracting Costs'!C:C,B38,'5. Subcontracting Costs'!B:B,$F$21)\n+SUMIFS(' 2-3-6. Travel&Costs of Stay'!N:N,' 2-3-6. Travel&Costs of Stay'!C:C,B38,' 2-3-6. Travel&Costs of Stay'!B:B,$F$21)","v":0},{"$f":"SUMIFS('1. Staff costs'!S:S,'1. Staff costs'!C:C,B38,'1. Staff costs'!B:B,$G$21)\n+SUMIFS(' 2-3-6. Travel&Costs of Stay'!O:O,' 2-3-6. Travel&Costs of Stay'!C:C,B38,' 2-3-6. Travel&Costs of Stay'!B:B,$G$21)\n+SUMIFS(' 2-3-6. Travel&Costs of Stay'!P:P,' 2-3-6. Travel&Costs of Stay'!C:C,B38,' 2-3-6. Travel&Costs of Stay'!B:B,$G$21)\n+SUMIFS('4. Equipment Costs'!H:H,'4. Equipment Costs'!C:C,B38,'4. Equipment Costs'!B:B,$G$21)\n+SUMIFS('5. Subcontracting Costs'!H:H,'5. Subcontracting Costs'!C:C,B38,'5. Subcontracting Costs'!B:B,$G$21)\n+SUMIFS(' 2-3-6. Travel&Costs of Stay'!N:N,' 2-3-6. Travel&Costs of Stay'!C:C,B38,' 2-3-6. Travel&Costs of Stay'!B:B,$G$21)","v":0},0]
[null,"P18",{"$f":"SUMIFS('1. Staff costs'!S:S,'1. Staff costs'!C:C,B39,'1. Staff costs'!B:B,$C$21)\n+SUMIFS(' 2-3-6. Travel&Costs of Stay'!O:O,' 2-3-6. Travel&Costs of Stay'!C:C,B39,' 2-3-6. Travel&Costs of Stay'!B:B,$C$21)\n+SUMIFS(' 2-3-6. Travel&Costs of Stay'!P:P,' 2-3-6. Travel&Costs of Stay'!C:C,B39,' 2-3-6. Travel&Costs of Stay'!B:B,$C$21)\n+SUMIFS('4. Equipment Costs'!H:H,'4. Equipment Costs'!C:C,B39,'4. Equipment Costs'!B:B,$C$21)\n+SUMIFS('5. Subcontracting Costs'!H:H,'5. Subcontracting Costs'!C:C,B39,'5. Subcontracting Costs'!B:B,$C$21)\n+SUMIFS(' 2-3-6. Travel&Costs of Stay'!N:N,' 2-3-6. Travel&Costs of Stay'!C:C,B39,' 2-3-6. Travel&Costs of Stay'!B:B,$C$21)","v":0},{"$f":"SUMIFS('1. Staff costs'!S:S,'1. Staff costs'!C:C,B39,'1. Staff costs'!B:B,$D$21)\n+SUMIFS(' 2-3-6. Travel&Costs of Stay'!O:O,' 2-3-6. Travel&Costs of Stay'!C:C,B39,' 2-3-6. Travel&Costs of Stay'!B:B,$D$21)\n+SUMIFS(' 2-3-6. Travel&Costs of Stay'!P:P,' 2-3-6. Travel&Costs of Stay'!C:C,B39,' 2-3-6. Travel&Costs of Stay'!B:B,$D$21)\n+SUMIFS('4. Equipment Costs'!H:H,'4. Equipment Costs'!C:C,B39,'4. Equipment Costs'!B:B,$D$21)\n+SUMIFS('5. Subcontracting Costs'!H:H,'5. Subcontracting Costs'!C:C,B39,'5. Subcontracting Costs'!B:B,$D$21)\n+SUMIFS(' 2-3-6. Travel&Costs of Stay'!N:N,' 2-3-6. Travel&Costs of Stay'!C:C,B39,' 2-3-6. Travel&Costs of Stay'!B:B,$D$21)","v":0},{"$f":"SUMIFS('1. Staff costs'!S:S,'1. Staff costs'!C:C,B39,'1. Staff costs'!B:B,$E$21)\n+SUMIFS(' 2-3-6. Travel&Costs of Stay'!O:O,' 2-3-6. Travel&Costs of Stay'!C:C,B39,' 2-3-6. Travel&Costs of Stay'!B:B,$E$21)\n+SUMIFS(' 2-3-6. Travel&Costs of Stay'!P:P,' 2-3-6. Travel&Costs of Stay'!C:C,B39,' 2-3-6. Travel&Costs of Stay'!B:B,$E$21)\n+SUMIFS('4. Equipment Costs'!H:H,'4. Equipment Costs'!C:C,B39,'4. Equipment Costs'!B:B,$E$21)\n+SUMIFS('5. Subcontracting Costs'!H:H,'5. Subcontracting Costs'!C:C,B39,'5. Subcontracting Costs'!B:B,$E$21)\n+SUMIFS(' 2-3-6. Travel&Costs of Stay'!N:N,' 2-3-6. Travel&Costs of Stay'!C:C,B39,' 2-3-6. Travel&Costs of Stay'!B:B,$E$21)","v":0},{"$f":"SUMIFS('1. Staff costs'!S:S,'1. Staff costs'!C:C,B39,'1. Staff costs'!B:B,$F$21)\n+SUMIFS(' 2-3-6. Travel&Costs of Stay'!O:O,' 2-3-6. Travel&Costs of Stay'!C:C,B39,' 2-3-6. Travel&Costs of Stay'!B:B,$F$21)\n+SUMIFS(' 2-3-6. Travel&Costs of Stay'!P:P,' 2-3-6. Travel&Costs of Stay'!C:C,B39,' 2-3-6. Travel&Costs of Stay'!B:B,$F$21)\n+SUMIFS('4. Equipment Costs'!H:H,'4. Equipment Costs'!C:C,B39,'4. Equipment Costs'!B:B,$F$21)\n+SUMIFS('5. Subcontracting Costs'!H:H,'5. Subcontracting Costs'!C:C,B39,'5. Subcontracting Costs'!B:B,$F$21)\n+SUMIFS(' 2-3-6. Travel&Costs of Stay'!N:N,' 2-3-6. Travel&Costs of Stay'!C:C,B39,' 2-3-6. Travel&Costs of Stay'!B:B,$F$21)","v":0},{"$f":"SUMIFS('1. Staff costs'!S:S,'1. Staff costs'!C:C,B39,'1. Staff costs'!B:B,$G$21)\n+SUMIFS(' 2-3-6. Travel&Costs of Stay'!O:O,' 2-3-6. Travel&Costs of Stay'!C:C,B39,' 2-3-6. Travel&Costs of Stay'!B:B,$G$21)\n+SUMIFS(' 2-3-6. Travel&Costs of Stay'!P:P,' 2-3-6. Travel&Costs of Stay'!C:C,B39,' 2-3-6. Travel&Costs of Stay'!B:B,$G$21)\n+SUMIFS('4. Equipment Costs'!H:H,'4. Equipment Costs'!C:C,B39,'4. Equipment Costs'!B:B,$G$21)\n+SUMIFS('5. Subcontracting Costs'!H:H,'5. Subcontracting Costs'!C:C,B39,'5. Subcontracting Costs'!B:B,$G$21)\n+SUMIFS(' 2-3-6. Travel&Costs of Stay'!N:N,' 2-3-6. Travel&Costs of Stay'!C:C,B39,' 2-3-6. Travel&Costs of Stay'!B:B,$G$21)","v":0},0]
[null,"P19",{"$f":"SUMIFS('1. Staff costs'!S:S,'1. Staff costs'!C:C,B40,'1. Staff costs'!B:B,$C$21)\n+SUMIFS(' 2-3-6. Travel&Costs of Stay'!O:O,' 2-3-6. Travel&Costs of Stay'!C:C,B40,' 2-3-6. Travel&Costs of Stay'!B:B,$C$21)\n+SUMIFS(' 2-3-6. Travel&Costs of Stay'!P:P,' 2-3-6. Travel&Costs of Stay'!C:C,B40,' 2-3-6. Travel&Costs of Stay'!B:B,$C$21)\n+SUMIFS('4. Equipment Costs'!H:H,'4. Equipment Costs'!C:C,B40,'4. Equipment Costs'!B:B,$C$21)\n+SUMIFS('5. Subcontracting Costs'!H:H,'5. Subcontracting Costs'!C:C,B40,'5. Subcontracting Costs'!B:B,$C$21)\n+SUMIFS(' 2-3-6. Travel&Costs of Stay'!N:N,' 2-3-6. Travel&Costs of Stay'!C:C,B40,' 2-3-6. Travel&Costs of Stay'!B:B,$C$21)","v":0},{"$f":"SUMIFS('1. Staff costs'!S:S,'1. Staff costs'!C:C,B40,'1. Staff costs'!B:B,$D$21)\n+SUMIFS(' 2-3-6. Travel&Costs of Stay'!O:O,' 2-3-6. Travel&Costs of Stay'!C:C,B40,' 2-3-6. Travel&Costs of Stay'!B:B,$D$21)\n+SUMIFS(' 2-3-6. Travel&Costs of Stay'!P:P,' 2-3-6. Travel&Costs of Stay'!C:C,B40,' 2-3-6. Travel&Costs of Stay'!B:B,$D$21)\n+SUMIFS('4. Equipment Costs'!H:H,'4. Equipment Costs'!C:C,B40,'4. Equipment Costs'!B:B,$D$21)\n+SUMIFS('5. Subcontracting Costs'!H:H,'5. Subcontracting Costs'!C:C,B40,'5. Subcontracting Costs'!B:B,$D$21)\n+SUMIFS(' 2-3-6. Travel&Costs of Stay'!N:N,' 2-3-6. Travel&Costs of Stay'!C:C,B40,' 2-3-6. Travel&Costs of Stay'!B:B,$D$21)","v":0},{"$f":"SUMIFS('1. Staff costs'!S:S,'1. Staff costs'!C:C,B40,'1. Staff costs'!B:B,$E$21)\n+SUMIFS(' 2-3-6. Travel&Costs of Stay'!O:O,' 2-3-6. Travel&Costs of Stay'!C:C,B40,' 2-3-6. Travel&Costs of Stay'!B:B,$E$21)\n+SUMIFS(' 2-3-6. Travel&Costs of Stay'!P:P,' 2-3-6. Travel&Costs of Stay'!C:C,B40,' 2-3-6. Travel&Costs of Stay'!B:B,$E$21)\n+SUMIFS('4. Equipment Costs'!H:H,'4. Equipment Costs'!C:C,B40,'4. Equipment Costs'!B:B,$E$21)\n+SUMIFS('5. Subcontracting Costs'!H:H,'5. Subcontracting Costs'!C:C,B40,'5. Subcontracting Costs'!B:B,$E$21)\n+SUMIFS(' 2-3-6. Travel&Costs of Stay'!N:N,' 2-3-6. Travel&Costs of Stay'!C:C,B40,' 2-3-6. Travel&Costs of Stay'!B:B,$E$21)","v":0},{"$f":"SUMIFS('1. Staff costs'!S:S,'1. Staff costs'!C:C,B40,'1. Staff costs'!B:B,$F$21)\n+SUMIFS(' 2-3-6. Travel&Costs of Stay'!O:O,' 2-3-6. Travel&Costs of Stay'!C:C,B40,' 2-3-6. Travel&Costs of Stay'!B:B,$F$21)\n+SUMIFS(' 2-3-6. Travel&Costs of Stay'!P:P,' 2-3-6. Travel&Costs of Stay'!C:C,B40,' 2-3-6. Travel&Costs of Stay'!B:B,$F$21)\n+SUMIFS('4. Equipment Costs'!H:H,'4. Equipment Costs'!C:C,B40,'4. Equipment Costs'!B:B,$F$21)\n+SUMIFS('5. Subcontracting Costs'!H:H,'5. Subcontracting Costs'!C:C,B40,'5. Subcontracting Costs'!B:B,$F$21)\n+SUMIFS(' 2-3-6. Travel&Costs of Stay'!N:N,' 2-3-6. Travel&Costs of Stay'!C:C,B40,' 2-3-6. Travel&Costs of Stay'!B:B,$F$21)","v":0},{"$f":"SUMIFS('1. Staff costs'!S:S,'1. Staff costs'!C:C,B40,'1. Staff costs'!B:B,$G$21)\n+SUMIFS(' 2-3-6. Travel&Costs of Stay'!O:O,' 2-3-6. Travel&Costs of Stay'!C:C,B40,' 2-3-6. Travel&Costs of Stay'!B:B,$G$21)\n+SUMIFS(' 2-3-6. Travel&Costs of Stay'!P:P,' 2-3-6. Travel&Costs of Stay'!C:C,B40,' 2-3-6. Travel&Costs of Stay'!B:B,$G$21)\n+SUMIFS('4. Equipment Costs'!H:H,'4. Equipment Costs'!C:C,B40,'4. Equipment Costs'!B:B,$G$21)\n+SUMIFS('5. Subcontracting Costs'!H:H,'5. Subcontracting Costs'!C:C,B40,'5. Subcontracting Costs'!B:B,$G$21)\n+SUMIFS(' 2-3-6. Travel&Costs of Stay'!N:N,' 2-3-6. Travel&Costs of Stay'!C:C,B40,' 2-3-6. Travel&Costs of Stay'!B:B,$G$21)","v":0},0]
[null,"P20",{"$f":"SUMIFS('1. Staff costs'!S:S,'1. Staff costs'!C:C,B41,'1. Staff costs'!B:B,$C$21)\n+SUMIFS(' 2-3-6. Travel&Costs of Stay'!O:O,' 2-3-6. Travel&Costs of Stay'!C:C,B41,' 2-3-6. Travel&Costs of Stay'!B:B,$C$21)\n+SUMIFS(' 2-3-6. Travel&Costs of Stay'!P:P,' 2-3-6. Travel&Costs of Stay'!C:C,B41,' 2-3-6. Travel&Costs of Stay'!B:B,$C$21)\n+SUMIFS('4. Equipment Costs'!H:H,'4. Equipment Costs'!C:C,B41,'4. Equipment Costs'!B:B,$C$21)\n+SUMIFS('5. Subcontracting Costs'!H:H,'5. Subcontracting Costs'!C:C,B41,'5. Subcontracting Costs'!B:B,$C$21)\n+SUMIFS(' 2-3-6. Travel&Costs of Stay'!N:N,' 2-3-6. Travel&Costs of Stay'!C:C,B41,' 2-3-6. Travel&Costs of Stay'!B:B,$C$21)","v":0},{"$f":"SUMIFS('1. Staff costs'!S:S,'1. Staff costs'!C:C,B41,'1. Staff costs'!B:B,$D$21)\n+SUMIFS(' 2-3-6. Travel&Costs of Stay'!O:O,' 2-3-6. Travel&Costs of Stay'!C:C,B41,' 2-3-6. Travel&Costs of Stay'!B:B,$D$21)\n+SUMIFS(' 2-3-6. Travel&Costs of Stay'!P:P,' 2-3-6. Travel&Costs of Stay'!C:C,B41,' 2-3-6. Travel&Costs of Stay'!B:B,$D$21)\n+SUMIFS('4. Equipment Costs'!H:H,'4. Equipment Costs'!C:C,B41,'4. Equipment Costs'!B:B,$D$21)\n+SUMIFS('5. Subcontracting Costs'!H:H,'5. Subcontracting Costs'!C:C,B41,'5. Subcontracting Costs'!B:B,$D$21)\n+SUMIFS(' 2-3-6. Travel&Costs of Stay'!N:N,' 2-3-6. Travel&Costs of Stay'!C:C,B41,' 2-3-6. Travel&Costs of Stay'!B:B,$D$21)","v":0},{"$f":"SUMIFS('1. Staff costs'!S:S,'1. Staff costs'!C:C,B41,'1. Staff costs'!B:B,$E$21)\n+SUMIFS(' 2-3-6. Travel&Costs of Stay'!O:O,' 2-3-6. Travel&Costs of Stay'!C:C,B41,' 2-3-6. Travel&Costs of Stay'!B:B,$E$21)\n+SUMIFS(' 2-3-6. Travel&Costs of Stay'!P:P,' 2-3-6. Travel&Costs of Stay'!C:C,B41,' 2-3-6. Travel&Costs of Stay'!B:B,$E$21)\n+SUMIFS('4. Equipment Costs'!H:H,'4. Equipment Costs'!C:C,B41,'4. Equipment Costs'!B:B,$E$21)\n+SUMIFS('5. Subcontracting Costs'!H:H,'5. Subcontracting Costs'!C:C,B41,'5. Subcontracting Costs'!B:B,$E$21)\n+SUMIFS(' 2-3-6. Travel&Costs of Stay'!N:N,' 2-3-6. Travel&Costs of Stay'!C:C,B41,' 2-3-6. Travel&Costs of Stay'!B:B,$E$21)","v":0},{"$f":"SUMIFS('1. Staff costs'!S:S,'1. Staff costs'!C:C,B41,'1. Staff costs'!B:B,$F$21)\n+SUMIFS(' 2-3-6. Travel&Costs of Stay'!O:O,' 2-3-6. Travel&Costs of Stay'!C:C,B41,' 2-3-6. Travel&Costs of Stay'!B:B,$F$21)\n+SUMIFS(' 2-3-6. Travel&Costs of Stay'!P:P,' 2-3-6. Travel&Costs of Stay'!C:C,B41,' 2-3-6. Travel&Costs of Stay'!B:B,$F$21)\n+SUMIFS('4. Equipment Costs'!H:H,'4. Equipment Costs'!C:C,B41,'4. Equipment Costs'!B:B,$F$21)\n+SUMIFS('5. Subcontracting Costs'!H:H,'5. Subcontracting Costs'!C:C,B41,'5. Subcontracting Costs'!B:B,$F$21)\n+SUMIFS(' 2-3-6. Travel&Costs of Stay'!N:N,' 2-3-6. Travel&Costs of Stay'!C:C,B41,' 2-3-6. Travel&Costs of Stay'!B:B,$F$21)","v":0},{"$f":"SUMIFS('1. Staff costs'!S:S,'1. Staff costs'!C:C,B41,'1. Staff costs'!B:B,$G$21)\n+SUMIFS(' 2-3-6. Travel&Costs of Stay'!O:O,' 2-3-6. Travel&Costs of Stay'!C:C,B41,' 2-3-6. Travel&Costs of Stay'!B:B,$G$21)\n+SUMIFS(' 2-3-6. Travel&Costs of Stay'!P:P,' 2-3-6. Travel&Costs of Stay'!C:C,B41,' 2-3-6. Travel&Costs of Stay'!B:B,$G$21)\n+SUMIFS('4. Equipment Costs'!H:H,'4. Equipment Costs'!C:C,B41,'4. Equipment Costs'!B:B,$G$21)\n+SUMIFS('5. Subcontracting Costs'!H:H,'5. Subcontracting Costs'!C:C,B41,'5. Subcontracting Costs'!B:B,$G$21)\n+SUMIFS(' 2-3-6. Travel&Costs of Stay'!N:N,' 2-3-6. Travel&Costs of Stay'!C:C,B41,' 2-3-6. Travel&Costs of Stay'!B:B,$G$21)","v":0},0]
[null,"P21",{"$f":"SUMIFS('1. Staff costs'!S:S,'1. Staff costs'!C:C,B42,'1. Staff costs'!B:B,$C$21)\n+SUMIFS(' 2-3-6. Travel&Costs of Stay'!O:O,' 2-3-6. Travel&Costs of Stay'!C:C,B42,' 2-3-6. Travel&Costs of Stay'!B:B,$C$21)\n+SUMIFS(' 2-3-6. Travel&Costs of Stay'!P:P,' 2-3-6. Travel&Costs of Stay'!C:C,B42,' 2-3-6. Travel&Costs of Stay'!B:B,$C$21)\n+SUMIFS('4. Equipment Costs'!H:H,'4. Equipment Costs'!C:C,B42,'4. Equipment Costs'!B:B,$C$21)\n+SUMIFS('5. Subcontracting Costs'!H:H,'5. Subcontracting Costs'!C:C,B42,'5. Subcontracting Costs'!B:B,$C$21)\n+SUMIFS(' 2-3-6. Travel&Costs of Stay'!N:N,' 2-3-6. Travel&Costs of Stay'!C:C,B42,' 2-3-6. Travel&Costs of Stay'!B:B,$C$21)","v":0},{"$f":"SUMIFS('1. Staff costs'!S:S,'1. Staff costs'!C:C,B42,'1. Staff costs'!B:B,$D$21)\n+SUMIFS(' 2-3-6. Travel&Costs of Stay'!O:O,' 2-3-6. Travel&Costs of Stay'!C:C,B42,' 2-3-6. Travel&Costs of Stay'!B:B,$D$21)\n+SUMIFS(' 2-3-6. Travel&Costs of Stay'!P:P,' 2-3-6. Travel&Costs of Stay'!C:C,B42,' 2-3-6. Travel&Costs of Stay'!B:B,$D$21)\n+SUMIFS('4. Equipment Costs'!H:H,'4. Equipment Costs'!C:C,B42,'4. Equipment Costs'!B:B,$D$21)\n+SUMIFS('5. Subcontracting Costs'!H:H,'5. Subcontracting Costs'!C:C,B42,'5. Subcontracting Costs'!B:B,$D$21)\n+SUMIFS(' 2-3-6. Travel&Costs of Stay'!N:N,' 2-3-6. Travel&Costs of Stay'!C:C,B42,' 2-3-6. Travel&Costs of Stay'!B:B,$D$21)","v":0},{"$f":"SUMIFS('1. Staff costs'!S:S,'1. Staff costs'!C:C,B42,'1. Staff costs'!B:B,$E$21)\n+SUMIFS(' 2-3-6. Travel&Costs of Stay'!O:O,' 2-3-6. Travel&Costs of Stay'!C:C,B42,' 2-3-6. Travel&Costs of Stay'!B:B,$E$21)\n+SUMIFS(' 2-3-6. Travel&Costs of Stay'!P:P,' 2-3-6. Travel&Costs of Stay'!C:C,B42,' 2-3-6. Travel&Costs of Stay'!B:B,$E$21)\n+SUMIFS('4. Equipment Costs'!H:H,'4. Equipment Costs'!C:C,B42,'4. Equipment Costs'!B:B,$E$21)\n+SUMIFS('5. Subcontracting Costs'!H:H,'5. Subcontracting Costs'!C:C,B42,'5. Subcontracting Costs'!B:B,$E$21)\n+SUMIFS(' 2-3-6. Travel&Costs of Stay'!N:N,' 2-3-6. Travel&Costs of Stay'!C:C,B42,' 2-3-6. Travel&Costs of Stay'!B:B,$E$21)","v":0},{"$f":"SUMIFS('1. Staff costs'!S:S,'1. Staff costs'!C:C,B42,'1. Staff costs'!B:B,$F$21)\n+SUMIFS(' 2-3-6. Travel&Costs of Stay'!O:O,' 2-3-6. Travel&Costs of Stay'!C:C,B42,' 2-3-6. Travel&Costs of Stay'!B:B,$F$21)\n+SUMIFS(' 2-3-6. Travel&Costs of Stay'!P:P,' 2-3-6. Travel&Costs of Stay'!C:C,B42,' 2-3-6. Travel&Costs of Stay'!B:B,$F$21)\n+SUMIFS('4. Equipment Costs'!H:H,'4. Equipment Costs'!C:C,B42,'4. Equipment Costs'!B:B,$F$21)\n+SUMIFS('5. Subcontracting Costs'!H:H,'5. Subcontracting Costs'!C:C,B42,'5. Subcontracting Costs'!B:B,$F$21)\n+SUMIFS(' 2-3-6. Travel&Costs of Stay'!N:N,' 2-3-6. Travel&Costs of Stay'!C:C,B42,' 2-3-6. Travel&Costs of Stay'!B:B,$F$21)","v":0},{"$f":"SUMIFS('1. Staff costs'!S:S,'1. Staff costs'!C:C,B42,'1. Staff costs'!B:B,$G$21)\n+SUMIFS(' 2-3-6. Travel&Costs of Stay'!O:O,' 2-3-6. Travel&Costs of Stay'!C:C,B42,' 2-3-6. Travel&Costs of Stay'!B:B,$G$21)\n+SUMIFS(' 2-3-6. Travel&Costs of Stay'!P:P,' 2-3-6. Travel&Costs of Stay'!C:C,B42,' 2-3-6. Travel&Costs of Stay'!B:B,$G$21)\n+SUMIFS('4. Equipment Costs'!H:H,'4. Equipment Costs'!C:C,B42,'4. Equipment Costs'!B:B,$G$21)\n+SUMIFS('5. Subcontracting Costs'!H:H,'5. Subcontracting Costs'!C:C,B42,'5. Subcontracting Costs'!B:B,$G$21)\n+SUMIFS(' 2-3-6. Travel&Costs of Stay'!N:N,' 2-3-6. Travel&Costs of Stay'!C:C,B42,' 2-3-6. Travel&Costs of Stay'!B:B,$G$21)","v":0},0]
[null,"P22",{"$f":"SUMIFS('1. Staff costs'!S:S,'1. Staff costs'!C:C,B43,'1. Staff costs'!B:B,$C$21)\n+SUMIFS(' 2-3-6. Travel&Costs of Stay'!O:O,' 2-3-6. Travel&Costs of Stay'!C:C,B43,' 2-3-6. Travel&Costs of Stay'!B:B,$C$21)\n+SUMIFS(' 2-3-6. Travel&Costs of Stay'!P:P,' 2-3-6. Travel&Costs of Stay'!C:C,B43,' 2-3-6. Travel&Costs of Stay'!B:B,$C$21)\n+SUMIFS('4. Equipment Costs'!H:H,'4. Equipment Costs'!C:C,B43,'4. Equipment Costs'!B:B,$C$21)\n+SUMIFS('5. Subcontracting Costs'!H:H,'5. Subcontracting Costs'!C:C,B43,'5. Subcontracting Costs'!B:B,$C$21)\n+SUMIFS(' 2-3-6. Travel&Costs of Stay'!N:N,' 2-3-6. Travel&Costs of Stay'!C:C,B43,' 2-3-6. Travel&Costs of Stay'!B:B,$C$21)","v":0},{"$f":"SUMIFS('1. Staff costs'!S:S,'1. Staff costs'!C:C,B43,'1. Staff costs'!B:B,$D$21)\n+SUMIFS(' 2-3-6. Travel&Costs of Stay'!O:O,' 2-3-6. Travel&Costs of Stay'!C:C,B43,' 2-3-6. Travel&Costs of Stay'!B:B,$D$21)\n+SUMIFS(' 2-3-6. Travel&Costs of Stay'!P:P,' 2-3-6. Travel&Costs of Stay'!C:C,B43,' 2-3-6. Travel&Costs of Stay'!B:B,$D$21)\n+SUMIFS('4. Equipment Costs'!H:H,'4. Equipment Costs'!C:C,B43,'4. Equipment Costs'!B:B,$D$21)\n+SUMIFS('5. Subcontracting Costs'!H:H,'5. Subcontracting Costs'!C:C,B43,'5. Subcontracting Costs'!B:B,$D$21)\n+SUMIFS(' 2-3-6. Travel&Costs of Stay'!N:N,' 2-3-6. Travel&Costs of Stay'!C:C,B43,' 2-3-6. Travel&Costs of Stay'!B:B,$D$21)","v":0},{"$f":"SUMIFS('1. Staff costs'!S:S,'1. Staff costs'!C:C,B43,'1. Staff costs'!B:B,$E$21)\n+SUMIFS(' 2-3-6. Travel&Costs of Stay'!O:O,' 2-3-6. Travel&Costs of Stay'!C:C,B43,' 2-3-6. Travel&Costs of Stay'!B:B,$E$21)\n+SUMIFS(' 2-3-6. Travel&Costs of Stay'!P:P,' 2-3-6. Travel&Costs of Stay'!C:C,B43,' 2-3-6. Travel&Costs of Stay'!B:B,$E$21)\n+SUMIFS('4. Equipment Costs'!H:H,'4. Equipment Costs'!C:C,B43,'4. Equipment Costs'!B:B,$E$21)\n+SUMIFS('5. Subcontracting Costs'!H:H,'5. Subcontracting Costs'!C:C,B43,'5. Subcontracting Costs'!B:B,$E$21)\n+SUMIFS(' 2-3-6. Travel&Costs of Stay'!N:N,' 2-3-6. Travel&Costs of Stay'!C:C,B43,' 2-3-6. Travel&Costs of Stay'!B:B,$E$21)","v":0},{"$f":"SUMIFS('1. Staff costs'!S:S,'1. Staff costs'!C:C,B43,'1. Staff costs'!B:B,$F$21)\n+SUMIFS(' 2-3-6. Travel&Costs of Stay'!O:O,' 2-3-6. Travel&Costs of Stay'!C:C,B43,' 2-3-6. Travel&Costs of Stay'!B:B,$F$21)\n+SUMIFS(' 2-3-6. Travel&Costs of Stay'!P:P,' 2-3-6. Travel&Costs of Stay'!C:C,B43,' 2-3-6. Travel&Costs of Stay'!B:B,$F$21)\n+SUMIFS('4. Equipment Costs'!H:H,'4. Equipment Costs'!C:C,B43,'4. Equipment Costs'!B:B,$F$21)\n+SUMIFS('5. Subcontracting Costs'!H:H,'5. Subcontracting Costs'!C:C,B43,'5. Subcontracting Costs'!B:B,$F$21)\n+SUMIFS(' 2-3-6. Travel&Costs of Stay'!N:N,' 2-3-6. Travel&Costs of Stay'!C:C,B43,' 2-3-6. Travel&Costs of Stay'!B:B,$F$21)","v":0},{"$f":"SUMIFS('1. Staff costs'!S:S,'1. Staff costs'!C:C,B43,'1. Staff costs'!B:B,$G$21)\n+SUMIFS(' 2-3-6. Travel&Costs of Stay'!O:O,' 2-3-6. Travel&Costs of Stay'!C:C,B43,' 2-3-6. Travel&Costs of Stay'!B:B,$G$21)\n+SUMIFS(' 2-3-6. Travel&Costs of Stay'!P:P,' 2-3-6. Travel&Costs of Stay'!C:C,B43,' 2-3-6. Travel&Costs of Stay'!B:B,$G$21)\n+SUMIFS('4. Equipment Costs'!H:H,'4. Equipment Costs'!C:C,B43,'4. Equipment Costs'!B:B,$G$21)\n+SUMIFS('5. Subcontracting Costs'!H:H,'5. Subcontracting Costs'!C:C,B43,'5. Subcontracting Costs'!B:B,$G$21)\n+SUMIFS(' 2-3-6. Travel&Costs of Stay'!N:N,' 2-3-6. Travel&Costs of Stay'!C:C,B43,' 2-3-6. Travel&Costs of Stay'!B:B,$G$21)","v":0},0]
[null,"P23",{"$f":"SUMIFS('1. Staff costs'!S:S,'1. Staff costs'!C:C,B44,'1. Staff costs'!B:B,$C$21)\n+SUMIFS(' 2-3-6. Travel&Costs of Stay'!O:O,' 2-3-6. Travel&Costs of Stay'!C:C,B44,' 2-3-6. Travel&Costs of Stay'!B:B,$C$21)\n+SUMIFS(' 2-3-6. Travel&Costs of Stay'!P:P,' 2-3-6. Travel&Costs of Stay'!C:C,B44,' 2-3-6. Travel&Costs of Stay'!B:B,$C$21)\n+SUMIFS('4. Equipment Costs'!H:H,'4. Equipment Costs'!C:C,B44,'4. Equipment Costs'!B:B,$C$21)\n+SUMIFS('5. Subcontracting Costs'!H:H,'5. Subcontracting Costs'!C:C,B44,'5. Subcontracting Costs'!B:B,$C$21)\n+SUMIFS(' 2-3-6. Travel&Costs of Stay'!N:N,' 2-3-6. Travel&Costs of Stay'!C:C,B44,' 2-3-6. Travel&Costs of Stay'!B:B,$C$21)","v":0},{"$f":"SUMIFS('1. Staff costs'!S:S,'1. Staff costs'!C:C,B44,'1. Staff costs'!B:B,$D$21)\n+SUMIFS(' 2-3-6. Travel&Costs of Stay'!O:O,' 2-3-6. Travel&Costs of Stay'!C:C,B44,' 2-3-6. Travel&Costs of Stay'!B:B,$D$21)\n+SUMIFS(' 2-3-6. Travel&Costs of Stay'!P:P,' 2-3-6. Travel&Costs of Stay'!C:C,B44,' 2-3-6. Travel&Costs of Stay'!B:B,$D$21)\n+SUMIFS('4. Equipment Costs'!H:H,'4. Equipment Costs'!C:C,B44,'4. Equipment Costs'!B:B,$D$21)\n+SUMIFS('5. Subcontracting Costs'!H:H,'5. Subcontracting Costs'!C:C,B44,'5. Subcontracting Costs'!B:B,$D$21)\n+SUMIFS(' 2-3-6. Travel&Costs of Stay'!N:N,' 2-3-6. Travel&Costs of Stay'!C:C,B44,' 2-3-6. Travel&Costs of Stay'!B:B,$D$21)","v":0},{"$f":"SUMIFS('1. Staff costs'!S:S,'1. Staff costs'!C:C,B44,'1. Staff costs'!B:B,$E$21)\n+SUMIFS(' 2-3-6. Travel&Costs of Stay'!O:O,' 2-3-6. Travel&Costs of Stay'!C:C,B44,' 2-3-6. Travel&Costs of Stay'!B:B,$E$21)\n+SUMIFS(' 2-3-6. Travel&Costs of Stay'!P:P,' 2-3-6. Travel&Costs of Stay'!C:C,B44,' 2-3-6. Travel&Costs of Stay'!B:B,$E$21)\n+SUMIFS('4. Equipment Costs'!H:H,'4. Equipment Costs'!C:C,B44,'4. Equipment Costs'!B:B,$E$21)\n+SUMIFS('5. Subcontracting Costs'!H:H,'5. Subcontracting Costs'!C:C,B44,'5. Subcontracting Costs'!B:B,$E$21)\n+SUMIFS(' 2-3-6. Travel&Costs of Stay'!N:N,' 2-3-6. Travel&Costs of Stay'!C:C,B44,' 2-3-6. Travel&Costs of Stay'!B:B,$E$21)","v":0},{"$f":"SUMIFS('1. Staff costs'!S:S,'1. Staff costs'!C:C,B44,'1. Staff costs'!B:B,$F$21)\n+SUMIFS(' 2-3-6. Travel&Costs of Stay'!O:O,' 2-3-6. Travel&Costs of Stay'!C:C,B44,' 2-3-6. Travel&Costs of Stay'!B:B,$F$21)\n+SUMIFS(' 2-3-6. Travel&Costs of Stay'!P:P,' 2-3-6. Travel&Costs of Stay'!C:C,B44,' 2-3-6. Travel&Costs of Stay'!B:B,$F$21)\n+SUMIFS('4. Equipment Costs'!H:H,'4. Equipment Costs'!C:C,B44,'4. Equipment Costs'!B:B,$F$21)\n+SUMIFS('5. Subcontracting Costs'!H:H,'5. Subcontracting Costs'!C:C,B44,'5. Subcontracting Costs'!B:B,$F$21)\n+SUMIFS(' 2-3-6. Travel&Costs of Stay'!N:N,' 2-3-6. Travel&Costs of Stay'!C:C,B44,' 2-3-6. Travel&Costs of Stay'!B:B,$F$21)","v":0},{"$f":"SUMIFS('1. Staff costs'!S:S,'1. Staff costs'!C:C,B44,'1. Staff costs'!B:B,$G$21)\n+SUMIFS(' 2-3-6. Travel&Costs of Stay'!O:O,' 2-3-6. Travel&Costs of Stay'!C:C,B44,' 2-3-6. Travel&Costs of Stay'!B:B,$G$21)\n+SUMIFS(' 2-3-6. Travel&Costs of Stay'!P:P,' 2-3-6. Travel&Costs of Stay'!C:C,B44,' 2-3-6. Travel&Costs of Stay'!B:B,$G$21)\n+SUMIFS('4. Equipment Costs'!H:H,'4. Equipment Costs'!C:C,B44,'4. Equipment Costs'!B:B,$G$21)\n+SUMIFS('5. Subcontracting Costs'!H:H,'5. Subcontracting Costs'!C:C,B44,'5. Subcontracting Costs'!B:B,$G$21)\n+SUMIFS(' 2-3-6. Travel&Costs of Stay'!N:N,' 2-3-6. Travel&Costs of Stay'!C:C,B44,' 2-3-6. Travel&Costs of Stay'!B:B,$G$21)","v":0},0]
[null,"P24",{"$f":"SUMIFS('1. Staff costs'!S:S,'1. Staff costs'!C:C,B45,'1. Staff costs'!B:B,$C$21)\n+SUMIFS(' 2-3-6. Travel&Costs of Stay'!O:O,' 2-3-6. Travel&Costs of Stay'!C:C,B45,' 2-3-6. Travel&Costs of Stay'!B:B,$C$21)\n+SUMIFS(' 2-3-6. Travel&Costs of Stay'!P:P,' 2-3-6. Travel&Costs of Stay'!C:C,B45,' 2-3-6. Travel&Costs of Stay'!B:B,$C$21)\n+SUMIFS('4. Equipment Costs'!H:H,'4. Equipment Costs'!C:C,B45,'4. Equipment Costs'!B:B,$C$21)\n+SUMIFS('5. Subcontracting Costs'!H:H,'5. Subcontracting Costs'!C:C,B45,'5. Subcontracting Costs'!B:B,$C$21)\n+SUMIFS(' 2-3-6. Travel&Costs of Stay'!N:N,' 2-3-6. Travel&Costs of Stay'!C:C,B45,' 2-3-6. Travel&Costs of Stay'!B:B,$C$21)","v":0},{"$f":"SUMIFS('1. Staff costs'!S:S,'1. Staff costs'!C:C,B45,'1. Staff costs'!B:B,$D$21)\n+SUMIFS(' 2-3-6. Travel&Costs of Stay'!O:O,' 2-3-6. Travel&Costs of Stay'!C:C,B45,' 2-3-6. Travel&Costs of Stay'!B:B,$D$21)\n+SUMIFS(' 2-3-6. Travel&Costs of Stay'!P:P,' 2-3-6. Travel&Costs of Stay'!C:C,B45,' 2-3-6. Travel&Costs of Stay'!B:B,$D$21)\n+SUMIFS('4. Equipment Costs'!H:H,'4. Equipment Costs'!C:C,B45,'4. Equipment Costs'!B:B,$D$21)\n+SUMIFS('5. Subcontracting Costs'!H:H,'5. Subcontracting Costs'!C:C,B45,'5. Subcontracting Costs'!B:B,$D$21)\n+SUMIFS(' 2-3-6. Travel&Costs of Stay'!N:N,' 2-3-6. Travel&Costs of Stay'!C:C,B45,' 2-3-6. Travel&Costs of Stay'!B:B,$D$21)","v":0},{"$f":"SUMIFS('1. Staff costs'!S:S,'1. Staff costs'!C:C,B45,'1. Staff costs'!B:B,$E$21)\n+SUMIFS(' 2-3-6. Travel&Costs of Stay'!O:O,' 2-3-6. Travel&Costs of Stay'!C:C,B45,' 2-3-6. Travel&Costs of Stay'!B:B,$E$21)\n+SUMIFS(' 2-3-6. Travel&Costs of Stay'!P:P,' 2-3-6. Travel&Costs of Stay'!C:C,B45,' 2-3-6. Travel&Costs of Stay'!B:B,$E$21)\n+SUMIFS('4. Equipment Costs'!H:H,'4. Equipment Costs'!C:C,B45,'4. Equipment Costs'!B:B,$E$21)\n+SUMIFS('5. Subcontracting Costs'!H:H,'5. Subcontracting Costs'!C:C,B45,'5. Subcontracting Costs'!B:B,$E$21)\n+SUMIFS(' 2-3-6. Travel&Costs of Stay'!N:N,' 2-3-6. Travel&Costs of Stay'!C:C,B45,' 2-3-6. Travel&Costs of Stay'!B:B,$E$21)","v":0},{"$f":"SUMIFS('1. Staff costs'!S:S,'1. Staff costs'!C:C,B45,'1. Staff costs'!B:B,$F$21)\n+SUMIFS(' 2-3-6. Travel&Costs of Stay'!O:O,' 2-3-6. Travel&Costs of Stay'!C:C,B45,' 2-3-6. Travel&Costs of Stay'!B:B,$F$21)\n+SUMIFS(' 2-3-6. Travel&Costs of Stay'!P:P,' 2-3-6. Travel&Costs of Stay'!C:C,B45,' 2-3-6. Travel&Costs of Stay'!B:B,$F$21)\n+SUMIFS('4. Equipment Costs'!H:H,'4. Equipment Costs'!C:C,B45,'4. Equipment Costs'!B:B,$F$21)\n+SUMIFS('5. Subcontracting Costs'!H:H,'5. Subcontracting Costs'!C:C,B45,'5. Subcontracting Costs'!B:B,$F$21)\n+SUMIFS(' 2-3-6. Travel&Costs of Stay'!N:N,' 2-3-6. Travel&Costs of Stay'!C:C,B45,' 2-3-6. Travel&Costs of Stay'!B:B,$F$21)","v":0},{"$f":"SUMIFS('1. Staff costs'!S:S,'1. Staff costs'!C:C,B45,'1. Staff costs'!B:B,$G$21)\n+SUMIFS(' 2-3-6. Travel&Costs of Stay'!O:O,' 2-3-6. Travel&Costs of Stay'!C:C,B45,' 2-3-6. Travel&Costs of Stay'!B:B,$G$21)\n+SUMIFS(' 2-3-6. Travel&Costs of Stay'!P:P,' 2-3-6. Travel&Costs of Stay'!C:C,B45,' 2-3-6. Travel&Costs of Stay'!B:B,$G$21)\n+SUMIFS('4. Equipment Costs'!H:H,'4. Equipment Costs'!C:C,B45,'4. Equipment Costs'!B:B,$G$21)\n+SUMIFS('5. Subcontracting Costs'!H:H,'5. Subcontracting Costs'!C:C,B45,'5. Subcontracting Costs'!B:B,$G$21)\n+SUMIFS(' 2-3-6. Travel&Costs of Stay'!N:N,' 2-3-6. Travel&Costs of Stay'!C:C,B45,' 2-3-6. Travel&Costs of Stay'!B:B,$G$21)","v":0},0]
[null,"P25",{"$f":"SUMIFS('1. Staff costs'!S:S,'1. Staff costs'!C:C,B46,'1. Staff costs'!B:B,$C$21)\n+SUMIFS(' 2-3-6. Travel&Costs of Stay'!O:O,' 2-3-6. Travel&Costs of Stay'!C:C,B46,' 2-3-6. Travel&Costs of Stay'!B:B,$C$21)\n+SUMIFS(' 2-3-6. Travel&Costs of Stay'!P:P,' 2-3-6. Travel&Costs of Stay'!C:C,B46,' 2-3-6. Travel&Costs of Stay'!B:B,$C$21)\n+SUMIFS('4. Equipment Costs'!H:H,'4. Equipment Costs'!C:C,B46,'4. Equipment Costs'!B:B,$C$21)\n+SUMIFS('5. Subcontracting Costs'!H:H,'5. Subcontracting Costs'!C:C,B46,'5. Subcontracting Costs'!B:B,$C$21)\n+SUMIFS(' 2-3-6. Travel&Costs of Stay'!N:N,' 2-3-6. Travel&Costs of Stay'!C:C,B46,' 2-3-6. Travel&Costs of Stay'!B:B,$C$21)","v":0},{"$f":"SUMIFS('1. Staff costs'!S:S,'1. Staff costs'!C:C,B46,'1. Staff costs'!B:B,$D$21)\n+SUMIFS(' 2-3-6. Travel&Costs of Stay'!O:O,' 2-3-6. Travel&Costs of Stay'!C:C,B46,' 2-3-6. Travel&Costs of Stay'!B:B,$D$21)\n+SUMIFS(' 2-3-6. Travel&Costs of Stay'!P:P,' 2-3-6. Travel&Costs of Stay'!C:C,B46,' 2-3-6. Travel&Costs of Stay'!B:B,$D$21)\n+SUMIFS('4. Equipment Costs'!H:H,'4. Equipment Costs'!C:C,B46,'4. Equipment Costs'!B:B,$D$21)\n+SUMIFS('5. Subcontracting Costs'!H:H,'5. Subcontracting Costs'!C:C,B46,'5. Subcontracting Costs'!B:B,$D$21)\n+SUMIFS(' 2-3-6. Travel&Costs of Stay'!N:N,' 2-3-6. Travel&Costs of Stay'!C:C,B46,' 2-3-6. Travel&Costs of Stay'!B:B,$D$21)","v":0},{"$f":"SUMIFS('1. Staff costs'!S:S,'1. Staff costs'!C:C,B46,'1. Staff costs'!B:B,$E$21)\n+SUMIFS(' 2-3-6. Travel&Costs of Stay'!O:O,' 2-3-6. Travel&Costs of Stay'!C:C,B46,' 2-3-6. Travel&Costs of Stay'!B:B,$E$21)\n+SUMIFS(' 2-3-6. Travel&Costs of Stay'!P:P,' 2-3-6. Travel&Costs of Stay'!C:C,B46,' 2-3-6. Travel&Costs of Stay'!B:B,$E$21)\n+SUMIFS('4. Equipment Costs'!H:H,'4. Equipment Costs'!C:C,B46,'4. Equipment Costs'!B:B,$E$21)\n+SUMIFS('5. Subcontracting Costs'!H:H,'5. Subcontracting Costs'!C:C,B46,'5. Subcontracting Costs'!B:B,$E$21)\n+SUMIFS(' 2-3-6. Travel&Costs of Stay'!N:N,' 2-3-6. Travel&Costs of Stay'!C:C,B46,' 2-3-6. Travel&Costs of Stay'!B:B,$E$21)","v":0},{"$f":"SUMIFS('1. Staff costs'!S:S,'1. Staff costs'!C:C,B46,'1. Staff costs'!B:B,$F$21)\n+SUMIFS(' 2-3-6. Travel&Costs of Stay'!O:O,' 2-3-6. Travel&Costs of Stay'!C:C,B46,' 2-3-6. Travel&Costs of Stay'!B:B,$F$21)\n+SUMIFS(' 2-3-6. Travel&Costs of Stay'!P:P,' 2-3-6. Travel&Costs of Stay'!C:C,B46,' 2-3-6. Travel&Costs of Stay'!B:B,$F$21)\n+SUMIFS('4. Equipment Costs'!H:H,'4. Equipment Costs'!C:C,B46,'4. Equipment Costs'!B:B,$F$21)\n+SUMIFS('5. Subcontracting Costs'!H:H,'5. Subcontracting Costs'!C:C,B46,'5. Subcontracting Costs'!B:B,$F$21)\n+SUMIFS(' 2-3-6. Travel&Costs of Stay'!N:N,' 2-3-6. Travel&Costs of Stay'!C:C,B46,' 2-3-6. Travel&Costs of Stay'!B:B,$F$21)","v":0},{"$f":"SUMIFS('1. Staff costs'!S:S,'1. Staff costs'!C:C,B46,'1. Staff costs'!B:B,$G$21)\n+SUMIFS(' 2-3-6. Travel&Costs of Stay'!O:O,' 2-3-6. Travel&Costs of Stay'!C:C,B46,' 2-3-6. Travel&Costs of Stay'!B:B,$G$21)\n+SUMIFS(' 2-3-6. Travel&Costs of Stay'!P:P,' 2-3-6. Travel&Costs of Stay'!C:C,B46,' 2-3-6. Travel&Costs of Stay'!B:B,$G$21)\n+SUMIFS('4. Equipment Costs'!H:H,'4. Equipment Costs'!C:C,B46,'4. Equipment Costs'!B:B,$G$21)\n+SUMIFS('5. Subcontracting Costs'!H:H,'5. Subcontracting Costs'!C:C,B46,'5. Subcontracting Costs'!B:B,$G$21)\n+SUMIFS(' 2-3-6. Travel&Costs of Stay'!N:N,' 2-3-6. Travel&Costs of Stay'!C:C,B46,' 2-3-6. Travel&Costs of Stay'!B:B,$G$21)","v":0},0]
[null,"P26",{"$f":"SUMIFS('1. Staff costs'!S:S,'1. Staff costs'!C:C,B47,'1. Staff costs'!B:B,$C$21)\n+SUMIFS(' 2-3-6. Travel&Costs of Stay'!O:O,' 2-3-6. Travel&Costs of Stay'!C:C,B47,' 2-3-6. Travel&Costs of Stay'!B:B,$C$21)\n+SUMIFS(' 2-3-6. Travel&Costs of Stay'!P:P,' 2-3-6. Travel&Costs of Stay'!C:C,B47,' 2-3-6. Travel&Costs of Stay'!B:B,$C$21)\n+SUMIFS('4. Equipment Costs'!H:H,'4. Equipment Costs'!C:C,B47,'4. Equipment Costs'!B:B,$C$21)\n+SUMIFS('5. Subcontracting Costs'!H:H,'5. Subcontracting Costs'!C:C,B47,'5. Subcontracting Costs'!B:B,$C$21)\n+SUMIFS(' 2-3-6. Travel&Costs of Stay'!N:N,' 2-3-6. Travel&Costs of Stay'!C:C,B47,' 2-3-6. Travel&Costs of Stay'!B:B,$C$21)","v":0},{"$f":"SUMIFS('1. Staff costs'!S:S,'1. Staff costs'!C:C,B47,'1. Staff costs'!B:B,$D$21)\n+SUMIFS(' 2-3-6. Travel&Costs of Stay'!O:O,' 2-3-6. Travel&Costs of Stay'!C:C,B47,' 2-3-6. Travel&Costs of Stay'!B:B,$D$21)\n+SUMIFS(' 2-3-6. Travel&Costs of Stay'!P:P,' 2-3-6. Travel&Costs of Stay'!C:C,B47,' 2-3-6. Travel&Costs of Stay'!B:B,$D$21)\n+SUMIFS('4. Equipment Costs'!H:H,'4. Equipment Costs'!C:C,B47,'4. Equipment Costs'!B:B,$D$21)\n+SUMIFS('5. Subcontracting Costs'!H:H,'5. Subcontracting Costs'!C:C,B47,'5. Subcontracting Costs'!B:B,$D$21)\n+SUMIFS(' 2-3-6. Travel&Costs of Stay'!N:N,' 2-3-6. Travel&Costs of Stay'!C:C,B47,' 2-3-6. Travel&Costs of Stay'!B:B,$D$21)","v":0},{"$f":"SUMIFS('1. Staff costs'!S:S,'1. Staff costs'!C:C,B47,'1. Staff costs'!B:B,$E$21)\n+SUMIFS(' 2-3-6. Travel&Costs of Stay'!O:O,' 2-3-6. Travel&Costs of Stay'!C:C,B47,' 2-3-6. Travel&Costs of Stay'!B:B,$E$21)\n+SUMIFS(' 2-3-6. Travel&Costs of Stay'!P:P,' 2-3-6. Travel&Costs of Stay'!C:C,B47,' 2-3-6. Travel&Costs of Stay'!B:B,$E$21)\n+SUMIFS('4. Equipment Costs'!H:H,'4. Equipment Costs'!C:C,B47,'4. Equipment Costs'!B:B,$E$21)\n+SUMIFS('5. Subcontracting Costs'!H:H,'5. Subcontracting Costs'!C:C,B47,'5. Subcontracting Costs'!B:B,$E$21)\n+SUMIFS(' 2-3-6. Travel&Costs of Stay'!N:N,' 2-3-6. Travel&Costs of Stay'!C:C,B47,' 2-3-6. Travel&Costs of Stay'!B:B,$E$21)","v":0},{"$f":"SUMIFS('1. Staff costs'!S:S,'1. Staff costs'!C:C,B47,'1. Staff costs'!B:B,$F$21)\n+SUMIFS(' 2-3-6. Travel&Costs of Stay'!O:O,' 2-3-6. Travel&Costs of Stay'!C:C,B47,' 2-3-6. Travel&Costs of Stay'!B:B,$F$21)\n+SUMIFS(' 2-3-6. Travel&Costs of Stay'!P:P,' 2-3-6. Travel&Costs of Stay'!C:C,B47,' 2-3-6. Travel&Costs of Stay'!B:B,$F$21)\n+SUMIFS('4. Equipment Costs'!H:H,'4. Equipment Costs'!C:C,B47,'4. Equipment Costs'!B:B,$F$21)\n+SUMIFS('5. Subcontracting Costs'!H:H,'5. Subcontracting Costs'!C:C,B47,'5. Subcontracting Costs'!B:B,$F$21)\n+SUMIFS(' 2-3-6. Travel&Costs of Stay'!N:N,' 2-3-6. Travel&Costs of Stay'!C:C,B47,' 2-3-6. Travel&Costs of Stay'!B:B,$F$21)","v":0},{"$f":"SUMIFS('1. Staff costs'!S:S,'1. Staff costs'!C:C,B47,'1. Staff costs'!B:B,$G$21)\n+SUMIFS(' 2-3-6. Travel&Costs of Stay'!O:O,' 2-3-6. Travel&Costs of Stay'!C:C,B47,' 2-3-6. Travel&Costs of Stay'!B:B,$G$21)\n+SUMIFS(' 2-3-6. Travel&Costs of Stay'!P:P,' 2-3-6. Travel&Costs of Stay'!C:C,B47,' 2-3-6. Travel&Costs of Stay'!B:B,$G$21)\n+SUMIFS('4. Equipment Costs'!H:H,'4. Equipment Costs'!C:C,B47,'4. Equipment Costs'!B:B,$G$21)\n+SUMIFS('5. Subcontracting Costs'!H:H,'5. Subcontracting Costs'!C:C,B47,'5. Subcontracting Costs'!B:B,$G$21)\n+SUMIFS(' 2-3-6. Travel&Costs of Stay'!N:N,' 2-3-6. Travel&Costs of Stay'!C:C,B47,' 2-3-6. Travel&Costs of Stay'!B:B,$G$21)","v":0},0]
[null,"P27",{"$f":"SUMIFS('1. Staff costs'!S:S,'1. Staff costs'!C:C,B48,'1. Staff costs'!B:B,$C$21)\n+SUMIFS(' 2-3-6. Travel&Costs of Stay'!O:O,' 2-3-6. Travel&Costs of Stay'!C:C,B48,' 2-3-6. Travel&Costs of Stay'!B:B,$C$21)\n+SUMIFS(' 2-3-6. Travel&Costs of Stay'!P:P,' 2-3-6. Travel&Costs of Stay'!C:C,B48,' 2-3-6. Travel&Costs of Stay'!B:B,$C$21)\n+SUMIFS('4. Equipment Costs'!H:H,'4. Equipment Costs'!C:C,B48,'4. Equipment Costs'!B:B,$C$21)\n+SUMIFS('5. Subcontracting Costs'!H:H,'5. Subcontracting Costs'!C:C,B48,'5. Subcontracting Costs'!B:B,$C$21)\n+SUMIFS(' 2-3-6. Travel&Costs of Stay'!N:N,' 2-3-6. Travel&Costs of Stay'!C:C,B48,' 2-3-6. Travel&Costs of Stay'!B:B,$C$21)","v":0},{"$f":"SUMIFS('1. Staff costs'!S:S,'1. Staff costs'!C:C,B48,'1. Staff costs'!B:B,$D$21)\n+SUMIFS(' 2-3-6. Travel&Costs of Stay'!O:O,' 2-3-6. Travel&Costs of Stay'!C:C,B48,' 2-3-6. Travel&Costs of Stay'!B:B,$D$21)\n+SUMIFS(' 2-3-6. Travel&Costs of Stay'!P:P,' 2-3-6. Travel&Costs of Stay'!C:C,B48,' 2-3-6. Travel&Costs of Stay'!B:B,$D$21)\n+SUMIFS('4. Equipment Costs'!H:H,'4. Equipment Costs'!C:C,B48,'4. Equipment Costs'!B:B,$D$21)\n+SUMIFS('5. Subcontracting Costs'!H:H,'5. Subcontracting Costs'!C:C,B48,'5. Subcontracting Costs'!B:B,$D$21)\n+SUMIFS(' 2-3-6. Travel&Costs of Stay'!N:N,' 2-3-6. Travel&Costs of Stay'!C:C,B48,' 2-3-6. Travel&Costs of Stay'!B:B,$D$21)","v":0},{"$f":"SUMIFS('1. Staff costs'!S:S,'1. Staff costs'!C:C,B48,'1. Staff costs'!B:B,$E$21)\n+SUMIFS(' 2-3-6. Travel&Costs of Stay'!O:O,' 2-3-6. Travel&Costs of Stay'!C:C,B48,' 2-3-6. Travel&Costs of Stay'!B:B,$E$21)\n+SUMIFS(' 2-3-6. Travel&Costs of Stay'!P:P,' 2-3-6. Travel&Costs of Stay'!C:C,B48,' 2-3-6. Travel&Costs of Stay'!B:B,$E$21)\n+SUMIFS('4. Equipment Costs'!H:H,'4. Equipment Costs'!C:C,B48,'4. Equipment Costs'!B:B,$E$21)\n+SUMIFS('5. Subcontracting Costs'!H:H,'5. Subcontracting Costs'!C:C,B48,'5. Subcontracting Costs'!B:B,$E$21)\n+SUMIFS(' 2-3-6. Travel&Costs of Stay'!N:N,' 2-3-6. Travel&Costs of Stay'!C:C,B48,' 2-3-6. Travel&Costs of Stay'!B:B,$E$21)","v":0},{"$f":"SUMIFS('1. Staff costs'!S:S,'1. Staff costs'!C:C,B48,'1. Staff costs'!B:B,$F$21)\n+SUMIFS(' 2-3-6. Travel&Costs of Stay'!O:O,' 2-3-6. Travel&Costs of Stay'!C:C,B48,' 2-3-6. Travel&Costs of Stay'!B:B,$F$21)\n+SUMIFS(' 2-3-6. Travel&Costs of Stay'!P:P,' 2-3-6. Travel&Costs of Stay'!C:C,B48,' 2-3-6. Travel&Costs of Stay'!B:B,$F$21)\n+SUMIFS('4. Equipment Costs'!H:H,'4. Equipment Costs'!C:C,B48,'4. Equipment Costs'!B:B,$F$21)\n+SUMIFS('5. Subcontracting Costs'!H:H,'5. Subcontracting Costs'!C:C,B48,'5. Subcontracting Costs'!B:B,$F$21)\n+SUMIFS(' 2-3-6. Travel&Costs of Stay'!N:N,' 2-3-6. Travel&Costs of Stay'!C:C,B48,' 2-3-6. Travel&Costs of Stay'!B:B,$F$21)","v":0},{"$f":"SUMIFS('1. Staff costs'!S:S,'1. Staff costs'!C:C,B48,'1. Staff costs'!B:B,$G$21)\n+SUMIFS(' 2-3-6. Travel&Costs of Stay'!O:O,' 2-3-6. Travel&Costs of Stay'!C:C,B48,' 2-3-6. Travel&Costs of Stay'!B:B,$G$21)\n+SUMIFS(' 2-3-6. Travel&Costs of Stay'!P:P,' 2-3-6. Travel&Costs of Stay'!C:C,B48,' 2-3-6. Travel&Costs of Stay'!B:B,$G$21)\n+SUMIFS('4. Equipment Costs'!H:H,'4. Equipment Costs'!C:C,B48,'4. Equipment Costs'!B:B,$G$21)\n+SUMIFS('5. Subcontracting Costs'!H:H,'5. Subcontracting Costs'!C:C,B48,'5. Subcontracting Costs'!B:B,$G$21)\n+SUMIFS(' 2-3-6. Travel&Costs of Stay'!N:N,' 2-3-6. Travel&Costs of Stay'!C:C,B48,' 2-3-6. Travel&Costs of Stay'!B:B,$G$21)","v":0},0]
[null,"P28",{"$f":"SUMIFS('1. Staff costs'!S:S,'1. Staff costs'!C:C,B49,'1. Staff costs'!B:B,$C$21)\n+SUMIFS(' 2-3-6. Travel&Costs of Stay'!O:O,' 2-3-6. Travel&Costs of Stay'!C:C,B49,' 2-3-6. Travel&Costs of Stay'!B:B,$C$21)\n+SUMIFS(' 2-3-6. Travel&Costs of Stay'!P:P,' 2-3-6. Travel&Costs of Stay'!C:C,B49,' 2-3-6. Travel&Costs of Stay'!B:B,$C$21)\n+SUMIFS('4. Equipment Costs'!H:H,'4. Equipment Costs'!C:C,B49,'4. Equipment Costs'!B:B,$C$21)\n+SUMIFS('5. Subcontracting Costs'!H:H,'5. Subcontracting Costs'!C:C,B49,'5. Subcontracting Costs'!B:B,$C$21)\n+SUMIFS(' 2-3-6. Travel&Costs of Stay'!N:N,' 2-3-6. Travel&Costs of Stay'!C:C,B49,' 2-3-6. Travel&Costs of Stay'!B:B,$C$21)","v":0},{"$f":"SUMIFS('1. Staff costs'!S:S,'1. Staff costs'!C:C,B49,'1. Staff costs'!B:B,$D$21)\n+SUMIFS(' 2-3-6. Travel&Costs of Stay'!O:O,' 2-3-6. Travel&Costs of Stay'!C:C,B49,' 2-3-6. Travel&Costs of Stay'!B:B,$D$21)\n+SUMIFS(' 2-3-6. Travel&Costs of Stay'!P:P,' 2-3-6. Travel&Costs of Stay'!C:C,B49,' 2-3-6. Travel&Costs of Stay'!B:B,$D$21)\n+SUMIFS('4. Equipment Costs'!H:H,'4. Equipment Costs'!C:C,B49,'4. Equipment Costs'!B:B,$D$21)\n+SUMIFS('5. Subcontracting Costs'!H:H,'5. Subcontracting Costs'!C:C,B49,'5. Subcontracting Costs'!B:B,$D$21)\n+SUMIFS(' 2-3-6. Travel&Costs of Stay'!N:N,' 2-3-6. Travel&Costs of Stay'!C:C,B49,' 2-3-6. Travel&Costs of Stay'!B:B,$D$21)","v":0},{"$f":"SUMIFS('1. Staff costs'!S:S,'1. Staff costs'!C:C,B49,'1. Staff costs'!B:B,$E$21)\n+SUMIFS(' 2-3-6. Travel&Costs of Stay'!O:O,' 2-3-6. Travel&Costs of Stay'!C:C,B49,' 2-3-6. Travel&Costs of Stay'!B:B,$E$21)\n+SUMIFS(' 2-3-6. Travel&Costs of Stay'!P:P,' 2-3-6. Travel&Costs of Stay'!C:C,B49,' 2-3-6. Travel&Costs of Stay'!B:B,$E$21)\n+SUMIFS('4. Equipment Costs'!H:H,'4. Equipment Costs'!C:C,B49,'4. Equipment Costs'!B:B,$E$21)\n+SUMIFS('5. Subcontracting Costs'!H:H,'5. Subcontracting Costs'!C:C,B49,'5. Subcontracting Costs'!B:B,$E$21)\n+SUMIFS(' 2-3-6. Travel&Costs of Stay'!N:N,' 2-3-6. Travel&Costs of Stay'!C:C,B49,' 2-3-6. Travel&Costs of Stay'!B:B,$E$21)","v":0},{"$f":"SUMIFS('1. Staff costs'!S:S,'1. Staff costs'!C:C,B49,'1. Staff costs'!B:B,$F$21)\n+SUMIFS(' 2-3-6. Travel&Costs of Stay'!O:O,' 2-3-6. Travel&Costs of Stay'!C:C,B49,' 2-3-6. Travel&Costs of Stay'!B:B,$F$21)\n+SUMIFS(' 2-3-6. Travel&Costs of Stay'!P:P,' 2-3-6. Travel&Costs of Stay'!C:C,B49,' 2-3-6. Travel&Costs of Stay'!B:B,$F$21)\n+SUMIFS('4. Equipment Costs'!H:H,'4. Equipment Costs'!C:C,B49,'4. Equipment Costs'!B:B,$F$21)\n+SUMIFS('5. Subcontracting Costs'!H:H,'5. Subcontracting Costs'!C:C,B49,'5. Subcontracting Costs'!B:B,$F$21)\n+SUMIFS(' 2-3-6. Travel&Costs of Stay'!N:N,' 2-3-6. Travel&Costs of Stay'!C:C,B49,' 2-3-6. Travel&Costs of Stay'!B:B,$F$21)","v":0},{"$f":"SUMIFS('1. Staff costs'!S:S,'1. Staff costs'!C:C,B49,'1. Staff costs'!B:B,$G$21)\n+SUMIFS(' 2-3-6. Travel&Costs of Stay'!O:O,' 2-3-6. Travel&Costs of Stay'!C:C,B49,' 2-3-6. Travel&Costs of Stay'!B:B,$G$21)\n+SUMIFS(' 2-3-6. Travel&Costs of Stay'!P:P,' 2-3-6. Travel&Costs of Stay'!C:C,B49,' 2-3-6. Travel&Costs of Stay'!B:B,$G$21)\n+SUMIFS('4. Equipment Costs'!H:H,'4. Equipment Costs'!C:C,B49,'4. Equipment Costs'!B:B,$G$21)\n+SUMIFS('5. Subcontracting Costs'!H:H,'5. Subcontracting Costs'!C:C,B49,'5. Subcontracting Costs'!B:B,$G$21)\n+SUMIFS(' 2-3-6. Travel&Costs of Stay'!N:N,' 2-3-6. Travel&Costs of Stay'!C:C,B49,' 2-3-6. Travel&Costs of Stay'!B:B,$G$21)","v":0},0]
[null,"P29",{"$f":"SUMIFS('1. Staff costs'!S:S,'1. Staff costs'!C:C,B50,'1. Staff costs'!B:B,$C$21)\n+SUMIFS(' 2-3-6. Travel&Costs of Stay'!O:O,' 2-3-6. Travel&Costs of Stay'!C:C,B50,' 2-3-6. Travel&Costs of Stay'!B:B,$C$21)\n+SUMIFS(' 2-3-6. Travel&Costs of Stay'!P:P,' 2-3-6. Travel&Costs of Stay'!C:C,B50,' 2-3-6. Travel&Costs of Stay'!B:B,$C$21)\n+SUMIFS('4. Equipment Costs'!H:H,'4. Equipment Costs'!C:C,B50,'4. Equipment Costs'!B:B,$C$21)\n+SUMIFS('5. Subcontracting Costs'!H:H,'5. Subcontracting Costs'!C:C,B50,'5. Subcontracting Costs'!B:B,$C$21)\n+SUMIFS(' 2-3-6. Travel&Costs of Stay'!N:N,' 2-3-6. Travel&Costs of Stay'!C:C,B50,' 2-3-6. Travel&Costs of Stay'!B:B,$C$21)","v":0},{"$f":"SUMIFS('1. Staff costs'!S:S,'1. Staff costs'!C:C,B50,'1. Staff costs'!B:B,$D$21)\n+SUMIFS(' 2-3-6. Travel&Costs of Stay'!O:O,' 2-3-6. Travel&Costs of Stay'!C:C,B50,' 2-3-6. Travel&Costs of Stay'!B:B,$D$21)\n+SUMIFS(' 2-3-6. Travel&Costs of Stay'!P:P,' 2-3-6. Travel&Costs of Stay'!C:C,B50,' 2-3-6. Travel&Costs of Stay'!B:B,$D$21)\n+SUMIFS('4. Equipment Costs'!H:H,'4. Equipment Costs'!C:C,B50,'4. Equipment Costs'!B:B,$D$21)\n+SUMIFS('5. Subcontracting Costs'!H:H,'5. Subcontracting Costs'!C:C,B50,'5. Subcontracting Costs'!B:B,$D$21)\n+SUMIFS(' 2-3-6. Travel&Costs of Stay'!N:N,' 2-3-6. Travel&Costs of Stay'!C:C,B50,' 2-3-6. Travel&Costs of Stay'!B:B,$D$21)","v":0},{"$f":"SUMIFS('1. Staff costs'!S:S,'1. Staff costs'!C:C,B50,'1. Staff costs'!B:B,$E$21)\n+SUMIFS(' 2-3-6. Travel&Costs of Stay'!O:O,' 2-3-6. Travel&Costs of Stay'!C:C,B50,' 2-3-6. Travel&Costs of Stay'!B:B,$E$21)\n+SUMIFS(' 2-3-6. Travel&Costs of Stay'!P:P,' 2-3-6. Travel&Costs of Stay'!C:C,B50,' 2-3-6. Travel&Costs of Stay'!B:B,$E$21)\n+SUMIFS('4. Equipment Costs'!H:H,'4. Equipment Costs'!C:C,B50,'4. Equipment Costs'!B:B,$E$21)\n+SUMIFS('5. Subcontracting Costs'!H:H,'5. Subcontracting Costs'!C:C,B50,'5. Subcontracting Costs'!B:B,$E$21)\n+SUMIFS(' 2-3-6. Travel&Costs of Stay'!N:N,' 2-3-6. Travel&Costs of Stay'!C:C,B50,' 2-3-6. Travel&Costs of Stay'!B:B,$E$21)","v":0},{"$f":"SUMIFS('1. Staff costs'!S:S,'1. Staff costs'!C:C,B50,'1. Staff costs'!B:B,$F$21)\n+SUMIFS(' 2-3-6. Travel&Costs of Stay'!O:O,' 2-3-6. Travel&Costs of Stay'!C:C,B50,' 2-3-6. Travel&Costs of Stay'!B:B,$F$21)\n+SUMIFS(' 2-3-6. Travel&Costs of Stay'!P:P,' 2-3-6. Travel&Costs of Stay'!C:C,B50,' 2-3-6. Travel&Costs of Stay'!B:B,$F$21)\n+SUMIFS('4. Equipment Costs'!H:H,'4. Equipment Costs'!C:C,B50,'4. Equipment Costs'!B:B,$F$21)\n+SUMIFS('5. Subcontracting Costs'!H:H,'5. Subcontracting Costs'!C:C,B50,'5. Subcontracting Costs'!B:B,$F$21)\n+SUMIFS(' 2-3-6. Travel&Costs of Stay'!N:N,' 2-3-6. Travel&Costs of Stay'!C:C,B50,' 2-3-6. Travel&Costs of Stay'!B:B,$F$21)","v":0},{"$f":"SUMIFS('1. Staff costs'!S:S,'1. Staff costs'!C:C,B50,'1. Staff costs'!B:B,$G$21)\n+SUMIFS(' 2-3-6. Travel&Costs of Stay'!O:O,' 2-3-6. Travel&Costs of Stay'!C:C,B50,' 2-3-6. Travel&Costs of Stay'!B:B,$G$21)\n+SUMIFS(' 2-3-6. Travel&Costs of Stay'!P:P,' 2-3-6. Travel&Costs of Stay'!C:C,B50,' 2-3-6. Travel&Costs of Stay'!B:B,$G$21)\n+SUMIFS('4. Equipment Costs'!H:H,'4. Equipment Costs'!C:C,B50,'4. Equipment Costs'!B:B,$G$21)\n+SUMIFS('5. Subcontracting Costs'!H:H,'5. Subcontracting Costs'!C:C,B50,'5. Subcontracting Costs'!B:B,$G$21)\n+SUMIFS(' 2-3-6. Travel&Costs of Stay'!N:N,' 2-3-6. Travel&Costs of Stay'!C:C,B50,' 2-3-6. Travel&Costs of Stay'!B:B,$G$21)","v":0},0]
[null,"P30",{"$f":"SUMIFS('1. Staff costs'!S:S,'1. Staff costs'!C:C,B51,'1. Staff costs'!B:B,$C$21)\n+SUMIFS(' 2-3-6. Travel&Costs of Stay'!O:O,' 2-3-6. Travel&Costs of Stay'!C:C,B51,' 2-3-6. Travel&Costs of Stay'!B:B,$C$21)\n+SUMIFS(' 2-3-6. Travel&Costs of Stay'!P:P,' 2-3-6. Travel&Costs of Stay'!C:C,B51,' 2-3-6. Travel&Costs of Stay'!B:B,$C$21)\n+SUMIFS('4. Equipment Costs'!H:H,'4. Equipment Costs'!C:C,B51,'4. Equipment Costs'!B:B,$C$21)\n+SUMIFS('5. Subcontracting Costs'!H:H,'5. Subcontracting Costs'!C:C,B51,'5. Subcontracting Costs'!B:B,$C$21)\n+SUMIFS(' 2-3-6. Travel&Costs of Stay'!N:N,' 2-3-6. Travel&Costs of Stay'!C:C,B51,' 2-3-6. Travel&Costs of Stay'!B:B,$C$21)","v":0},{"$f":"SUMIFS('1. Staff costs'!S:S,'1. Staff costs'!C:C,B51,'1. Staff costs'!B:B,$D$21)\n+SUMIFS(' 2-3-6. Travel&Costs of Stay'!O:O,' 2-3-6. Travel&Costs of Stay'!C:C,B51,' 2-3-6. Travel&Costs of Stay'!B:B,$D$21)\n+SUMIFS(' 2-3-6. Travel&Costs of Stay'!P:P,' 2-3-6. Travel&Costs of Stay'!C:C,B51,' 2-3-6. Travel&Costs of Stay'!B:B,$D$21)\n+SUMIFS('4. Equipment Costs'!H:H,'4. Equipment Costs'!C:C,B51,'4. Equipment Costs'!B:B,$D$21)\n+SUMIFS('5. Subcontracting Costs'!H:H,'5. Subcontracting Costs'!C:C,B51,'5. Subcontracting Costs'!B:B,$D$21)\n+SUMIFS(' 2-3-6. Travel&Costs of Stay'!N:N,' 2-3-6. Travel&Costs of Stay'!C:C,B51,' 2-3-6. Travel&Costs of Stay'!B:B,$D$21)","v":0},{"$f":"SUMIFS('1. Staff costs'!S:S,'1. Staff costs'!C:C,B51,'1. Staff costs'!B:B,$E$21)\n+SUMIFS(' 2-3-6. Travel&Costs of Stay'!O:O,' 2-3-6. Travel&Costs of Stay'!C:C,B51,' 2-3-6. Travel&Costs of Stay'!B:B,$E$21)\n+SUMIFS(' 2-3-6. Travel&Costs of Stay'!P:P,' 2-3-6. Travel&Costs of Stay'!C:C,B51,' 2-3-6. Travel&Costs of Stay'!B:B,$E$21)\n+SUMIFS('4. Equipment Costs'!H:H,'4. Equipment Costs'!C:C,B51,'4. Equipment Costs'!B:B,$E$21)\n+SUMIFS('5. Subcontracting Costs'!H:H,'5. Subcontracting Costs'!C:C,B51,'5. Subcontracting Costs'!B:B,$E$21)\n+SUMIFS(' 2-3-6. Travel&Costs of Stay'!N:N,' 2-3-6. Travel&Costs of Stay'!C:C,B51,' 2-3-6. Travel&Costs of Stay'!B:B,$E$21)","v":0},{"$f":"SUMIFS('1. Staff costs'!S:S,'1. Staff costs'!C:C,B51,'1. Staff costs'!B:B,$F$21)\n+SUMIFS(' 2-3-6. Travel&Costs of Stay'!O:O,' 2-3-6. Travel&Costs of Stay'!C:C,B51,' 2-3-6. Travel&Costs of Stay'!B:B,$F$21)\n+SUMIFS(' 2-3-6. Travel&Costs of Stay'!P:P,' 2-3-6. Travel&Costs of Stay'!C:C,B51,' 2-3-6. Travel&Costs of Stay'!B:B,$F$21)\n+SUMIFS('4. Equipment Costs'!H:H,'4. Equipment Costs'!C:C,B51,'4. Equipment Costs'!B:B,$F$21)\n+SUMIFS('5. Subcontracting Costs'!H:H,'5. Subcontracting Costs'!C:C,B51,'5. Subcontracting Costs'!B:B,$F$21)\n+SUMIFS(' 2-3-6. Travel&Costs of Stay'!N:N,' 2-3-6. Travel&Costs of Stay'!C:C,B51,' 2-3-6. Travel&Costs of Stay'!B:B,$F$21)","v":0},{"$f":"SUMIFS('1. Staff costs'!S:S,'1. Staff costs'!C:C,B51,'1. Staff costs'!B:B,$G$21)\n+SUMIFS(' 2-3-6. Travel&Costs of Stay'!O:O,' 2-3-6. Travel&Costs of Stay'!C:C,B51,' 2-3-6. Travel&Costs of Stay'!B:B,$G$21)\n+SUMIFS(' 2-3-6. Travel&Costs of Stay'!P:P,' 2-3-6. Travel&Costs of Stay'!C:C,B51,' 2-3-6. Travel&Costs of Stay'!B:B,$G$21)\n+SUMIFS('4. Equipment Costs'!H:H,'4. Equipment Costs'!C:C,B51,'4. Equipment Costs'!B:B,$G$21)\n+SUMIFS('5. Subcontracting Costs'!H:H,'5. Subcontracting Costs'!C:C,B51,'5. Subcontracting Costs'!B:B,$G$21)\n+SUMIFS(' 2-3-6. Travel&Costs of Stay'!N:N,' 2-3-6. Travel&Costs of Stay'!C:C,B51,' 2-3-6. Travel&Costs of Stay'!B:B,$G$21)","v":0},0]
[null,"P31",{"$f":"SUMIFS('1. Staff costs'!S:S,'1. Staff costs'!C:C,B52,'1. Staff costs'!B:B,$C$21)\n+SUMIFS(' 2-3-6. Travel&Costs of Stay'!O:O,' 2-3-6. Travel&Costs of Stay'!C:C,B52,' 2-3-6. Travel&Costs of Stay'!B:B,$C$21)\n+SUMIFS(' 2-3-6. Travel&Costs of Stay'!P:P,' 2-3-6. Travel&Costs of Stay'!C:C,B52,' 2-3-6. Travel&Costs of Stay'!B:B,$C$21)\n+SUMIFS('4. Equipment Costs'!H:H,'4. Equipment Costs'!C:C,B52,'4. Equipment Costs'!B:B,$C$21)\n+SUMIFS('5. Subcontracting Costs'!H:H,'5. Subcontracting Costs'!C:C,B52,'5. Subcontracting Costs'!B:B,$C$21)\n+SUMIFS(' 2-3-6. Travel&Costs of Stay'!N:N,' 2-3-6. Travel&Costs of Stay'!C:C,B52,' 2-3-6. Travel&Costs of Stay'!B:B,$C$21)","v":0},{"$f":"SUMIFS('1. Staff costs'!S:S,'1. Staff costs'!C:C,B52,'1. Staff costs'!B:B,$D$21)\n+SUMIFS(' 2-3-6. Travel&Costs of Stay'!O:O,' 2-3-6. Travel&Costs of Stay'!C:C,B52,' 2-3-6. Travel&Costs of Stay'!B:B,$D$21)\n+SUMIFS(' 2-3-6. Travel&Costs of Stay'!P:P,' 2-3-6. Travel&Costs of Stay'!C:C,B52,' 2-3-6. Travel&Costs of Stay'!B:B,$D$21)\n+SUMIFS('4. Equipment Costs'!H:H,'4. Equipment Costs'!C:C,B52,'4. Equipment Costs'!B:B,$D$21)\n+SUMIFS('5. Subcontracting Costs'!H:H,'5. Subcontracting Costs'!C:C,B52,'5. Subcontracting Costs'!B:B,$D$21)\n+SUMIFS(' 2-3-6. Travel&Costs of Stay'!N:N,' 2-3-6. Travel&Costs of Stay'!C:C,B52,' 2-3-6. Travel&Costs of Stay'!B:B,$D$21)","v":0},{"$f":"SUMIFS('1. Staff costs'!S:S,'1. Staff costs'!C:C,B52,'1. Staff costs'!B:B,$E$21)\n+SUMIFS(' 2-3-6. Travel&Costs of Stay'!O:O,' 2-3-6. Travel&Costs of Stay'!C:C,B52,' 2-3-6. Travel&Costs of Stay'!B:B,$E$21)\n+SUMIFS(' 2-3-6. Travel&Costs of Stay'!P:P,' 2-3-6. Travel&Costs of Stay'!C:C,B52,' 2-3-6. Travel&Costs of Stay'!B:B,$E$21)\n+SUMIFS('4. Equipment Costs'!H:H,'4. Equipment Costs'!C:C,B52,'4. Equipment Costs'!B:B,$E$21)\n+SUMIFS('5. Subcontracting Costs'!H:H,'5. Subcontracting Costs'!C:C,B52,'5. Subcontracting Costs'!B:B,$E$21)\n+SUMIFS(' 2-3-6. Travel&Costs of Stay'!N:N,' 2-3-6. Travel&Costs of Stay'!C:C,B52,' 2-3-6. Travel&Costs of Stay'!B:B,$E$21)","v":0},{"$f":"SUMIFS('1. Staff costs'!S:S,'1. Staff costs'!C:C,B52,'1. Staff costs'!B:B,$F$21)\n+SUMIFS(' 2-3-6. Travel&Costs of Stay'!O:O,' 2-3-6. Travel&Costs of Stay'!C:C,B52,' 2-3-6. Travel&Costs of Stay'!B:B,$F$21)\n+SUMIFS(' 2-3-6. Travel&Costs of Stay'!P:P,' 2-3-6. Travel&Costs of Stay'!C:C,B52,' 2-3-6. Travel&Costs of Stay'!B:B,$F$21)\n+SUMIFS('4. Equipment Costs'!H:H,'4. Equipment Costs'!C:C,B52,'4. Equipment Costs'!B:B,$F$21)\n+SUMIFS('5. Subcontracting Costs'!H:H,'5. Subcontracting Costs'!C:C,B52,'5. Subcontracting Costs'!B:B,$F$21)\n+SUMIFS(' 2-3-6. Travel&Costs of Stay'!N:N,' 2-3-6. Travel&Costs of Stay'!C:C,B52,' 2-3-6. Travel&Costs of Stay'!B:B,$F$21)","v":0},{"$f":"SUMIFS('1. Staff costs'!S:S,'1. Staff costs'!C:C,B52,'1. Staff costs'!B:B,$G$21)\n+SUMIFS(' 2-3-6. Travel&Costs of Stay'!O:O,' 2-3-6. Travel&Costs of Stay'!C:C,B52,' 2-3-6. Travel&Costs of Stay'!B:B,$G$21)\n+SUMIFS(' 2-3-6. Travel&Costs of Stay'!P:P,' 2-3-6. Travel&Costs of Stay'!C:C,B52,' 2-3-6. Travel&Costs of Stay'!B:B,$G$21)\n+SUMIFS('4. Equipment Costs'!H:H,'4. Equipment Costs'!C:C,B52,'4. Equipment Costs'!B:B,$G$21)\n+SUMIFS('5. Subcontracting Costs'!H:H,'5. Subcontracting Costs'!C:C,B52,'5. Subcontracting Costs'!B:B,$G$21)\n+SUMIFS(' 2-3-6. Travel&Costs of Stay'!N:N,' 2-3-6. Travel&Costs of Stay'!C:C,B52,' 2-3-6. Travel&Costs of Stay'!B:B,$G$21)","v":0},0]
[null,"P32",{"$f":"SUMIFS('1. Staff costs'!S:S,'1. Staff costs'!C:C,B53,'1. Staff costs'!B:B,$C$21)\n+SUMIFS(' 2-3-6. Travel&Costs of Stay'!O:O,' 2-3-6. Travel&Costs of Stay'!C:C,B53,' 2-3-6. Travel&Costs of Stay'!B:B,$C$21)\n+SUMIFS(' 2-3-6. Travel&Costs of Stay'!P:P,' 2-3-6. Travel&Costs of Stay'!C:C,B53,' 2-3-6. Travel&Costs of Stay'!B:B,$C$21)\n+SUMIFS('4. Equipment Costs'!H:H,'4. Equipment Costs'!C:C,B53,'4. Equipment Costs'!B:B,$C$21)\n+SUMIFS('5. Subcontracting Costs'!H:H,'5. Subcontracting Costs'!C:C,B53,'5. Subcontracting Costs'!B:B,$C$21)\n+SUMIFS(' 2-3-6. Travel&Costs of Stay'!N:N,' 2-3-6. Travel&Costs of Stay'!C:C,B53,' 2-3-6. Travel&Costs of Stay'!B:B,$C$21)","v":0},{"$f":"SUMIFS('1. Staff costs'!S:S,'1. Staff costs'!C:C,B53,'1. Staff costs'!B:B,$D$21)\n+SUMIFS(' 2-3-6. Travel&Costs of Stay'!O:O,' 2-3-6. Travel&Costs of Stay'!C:C,B53,' 2-3-6. Travel&Costs of Stay'!B:B,$D$21)\n+SUMIFS(' 2-3-6. Travel&Costs of Stay'!P:P,' 2-3-6. Travel&Costs of Stay'!C:C,B53,' 2-3-6. Travel&Costs of Stay'!B:B,$D$21)\n+SUMIFS('4. Equipment Costs'!H:H,'4. Equipment Costs'!C:C,B53,'4. Equipment Costs'!B:B,$D$21)\n+SUMIFS('5. Subcontracting Costs'!H:H,'5. Subcontracting Costs'!C:C,B53,'5. Subcontracting Costs'!B:B,$D$21)\n+SUMIFS(' 2-3-6. Travel&Costs of Stay'!N:N,' 2-3-6. Travel&Costs of Stay'!C:C,B53,' 2-3-6. Travel&Costs of Stay'!B:B,$D$21)","v":0},{"$f":"SUMIFS('1. Staff costs'!S:S,'1. Staff costs'!C:C,B53,'1. Staff costs'!B:B,$E$21)\n+SUMIFS(' 2-3-6. Travel&Costs of Stay'!O:O,' 2-3-6. Travel&Costs of Stay'!C:C,B53,' 2-3-6. Travel&Costs of Stay'!B:B,$E$21)\n+SUMIFS(' 2-3-6. Travel&Costs of Stay'!P:P,' 2-3-6. Travel&Costs of Stay'!C:C,B53,' 2-3-6. Travel&Costs of Stay'!B:B,$E$21)\n+SUMIFS('4. Equipment Costs'!H:H,'4. Equipment Costs'!C:C,B53,'4. Equipment Costs'!B:B,$E$21)\n+SUMIFS('5. Subcontracting Costs'!H:H,'5. Subcontracting Costs'!C:C,B53,'5. Subcontracting Costs'!B:B,$E$21)\n+SUMIFS(' 2-3-6. Travel&Costs of Stay'!N:N,' 2-3-6. Travel&Costs of Stay'!C:C,B53,' 2-3-6. Travel&Costs of Stay'!B:B,$E$21)","v":0},{"$f":"SUMIFS('1. Staff costs'!S:S,'1. Staff costs'!C:C,B53,'1. Staff costs'!B:B,$F$21)\n+SUMIFS(' 2-3-6. Travel&Costs of Stay'!O:O,' 2-3-6. Travel&Costs of Stay'!C:C,B53,' 2-3-6. Travel&Costs of Stay'!B:B,$F$21)\n+SUMIFS(' 2-3-6. Travel&Costs of Stay'!P:P,' 2-3-6. Travel&Costs of Stay'!C:C,B53,' 2-3-6. Travel&Costs of Stay'!B:B,$F$21)\n+SUMIFS('4. Equipment Costs'!H:H,'4. Equipment Costs'!C:C,B53,'4. Equipment Costs'!B:B,$F$21)\n+SUMIFS('5. Subcontracting Costs'!H:H,'5. Subcontracting Costs'!C:C,B53,'5. Subcontracting Costs'!B:B,$F$21)\n+SUMIFS(' 2-3-6. Travel&Costs of Stay'!N:N,' 2-3-6. Travel&Costs of Stay'!C:C,B53,' 2-3-6. Travel&Costs of Stay'!B:B,$F$21)","v":0},{"$f":"SUMIFS('1. Staff costs'!S:S,'1. Staff costs'!C:C,B53,'1. Staff costs'!B:B,$G$21)\n+SUMIFS(' 2-3-6. Travel&Costs of Stay'!O:O,' 2-3-6. Travel&Costs of Stay'!C:C,B53,' 2-3-6. Travel&Costs of Stay'!B:B,$G$21)\n+SUMIFS(' 2-3-6. Travel&Costs of Stay'!P:P,' 2-3-6. Travel&Costs of Stay'!C:C,B53,' 2-3-6. Travel&Costs of Stay'!B:B,$G$21)\n+SUMIFS('4. Equipment Costs'!H:H,'4. Equipment Costs'!C:C,B53,'4. Equipment Costs'!B:B,$G$21)\n+SUMIFS('5. Subcontracting Costs'!H:H,'5. Subcontracting Costs'!C:C,B53,'5. Subcontracting Costs'!B:B,$G$21)\n+SUMIFS(' 2-3-6. Travel&Costs of Stay'!N:N,' 2-3-6. Travel&Costs of Stay'!C:C,B53,' 2-3-6. Travel&Costs of Stay'!B:B,$G$21)","v":0},0]
[null,"P33",{"$f":"SUMIFS('1. Staff costs'!S:S,'1. Staff costs'!C:C,B54,'1. Staff costs'!B:B,$C$21)\n+SUMIFS(' 2-3-6. Travel&Costs of Stay'!O:O,' 2-3-6. Travel&Costs of Stay'!C:C,B54,' 2-3-6. Travel&Costs of Stay'!B:B,$C$21)\n+SUMIFS(' 2-3-6. Travel&Costs of Stay'!P:P,' 2-3-6. Travel&Costs of Stay'!C:C,B54,' 2-3-6. Travel&Costs of Stay'!B:B,$C$21)\n+SUMIFS('4. Equipment Costs'!H:H,'4. Equipment Costs'!C:C,B54,'4. Equipment Costs'!B:B,$C$21)\n+SUMIFS('5. Subcontracting Costs'!H:H,'5. Subcontracting Costs'!C:C,B54,'5. Subcontracting Costs'!B:B,$C$21)\n+SUMIFS(' 2-3-6. Travel&Costs of Stay'!N:N,' 2-3-6. Travel&Costs of Stay'!C:C,B54,' 2-3-6. Travel&Costs of Stay'!B:B,$C$21)","v":0},{"$f":"SUMIFS('1. Staff costs'!S:S,'1. Staff costs'!C:C,B54,'1. Staff costs'!B:B,$D$21)\n+SUMIFS(' 2-3-6. Travel&Costs of Stay'!O:O,' 2-3-6. Travel&Costs of Stay'!C:C,B54,' 2-3-6. Travel&Costs of Stay'!B:B,$D$21)\n+SUMIFS(' 2-3-6. Travel&Costs of Stay'!P:P,' 2-3-6. Travel&Costs of Stay'!C:C,B54,' 2-3-6. Travel&Costs of Stay'!B:B,$D$21)\n+SUMIFS('4. Equipment Costs'!H:H,'4. Equipment Costs'!C:C,B54,'4. Equipment Costs'!B:B,$D$21)\n+SUMIFS('5. Subcontracting Costs'!H:H,'5. Subcontracting Costs'!C:C,B54,'5. Subcontracting Costs'!B:B,$D$21)\n+SUMIFS(' 2-3-6. Travel&Costs of Stay'!N:N,' 2-3-6. Travel&Costs of Stay'!C:C,B54,' 2-3-6. Travel&Costs of Stay'!B:B,$D$21)","v":0},{"$f":"SUMIFS('1. Staff costs'!S:S,'1. Staff costs'!C:C,B54,'1. Staff costs'!B:B,$E$21)\n+SUMIFS(' 2-3-6. Travel&Costs of Stay'!O:O,' 2-3-6. Travel&Costs of Stay'!C:C,B54,' 2-3-6. Travel&Costs of Stay'!B:B,$E$21)\n+SUMIFS(' 2-3-6. Travel&Costs of Stay'!P:P,' 2-3-6. Travel&Costs of Stay'!C:C,B54,' 2-3-6. Travel&Costs of Stay'!B:B,$E$21)\n+SUMIFS('4. Equipment Costs'!H:H,'4. Equipment Costs'!C:C,B54,'4. Equipment Costs'!B:B,$E$21)\n+SUMIFS('5. Subcontracting Costs'!H:H,'5. Subcontracting Costs'!C:C,B54,'5. Subcontracting Costs'!B:B,$E$21)\n+SUMIFS(' 2-3-6. Travel&Costs of Stay'!N:N,' 2-3-6. Travel&Costs of Stay'!C:C,B54,' 2-3-6. Travel&Costs of Stay'!B:B,$E$21)","v":0},{"$f":"SUMIFS('1. Staff costs'!S:S,'1. Staff costs'!C:C,B54,'1. Staff costs'!B:B,$F$21)\n+SUMIFS(' 2-3-6. Travel&Costs of Stay'!O:O,' 2-3-6. Travel&Costs of Stay'!C:C,B54,' 2-3-6. Travel&Costs of Stay'!B:B,$F$21)\n+SUMIFS(' 2-3-6. Travel&Costs of Stay'!P:P,' 2-3-6. Travel&Costs of Stay'!C:C,B54,' 2-3-6. Travel&Costs of Stay'!B:B,$F$21)\n+SUMIFS('4. Equipment Costs'!H:H,'4. Equipment Costs'!C:C,B54,'4. Equipment Costs'!B:B,$F$21)\n+SUMIFS('5. Subcontracting Costs'!H:H,'5. Subcontracting Costs'!C:C,B54,'5. Subcontracting Costs'!B:B,$F$21)\n+SUMIFS(' 2-3-6. Travel&Costs of Stay'!N:N,' 2-3-6. Travel&Costs of Stay'!C:C,B54,' 2-3-6. Travel&Costs of Stay'!B:B,$F$21)","v":0},{"$f":"SUMIFS('1. Staff costs'!S:S,'1. Staff costs'!C:C,B54,'1. Staff costs'!B:B,$G$21)\n+SUMIFS(' 2-3-6. Travel&Costs of Stay'!O:O,' 2-3-6. Travel&Costs of Stay'!C:C,B54,' 2-3-6. Travel&Costs of Stay'!B:B,$G$21)\n+SUMIFS(' 2-3-6. Travel&Costs of Stay'!P:P,' 2-3-6. Travel&Costs of Stay'!C:C,B54,' 2-3-6. Travel&Costs of Stay'!B:B,$G$21)\n+SUMIFS('4. Equipment Costs'!H:H,'4. Equipment Costs'!C:C,B54,'4. Equipment Costs'!B:B,$G$21)\n+SUMIFS('5. Subcontracting Costs'!H:H,'5. Subcontracting Costs'!C:C,B54,'5. Subcontracting Costs'!B:B,$G$21)\n+SUMIFS(' 2-3-6. Travel&Costs of Stay'!N:N,' 2-3-6. Travel&Costs of Stay'!C:C,B54,' 2-3-6. Travel&Costs of Stay'!B:B,$G$21)","v":0},0]
[null,"P34",{"$f":"SUMIFS('1. Staff costs'!S:S,'1. Staff costs'!C:C,B55,'1. Staff costs'!B:B,$C$21)\n+SUMIFS(' 2-3-6. Travel&Costs of Stay'!O:O,' 2-3-6. Travel&Costs of Stay'!C:C,B55,' 2-3-6. Travel&Costs of Stay'!B:B,$C$21)\n+SUMIFS(' 2-3-6. Travel&Costs of Stay'!P:P,' 2-3-6. Travel&Costs of Stay'!C:C,B55,' 2-3-6. Travel&Costs of Stay'!B:B,$C$21)\n+SUMIFS('4. Equipment Costs'!H:H,'4. Equipment Costs'!C:C,B55,'4. Equipment Costs'!B:B,$C$21)\n+SUMIFS('5. Subcontracting Costs'!H:H,'5. Subcontracting Costs'!C:C,B55,'5. Subcontracting Costs'!B:B,$C$21)\n+SUMIFS(' 2-3-6. Travel&Costs of Stay'!N:N,' 2-3-6. Travel&Costs of Stay'!C:C,B55,' 2-3-6. Travel&Costs of Stay'!B:B,$C$21)","v":0},{"$f":"SUMIFS('1. Staff costs'!S:S,'1. Staff costs'!C:C,B55,'1. Staff costs'!B:B,$D$21)\n+SUMIFS(' 2-3-6. Travel&Costs of Stay'!O:O,' 2-3-6. Travel&Costs of Stay'!C:C,B55,' 2-3-6. Travel&Costs of Stay'!B:B,$D$21)\n+SUMIFS(' 2-3-6. Travel&Costs of Stay'!P:P,' 2-3-6. Travel&Costs of Stay'!C:C,B55,' 2-3-6. Travel&Costs of Stay'!B:B,$D$21)\n+SUMIFS('4. Equipment Costs'!H:H,'4. Equipment Costs'!C:C,B55,'4. Equipment Costs'!B:B,$D$21)\n+SUMIFS('5. Subcontracting Costs'!H:H,'5. Subcontracting Costs'!C:C,B55,'5. Subcontracting Costs'!B:B,$D$21)\n+SUMIFS(' 2-3-6. Travel&Costs of Stay'!N:N,' 2-3-6. Travel&Costs of Stay'!C:C,B55,' 2-3-6. Travel&Costs of Stay'!B:B,$D$21)","v":0},{"$f":"SUMIFS('1. Staff costs'!S:S,'1. Staff costs'!C:C,B55,'1. Staff costs'!B:B,$E$21)\n+SUMIFS(' 2-3-6. Travel&Costs of Stay'!O:O,' 2-3-6. Travel&Costs of Stay'!C:C,B55,' 2-3-6. Travel&Costs of Stay'!B:B,$E$21)\n+SUMIFS(' 2-3-6. Travel&Costs of Stay'!P:P,' 2-3-6. Travel&Costs of Stay'!C:C,B55,' 2-3-6. Travel&Costs of Stay'!B:B,$E$21)\n+SUMIFS('4. Equipment Costs'!H:H,'4. Equipment Costs'!C:C,B55,'4. Equipment Costs'!B:B,$E$21)\n+SUMIFS('5. Subcontracting Costs'!H:H,'5. Subcontracting Costs'!C:C,B55,'5. Subcontracting Costs'!B:B,$E$21)\n+SUMIFS(' 2-3-6. Travel&Costs of Stay'!N:N,' 2-3-6. Travel&Costs of Stay'!C:C,B55,' 2-3-6. Travel&Costs of Stay'!B:B,$E$21)","v":0},{"$f":"SUMIFS('1. Staff costs'!S:S,'1. Staff costs'!C:C,B55,'1. Staff costs'!B:B,$F$21)\n+SUMIFS(' 2-3-6. Travel&Costs of Stay'!O:O,' 2-3-6. Travel&Costs of Stay'!C:C,B55,' 2-3-6. Travel&Costs of Stay'!B:B,$F$21)\n+SUMIFS(' 2-3-6. Travel&Costs of Stay'!P:P,' 2-3-6. Travel&Costs of Stay'!C:C,B55,' 2-3-6. Travel&Costs of Stay'!B:B,$F$21)\n+SUMIFS('4. Equipment Costs'!H:H,'4. Equipment Costs'!C:C,B55,'4. Equipment Costs'!B:B,$F$21)\n+SUMIFS('5. Subcontracting Costs'!H:H,'5. Subcontracting Costs'!C:C,B55,'5. Subcontracting Costs'!B:B,$F$21)\n+SUMIFS(' 2-3-6. Travel&Costs of Stay'!N:N,' 2-3-6. Travel&Costs of Stay'!C:C,B55,' 2-3-6. Travel&Costs of Stay'!B:B,$F$21)","v":0},{"$f":"SUMIFS('1. Staff costs'!S:S,'1. Staff costs'!C:C,B55,'1. Staff costs'!B:B,$G$21)\n+SUMIFS(' 2-3-6. Travel&Costs of Stay'!O:O,' 2-3-6. Travel&Costs of Stay'!C:C,B55,' 2-3-6. Travel&Costs of Stay'!B:B,$G$21)\n+SUMIFS(' 2-3-6. Travel&Costs of Stay'!P:P,' 2-3-6. Travel&Costs of Stay'!C:C,B55,' 2-3-6. Travel&Costs of Stay'!B:B,$G$21)\n+SUMIFS('4. Equipment Costs'!H:H,'4. Equipment Costs'!C:C,B55,'4. Equipment Costs'!B:B,$G$21)\n+SUMIFS('5. Subcontracting Costs'!H:H,'5. Subcontracting Costs'!C:C,B55,'5. Subcontracting Costs'!B:B,$G$21)\n+SUMIFS(' 2-3-6. Travel&Costs of Stay'!N:N,' 2-3-6. Travel&Costs of Stay'!C:C,B55,' 2-3-6. Travel&Costs of Stay'!B:B,$G$21)","v":0},0]
[null,"P35",{"$f":"SUMIFS('1. Staff costs'!S:S,'1. Staff costs'!C:C,B56,'1. Staff costs'!B:B,$C$21)\n+SUMIFS(' 2-3-6. Travel&Costs of Stay'!O:O,' 2-3-6. Travel&Costs of Stay'!C:C,B56,' 2-3-6. Travel&Costs of Stay'!B:B,$C$21)\n+SUMIFS(' 2-3-6. Travel&Costs of Stay'!P:P,' 2-3-6. Travel&Costs of Stay'!C:C,B56,' 2-3-6. Travel&Costs of Stay'!B:B,$C$21)\n+SUMIFS('4. Equipment Costs'!H:H,'4. Equipment Costs'!C:C,B56,'4. Equipment Costs'!B:B,$C$21)\n+SUMIFS('5. Subcontracting Costs'!H:H,'5. Subcontracting Costs'!C:C,B56,'5. Subcontracting Costs'!B:B,$C$21)\n+SUMIFS(' 2-3-6. Travel&Costs of Stay'!N:N,' 2-3-6. Travel&Costs of Stay'!C:C,B56,' 2-3-6. Travel&Costs of Stay'!B:B,$C$21)","v":0},{"$f":"SUMIFS('1. Staff costs'!S:S,'1. Staff costs'!C:C,B56,'1. Staff costs'!B:B,$D$21)\n+SUMIFS(' 2-3-6. Travel&Costs of Stay'!O:O,' 2-3-6. Travel&Costs of Stay'!C:C,B56,' 2-3-6. Travel&Costs of Stay'!B:B,$D$21)\n+SUMIFS(' 2-3-6. Travel&Costs of Stay'!P:P,' 2-3-6. Travel&Costs of Stay'!C:C,B56,' 2-3-6. Travel&Costs of Stay'!B:B,$D$21)\n+SUMIFS('4. Equipment Costs'!H:H,'4. Equipment Costs'!C:C,B56,'4. Equipment Costs'!B:B,$D$21)\n+SUMIFS('5. Subcontracting Costs'!H:H,'5. Subcontracting Costs'!C:C,B56,'5. Subcontracting Costs'!B:B,$D$21)\n+SUMIFS(' 2-3-6. Travel&Costs of Stay'!N:N,' 2-3-6. Travel&Costs of Stay'!C:C,B56,' 2-3-6. Travel&Costs of Stay'!B:B,$D$21)","v":0},{"$f":"SUMIFS('1. Staff costs'!S:S,'1. Staff costs'!C:C,B56,'1. Staff costs'!B:B,$E$21)\n+SUMIFS(' 2-3-6. Travel&Costs of Stay'!O:O,' 2-3-6. Travel&Costs of Stay'!C:C,B56,' 2-3-6. Travel&Costs of Stay'!B:B,$E$21)\n+SUMIFS(' 2-3-6. Travel&Costs of Stay'!P:P,' 2-3-6. Travel&Costs of Stay'!C:C,B56,' 2-3-6. Travel&Costs of Stay'!B:B,$E$21)\n+SUMIFS('4. Equipment Costs'!H:H,'4. Equipment Costs'!C:C,B56,'4. Equipment Costs'!B:B,$E$21)\n+SUMIFS('5. Subcontracting Costs'!H:H,'5. Subcontracting Costs'!C:C,B56,'5. Subcontracting Costs'!B:B,$E$21)\n+SUMIFS(' 2-3-6. Travel&Costs of Stay'!N:N,' 2-3-6. Travel&Costs of Stay'!C:C,B56,' 2-3-6. Travel&Costs of Stay'!B:B,$E$21)","v":0},{"$f":"SUMIFS('1. Staff costs'!S:S,'1. Staff costs'!C:C,B56,'1. Staff costs'!B:B,$F$21)\n+SUMIFS(' 2-3-6. Travel&Costs of Stay'!O:O,' 2-3-6. Travel&Costs of Stay'!C:C,B56,' 2-3-6. Travel&Costs of Stay'!B:B,$F$21)\n+SUMIFS(' 2-3-6. Travel&Costs of Stay'!P:P,' 2-3-6. Travel&Costs of Stay'!C:C,B56,' 2-3-6. Travel&Costs of Stay'!B:B,$F$21)\n+SUMIFS('4. Equipment Costs'!H:H,'4. Equipment Costs'!C:C,B56,'4. Equipment Costs'!B:B,$F$21)\n+SUMIFS('5. Subcontracting Costs'!H:H,'5. Subcontracting Costs'!C:C,B56,'5. Subcontracting Costs'!B:B,$F$21)\n+SUMIFS(' 2-3-6. Travel&Costs of Stay'!N:N,' 2-3-6. Travel&Costs of Stay'!C:C,B56,' 2-3-6. Travel&Costs of Stay'!B:B,$F$21)","v":0},{"$f":"SUMIFS('1. Staff costs'!S:S,'1. Staff costs'!C:C,B56,'1. Staff costs'!B:B,$G$21)\n+SUMIFS(' 2-3-6. Travel&Costs of Stay'!O:O,' 2-3-6. Travel&Costs of Stay'!C:C,B56,' 2-3-6. Travel&Costs of Stay'!B:B,$G$21)\n+SUMIFS(' 2-3-6. Travel&Costs of Stay'!P:P,' 2-3-6. Travel&Costs of Stay'!C:C,B56,' 2-3-6. Travel&Costs of Stay'!B:B,$G$21)\n+SUMIFS('4. Equipment Costs'!H:H,'4. Equipment Costs'!C:C,B56,'4. Equipment Costs'!B:B,$G$21)\n+SUMIFS('5. Subcontracting Costs'!H:H,'5. Subcontracting Costs'!C:C,B56,'5. Subcontracting Costs'!B:B,$G$21)\n+SUMIFS(' 2-3-6. Travel&Costs of Stay'!N:N,' 2-3-6. Travel&Costs of Stay'!C:C,B56,' 2-3-6. Travel&Costs of Stay'!B:B,$G$21)","v":0},0]
[null,"P36",{"$f":"SUMIFS('1. Staff costs'!S:S,'1. Staff costs'!C:C,B57,'1. Staff costs'!B:B,$C$21)\n+SUMIFS(' 2-3-6. Travel&Costs of Stay'!O:O,' 2-3-6. Travel&Costs of Stay'!C:C,B57,' 2-3-6. Travel&Costs of Stay'!B:B,$C$21)\n+SUMIFS(' 2-3-6. Travel&Costs of Stay'!P:P,' 2-3-6. Travel&Costs of Stay'!C:C,B57,' 2-3-6. Travel&Costs of Stay'!B:B,$C$21)\n+SUMIFS('4. Equipment Costs'!H:H,'4. Equipment Costs'!C:C,B57,'4. Equipment Costs'!B:B,$C$21)\n+SUMIFS('5. Subcontracting Costs'!H:H,'5. Subcontracting Costs'!C:C,B57,'5. Subcontracting Costs'!B:B,$C$21)\n+SUMIFS(' 2-3-6. Travel&Costs of Stay'!N:N,' 2-3-6. Travel&Costs of Stay'!C:C,B57,' 2-3-6. Travel&Costs of Stay'!B:B,$C$21)","v":0},{"$f":"SUMIFS('1. Staff costs'!S:S,'1. Staff costs'!C:C,B57,'1. Staff costs'!B:B,$D$21)\n+SUMIFS(' 2-3-6. Travel&Costs of Stay'!O:O,' 2-3-6. Travel&Costs of Stay'!C:C,B57,' 2-3-6. Travel&Costs of Stay'!B:B,$D$21)\n+SUMIFS(' 2-3-6. Travel&Costs of Stay'!P:P,' 2-3-6. Travel&Costs of Stay'!C:C,B57,' 2-3-6. Travel&Costs of Stay'!B:B,$D$21)\n+SUMIFS('4. Equipment Costs'!H:H,'4. Equipment Costs'!C:C,B57,'4. Equipment Costs'!B:B,$D$21)\n+SUMIFS('5. Subcontracting Costs'!H:H,'5. Subcontracting Costs'!C:C,B57,'5. Subcontracting Costs'!B:B,$D$21)\n+SUMIFS(' 2-3-6. Travel&Costs of Stay'!N:N,' 2-3-6. Travel&Costs of Stay'!C:C,B57,' 2-3-6. Travel&Costs of Stay'!B:B,$D$21)","v":0},{"$f":"SUMIFS('1. Staff costs'!S:S,'1. Staff costs'!C:C,B57,'1. Staff costs'!B:B,$E$21)\n+SUMIFS(' 2-3-6. Travel&Costs of Stay'!O:O,' 2-3-6. Travel&Costs of Stay'!C:C,B57,' 2-3-6. Travel&Costs of Stay'!B:B,$E$21)\n+SUMIFS(' 2-3-6. Travel&Costs of Stay'!P:P,' 2-3-6. Travel&Costs of Stay'!C:C,B57,' 2-3-6. Travel&Costs of Stay'!B:B,$E$21)\n+SUMIFS('4. Equipment Costs'!H:H,'4. Equipment Costs'!C:C,B57,'4. Equipment Costs'!B:B,$E$21)\n+SUMIFS('5. Subcontracting Costs'!H:H,'5. Subcontracting Costs'!C:C,B57,'5. Subcontracting Costs'!B:B,$E$21)\n+SUMIFS(' 2-3-6. Travel&Costs of Stay'!N:N,' 2-3-6. Travel&Costs of Stay'!C:C,B57,' 2-3-6. Travel&Costs of Stay'!B:B,$E$21)","v":0},{"$f":"SUMIFS('1. Staff costs'!S:S,'1. Staff costs'!C:C,B57,'1. Staff costs'!B:B,$F$21)\n+SUMIFS(' 2-3-6. Travel&Costs of Stay'!O:O,' 2-3-6. Travel&Costs of Stay'!C:C,B57,' 2-3-6. Travel&Costs of Stay'!B:B,$F$21)\n+SUMIFS(' 2-3-6. Travel&Costs of Stay'!P:P,' 2-3-6. Travel&Costs of Stay'!C:C,B57,' 2-3-6. Travel&Costs of Stay'!B:B,$F$21)\n+SUMIFS('4. Equipment Costs'!H:H,'4. Equipment Costs'!C:C,B57,'4. Equipment Costs'!B:B,$F$21)\n+SUMIFS('5. Subcontracting Costs'!H:H,'5. Subcontracting Costs'!C:C,B57,'5. Subcontracting Costs'!B:B,$F$21)\n+SUMIFS(' 2-3-6. Travel&Costs of Stay'!N:N,' 2-3-6. Travel&Costs of Stay'!C:C,B57,' 2-3-6. Travel&Costs of Stay'!B:B,$F$21)","v":0},{"$f":"SUMIFS('1. Staff costs'!S:S,'1. Staff costs'!C:C,B57,'1. Staff costs'!B:B,$G$21)\n+SUMIFS(' 2-3-6. Travel&Costs of Stay'!O:O,' 2-3-6. Travel&Costs of Stay'!C:C,B57,' 2-3-6. Travel&Costs of Stay'!B:B,$G$21)\n+SUMIFS(' 2-3-6. Travel&Costs of Stay'!P:P,' 2-3-6. Travel&Costs of Stay'!C:C,B57,' 2-3-6. Travel&Costs of Stay'!B:B,$G$21)\n+SUMIFS('4. Equipment Costs'!H:H,'4. Equipment Costs'!C:C,B57,'4. Equipment Costs'!B:B,$G$21)\n+SUMIFS('5. Subcontracting Costs'!H:H,'5. Subcontracting Costs'!C:C,B57,'5. Subcontracting Costs'!B:B,$G$21)\n+SUMIFS(' 2-3-6. Travel&Costs of Stay'!N:N,' 2-3-6. Travel&Costs of Stay'!C:C,B57,' 2-3-6. Travel&Costs of Stay'!B:B,$G$21)","v":0},0]
[null,"P37",{"$f":"SUMIFS('1. Staff costs'!S:S,'1. Staff costs'!C:C,B58,'1. Staff costs'!B:B,$C$21)\n+SUMIFS(' 2-3-6. Travel&Costs of Stay'!O:O,' 2-3-6. Travel&Costs of Stay'!C:C,B58,' 2-3-6. Travel&Costs of Stay'!B:B,$C$21)\n+SUMIFS(' 2-3-6. Travel&Costs of Stay'!P:P,' 2-3-6. Travel&Costs of Stay'!C:C,B58,' 2-3-6. Travel&Costs of Stay'!B:B,$C$21)\n+SUMIFS('4. Equipment Costs'!H:H,'4. Equipment Costs'!C:C,B58,'4. Equipment Costs'!B:B,$C$21)\n+SUMIFS('5. Subcontracting Costs'!H:H,'5. Subcontracting Costs'!C:C,B58,'5. Subcontracting Costs'!B:B,$C$21)\n+SUMIFS(' 2-3-6. Travel&Costs of Stay'!N:N,' 2-3-6. Travel&Costs of Stay'!C:C,B58,' 2-3-6. Travel&Costs of Stay'!B:B,$C$21)","v":0},{"$f":"SUMIFS('1. Staff costs'!S:S,'1. Staff costs'!C:C,B58,'1. Staff costs'!B:B,$D$21)\n+SUMIFS(' 2-3-6. Travel&Costs of Stay'!O:O,' 2-3-6. Travel&Costs of Stay'!C:C,B58,' 2-3-6. Travel&Costs of Stay'!B:B,$D$21)\n+SUMIFS(' 2-3-6. Travel&Costs of Stay'!P:P,' 2-3-6. Travel&Costs of Stay'!C:C,B58,' 2-3-6. Travel&Costs of Stay'!B:B,$D$21)\n+SUMIFS('4. Equipment Costs'!H:H,'4. Equipment Costs'!C:C,B58,'4. Equipment Costs'!B:B,$D$21)\n+SUMIFS('5. Subcontracting Costs'!H:H,'5. Subcontracting Costs'!C:C,B58,'5. Subcontracting Costs'!B:B,$D$21)\n+SUMIFS(' 2-3-6. Travel&Costs of Stay'!N:N,' 2-3-6. Travel&Costs of Stay'!C:C,B58,' 2-3-6. Travel&Costs of Stay'!B:B,$D$21)","v":0},{"$f":"SUMIFS('1. Staff costs'!S:S,'1. Staff costs'!C:C,B58,'1. Staff costs'!B:B,$E$21)\n+SUMIFS(' 2-3-6. Travel&Costs of Stay'!O:O,' 2-3-6. Travel&Costs of Stay'!C:C,B58,' 2-3-6. Travel&Costs of Stay'!B:B,$E$21)\n+SUMIFS(' 2-3-6. Travel&Costs of Stay'!P:P,' 2-3-6. Travel&Costs of Stay'!C:C,B58,' 2-3-6. Travel&Costs of Stay'!B:B,$E$21)\n+SUMIFS('4. Equipment Costs'!H:H,'4. Equipment Costs'!C:C,B58,'4. Equipment Costs'!B:B,$E$21)\n+SUMIFS('5. Subcontracting Costs'!H:H,'5. Subcontracting Costs'!C:C,B58,'5. Subcontracting Costs'!B:B,$E$21)\n+SUMIFS(' 2-3-6. Travel&Costs of Stay'!N:N,' 2-3-6. Travel&Costs of Stay'!C:C,B58,' 2-3-6. Travel&Costs of Stay'!B:B,$E$21)","v":0},{"$f":"SUMIFS('1. Staff costs'!S:S,'1. Staff costs'!C:C,B58,'1. Staff costs'!B:B,$F$21)\n+SUMIFS(' 2-3-6. Travel&Costs of Stay'!O:O,' 2-3-6. Travel&Costs of Stay'!C:C,B58,' 2-3-6. Travel&Costs of Stay'!B:B,$F$21)\n+SUMIFS(' 2-3-6. Travel&Costs of Stay'!P:P,' 2-3-6. Travel&Costs of Stay'!C:C,B58,' 2-3-6. Travel&Costs of Stay'!B:B,$F$21)\n+SUMIFS('4. Equipment Costs'!H:H,'4. Equipment Costs'!C:C,B58,'4. Equipment Costs'!B:B,$F$21)\n+SUMIFS('5. Subcontracting Costs'!H:H,'5. Subcontracting Costs'!C:C,B58,'5. Subcontracting Costs'!B:B,$F$21)\n+SUMIFS(' 2-3-6. Travel&Costs of Stay'!N:N,' 2-3-6. Travel&Costs of Stay'!C:C,B58,' 2-3-6. Travel&Costs of Stay'!B:B,$F$21)","v":0},{"$f":"SUMIFS('1. Staff costs'!S:S,'1. Staff costs'!C:C,B58,'1. Staff costs'!B:B,$G$21)\n+SUMIFS(' 2-3-6. Travel&Costs of Stay'!O:O,' 2-3-6. Travel&Costs of Stay'!C:C,B58,' 2-3-6. Travel&Costs of Stay'!B:B,$G$21)\n+SUMIFS(' 2-3-6. Travel&Costs of Stay'!P:P,' 2-3-6. Travel&Costs of Stay'!C:C,B58,' 2-3-6. Travel&Costs of Stay'!B:B,$G$21)\n+SUMIFS('4. Equipment Costs'!H:H,'4. Equipment Costs'!C:C,B58,'4. Equipment Costs'!B:B,$G$21)\n+SUMIFS('5. Subcontracting Costs'!H:H,'5. Subcontracting Costs'!C:C,B58,'5. Subcontracting Costs'!B:B,$G$21)\n+SUMIFS(' 2-3-6. Travel&Costs of Stay'!N:N,' 2-3-6. Travel&Costs of Stay'!C:C,B58,' 2-3-6. Travel&Costs of Stay'!B:B,$G$21)","v":0},0]
[null,"P38",{"$f":"SUMIFS('1. Staff costs'!S:S,'1. Staff costs'!C:C,B59,'1. Staff costs'!B:B,$C$21)\n+SUMIFS(' 2-3-6. Travel&Costs of Stay'!O:O,' 2-3-6. Travel&Costs of Stay'!C:C,B59,' 2-3-6. Travel&Costs of Stay'!B:B,$C$21)\n+SUMIFS(' 2-3-6. Travel&Costs of Stay'!P:P,' 2-3-6. Travel&Costs of Stay'!C:C,B59,' 2-3-6. Travel&Costs of Stay'!B:B,$C$21)\n+SUMIFS('4. Equipment Costs'!H:H,'4. Equipment Costs'!C:C,B59,'4. Equipment Costs'!B:B,$C$21)\n+SUMIFS('5. Subcontracting Costs'!H:H,'5. Subcontracting Costs'!C:C,B59,'5. Subcontracting Costs'!B:B,$C$21)\n+SUMIFS(' 2-3-6. Travel&Costs of Stay'!N:N,' 2-3-6. Travel&Costs of Stay'!C:C,B59,' 2-3-6. Travel&Costs of Stay'!B:B,$C$21)","v":0},{"$f":"SUMIFS('1. Staff costs'!S:S,'1. Staff costs'!C:C,B59,'1. Staff costs'!B:B,$D$21)\n+SUMIFS(' 2-3-6. Travel&Costs of Stay'!O:O,' 2-3-6. Travel&Costs of Stay'!C:C,B59,' 2-3-6. Travel&Costs of Stay'!B:B,$D$21)\n+SUMIFS(' 2-3-6. Travel&Costs of Stay'!P:P,' 2-3-6. Travel&Costs of Stay'!C:C,B59,' 2-3-6. Travel&Costs of Stay'!B:B,$D$21)\n+SUMIFS('4. Equipment Costs'!H:H,'4. Equipment Costs'!C:C,B59,'4. Equipment Costs'!B:B,$D$21)\n+SUMIFS('5. Subcontracting Costs'!H:H,'5. Subcontracting Costs'!C:C,B59,'5. Subcontracting Costs'!B:B,$D$21)\n+SUMIFS(' 2-3-6. Travel&Costs of Stay'!N:N,' 2-3-6. Travel&Costs of Stay'!C:C,B59,' 2-3-6. Travel&Costs of Stay'!B:B,$D$21)","v":0},{"$f":"SUMIFS('1. Staff costs'!S:S,'1. Staff costs'!C:C,B59,'1. Staff costs'!B:B,$E$21)\n+SUMIFS(' 2-3-6. Travel&Costs of Stay'!O:O,' 2-3-6. Travel&Costs of Stay'!C:C,B59,' 2-3-6. Travel&Costs of Stay'!B:B,$E$21)\n+SUMIFS(' 2-3-6. Travel&Costs of Stay'!P:P,' 2-3-6. Travel&Costs of Stay'!C:C,B59,' 2-3-6. Travel&Costs of Stay'!B:B,$E$21)\n+SUMIFS('4. Equipment Costs'!H:H,'4. Equipment Costs'!C:C,B59,'4. Equipment Costs'!B:B,$E$21)\n+SUMIFS('5. Subcontracting Costs'!H:H,'5. Subcontracting Costs'!C:C,B59,'5. Subcontracting Costs'!B:B,$E$21)\n+SUMIFS(' 2-3-6. Travel&Costs of Stay'!N:N,' 2-3-6. Travel&Costs of Stay'!C:C,B59,' 2-3-6. Travel&Costs of Stay'!B:B,$E$21)","v":0},{"$f":"SUMIFS('1. Staff costs'!S:S,'1. Staff costs'!C:C,B59,'1. Staff costs'!B:B,$F$21)\n+SUMIFS(' 2-3-6. Travel&Costs of Stay'!O:O,' 2-3-6. Travel&Costs of Stay'!C:C,B59,' 2-3-6. Travel&Costs of Stay'!B:B,$F$21)\n+SUMIFS(' 2-3-6. Travel&Costs of Stay'!P:P,' 2-3-6. Travel&Costs of Stay'!C:C,B59,' 2-3-6. Travel&Costs of Stay'!B:B,$F$21)\n+SUMIFS('4. Equipment Costs'!H:H,'4. Equipment Costs'!C:C,B59,'4. Equipment Costs'!B:B,$F$21)\n+SUMIFS('5. Subcontracting Costs'!H:H,'5. Subcontracting Costs'!C:C,B59,'5. Subcontracting Costs'!B:B,$F$21)\n+SUMIFS(' 2-3-6. Travel&Costs of Stay'!N:N,' 2-3-6. Travel&Costs of Stay'!C:C,B59,' 2-3-6. Travel&Costs of Stay'!B:B,$F$21)","v":0},{"$f":"SUMIFS('1. Staff costs'!S:S,'1. Staff costs'!C:C,B59,'1. Staff costs'!B:B,$G$21)\n+SUMIFS(' 2-3-6. Travel&Costs of Stay'!O:O,' 2-3-6. Travel&Costs of Stay'!C:C,B59,' 2-3-6. Travel&Costs of Stay'!B:B,$G$21)\n+SUMIFS(' 2-3-6. Travel&Costs of Stay'!P:P,' 2-3-6. Travel&Costs of Stay'!C:C,B59,' 2-3-6. Travel&Costs of Stay'!B:B,$G$21)\n+SUMIFS('4. Equipment Costs'!H:H,'4. Equipment Costs'!C:C,B59,'4. Equipment Costs'!B:B,$G$21)\n+SUMIFS('5. Subcontracting Costs'!H:H,'5. Subcontracting Costs'!C:C,B59,'5. Subcontracting Costs'!B:B,$G$21)\n+SUMIFS(' 2-3-6. Travel&Costs of Stay'!N:N,' 2-3-6. Travel&Costs of Stay'!C:C,B59,' 2-3-6. Travel&Costs of Stay'!B:B,$G$21)","v":0},0]
[null,"P39",{"$f":"SUMIFS('1. Staff costs'!S:S,'1. Staff costs'!C:C,B60,'1. Staff costs'!B:B,$C$21)\n+SUMIFS(' 2-3-6. Travel&Costs of Stay'!O:O,' 2-3-6. Travel&Costs of Stay'!C:C,B60,' 2-3-6. Travel&Costs of Stay'!B:B,$C$21)\n+SUMIFS(' 2-3-6. Travel&Costs of Stay'!P:P,' 2-3-6. Travel&Costs of Stay'!C:C,B60,' 2-3-6. Travel&Costs of Stay'!B:B,$C$21)\n+SUMIFS('4. Equipment Costs'!H:H,'4. Equipment Costs'!C:C,B60,'4. Equipment Costs'!B:B,$C$21)\n+SUMIFS('5. Subcontracting Costs'!H:H,'5. Subcontracting Costs'!C:C,B60,'5. Subcontracting Costs'!B:B,$C$21)\n+SUMIFS(' 2-3-6. Travel&Costs of Stay'!N:N,' 2-3-6. Travel&Costs of Stay'!C:C,B60,' 2-3-6. Travel&Costs of Stay'!B:B,$C$21)","v":0},{"$f":"SUMIFS('1. Staff costs'!S:S,'1. Staff costs'!C:C,B60,'1. Staff costs'!B:B,$D$21)\n+SUMIFS(' 2-3-6. Travel&Costs of Stay'!O:O,' 2-3-6. Travel&Costs of Stay'!C:C,B60,' 2-3-6. Travel&Costs of Stay'!B:B,$D$21)\n+SUMIFS(' 2-3-6. Travel&Costs of Stay'!P:P,' 2-3-6. Travel&Costs of Stay'!C:C,B60,' 2-3-6. Travel&Costs of Stay'!B:B,$D$21)\n+SUMIFS('4. Equipment Costs'!H:H,'4. Equipment Costs'!C:C,B60,'4. Equipment Costs'!B:B,$D$21)\n+SUMIFS('5. Subcontracting Costs'!H:H,'5. Subcontracting Costs'!C:C,B60,'5. Subcontracting Costs'!B:B,$D$21)\n+SUMIFS(' 2-3-6. Travel&Costs of Stay'!N:N,' 2-3-6. Travel&Costs of Stay'!C:C,B60,' 2-3-6. Travel&Costs of Stay'!B:B,$D$21)","v":0},{"$f":"SUMIFS('1. Staff costs'!S:S,'1. Staff costs'!C:C,B60,'1. Staff costs'!B:B,$E$21)\n+SUMIFS(' 2-3-6. Travel&Costs of Stay'!O:O,' 2-3-6. Travel&Costs of Stay'!C:C,B60,' 2-3-6. Travel&Costs of Stay'!B:B,$E$21)\n+SUMIFS(' 2-3-6. Travel&Costs of Stay'!P:P,' 2-3-6. Travel&Costs of Stay'!C:C,B60,' 2-3-6. Travel&Costs of Stay'!B:B,$E$21)\n+SUMIFS('4. Equipment Costs'!H:H,'4. Equipment Costs'!C:C,B60,'4. Equipment Costs'!B:B,$E$21)\n+SUMIFS('5. Subcontracting Costs'!H:H,'5. Subcontracting Costs'!C:C,B60,'5. Subcontracting Costs'!B:B,$E$21)\n+SUMIFS(' 2-3-6. Travel&Costs of Stay'!N:N,' 2-3-6. Travel&Costs of Stay'!C:C,B60,' 2-3-6. Travel&Costs of Stay'!B:B,$E$21)","v":0},{"$f":"SUMIFS('1. Staff costs'!S:S,'1. Staff costs'!C:C,B60,'1. Staff costs'!B:B,$F$21)\n+SUMIFS(' 2-3-6. Travel&Costs of Stay'!O:O,' 2-3-6. Travel&Costs of Stay'!C:C,B60,' 2-3-6. Travel&Costs of Stay'!B:B,$F$21)\n+SUMIFS(' 2-3-6. Travel&Costs of Stay'!P:P,' 2-3-6. Travel&Costs of Stay'!C:C,B60,' 2-3-6. Travel&Costs of Stay'!B:B,$F$21)\n+SUMIFS('4. Equipment Costs'!H:H,'4. Equipment Costs'!C:C,B60,'4. Equipment Costs'!B:B,$F$21)\n+SUMIFS('5. Subcontracting Costs'!H:H,'5. Subcontracting Costs'!C:C,B60,'5. Subcontracting Costs'!B:B,$F$21)\n+SUMIFS(' 2-3-6. Travel&Costs of Stay'!N:N,' 2-3-6. Travel&Costs of Stay'!C:C,B60,' 2-3-6. Travel&Costs of Stay'!B:B,$F$21)","v":0},{"$f":"SUMIFS('1. Staff costs'!S:S,'1. Staff costs'!C:C,B60,'1. Staff costs'!B:B,$G$21)\n+SUMIFS(' 2-3-6. Travel&Costs of Stay'!O:O,' 2-3-6. Travel&Costs of Stay'!C:C,B60,' 2-3-6. Travel&Costs of Stay'!B:B,$G$21)\n+SUMIFS(' 2-3-6. Travel&Costs of Stay'!P:P,' 2-3-6. Travel&Costs of Stay'!C:C,B60,' 2-3-6. Travel&Costs of Stay'!B:B,$G$21)\n+SUMIFS('4. Equipment Costs'!H:H,'4. Equipment Costs'!C:C,B60,'4. Equipment Costs'!B:B,$G$21)\n+SUMIFS('5. Subcontracting Costs'!H:H,'5. Subcontracting Costs'!C:C,B60,'5. Subcontracting Costs'!B:B,$G$21)\n+SUMIFS(' 2-3-6. Travel&Costs of Stay'!N:N,' 2-3-6. Travel&Costs of Stay'!C:C,B60,' 2-3-6. Travel&Costs of Stay'!B:B,$G$21)","v":0},0]
[null,"P40",{"$f":"SUMIFS('1. Staff costs'!S:S,'1. Staff costs'!C:C,B61,'1. Staff costs'!B:B,$C$21)\n+SUMIFS(' 2-3-6. Travel&Costs of Stay'!O:O,' 2-3-6. Travel&Costs of Stay'!C:C,B61,' 2-3-6. Travel&Costs of Stay'!B:B,$C$21)\n+SUMIFS(' 2-3-6. Travel&Costs of Stay'!P:P,' 2-3-6. Travel&Costs of Stay'!C:C,B61,' 2-3-6. Travel&Costs of Stay'!B:B,$C$21)\n+SUMIFS('4. Equipment Costs'!H:H,'4. Equipment Costs'!C:C,B61,'4. Equipment Costs'!B:B,$C$21)\n+SUMIFS('5. Subcontracting Costs'!H:H,'5. Subcontracting Costs'!C:C,B61,'5. Subcontracting Costs'!B:B,$C$21)\n+SUMIFS(' 2-3-6. Travel&Costs of Stay'!N:N,' 2-3-6. Travel&Costs of Stay'!C:C,B61,' 2-3-6. Travel&Costs of Stay'!B:B,$C$21)","v":0},{"$f":"SUMIFS('1. Staff costs'!S:S,'1. Staff costs'!C:C,B61,'1. Staff costs'!B:B,$D$21)\n+SUMIFS(' 2-3-6. Travel&Costs of Stay'!O:O,' 2-3-6. Travel&Costs of Stay'!C:C,B61,' 2-3-6. Travel&Costs of Stay'!B:B,$D$21)\n+SUMIFS(' 2-3-6. Travel&Costs of Stay'!P:P,' 2-3-6. Travel&Costs of Stay'!C:C,B61,' 2-3-6. Travel&Costs of Stay'!B:B,$D$21)\n+SUMIFS('4. Equipment Costs'!H:H,'4. Equipment Costs'!C:C,B61,'4. Equipment Costs'!B:B,$D$21)\n+SUMIFS('5. Subcontracting Costs'!H:H,'5. Subcontracting Costs'!C:C,B61,'5. Subcontracting Costs'!B:B,$D$21)\n+SUMIFS(' 2-3-6. Travel&Costs of Stay'!N:N,' 2-3-6. Travel&Costs of Stay'!C:C,B61,' 2-3-6. Travel&Costs of Stay'!B:B,$D$21)","v":0},{"$f":"SUMIFS('1. Staff costs'!S:S,'1. Staff costs'!C:C,B61,'1. Staff costs'!B:B,$E$21)\n+SUMIFS(' 2-3-6. Travel&Costs of Stay'!O:O,' 2-3-6. Travel&Costs of Stay'!C:C,B61,' 2-3-6. Travel&Costs of Stay'!B:B,$E$21)\n+SUMIFS(' 2-3-6. Travel&Costs of Stay'!P:P,' 2-3-6. Travel&Costs of Stay'!C:C,B61,' 2-3-6. Travel&Costs of Stay'!B:B,$E$21)\n+SUMIFS('4. Equipment Costs'!H:H,'4. Equipment Costs'!C:C,B61,'4. Equipment Costs'!B:B,$E$21)\n+SUMIFS('5. Subcontracting Costs'!H:H,'5. Subcontracting Costs'!C:C,B61,'5. Subcontracting Costs'!B:B,$E$21)\n+SUMIFS(' 2-3-6. Travel&Costs of Stay'!N:N,' 2-3-6. Travel&Costs of Stay'!C:C,B61,' 2-3-6. Travel&Costs of Stay'!B:B,$E$21)","v":0},{"$f":"SUMIFS('1. Staff costs'!S:S,'1. Staff costs'!C:C,B61,'1. Staff costs'!B:B,$F$21)\n+SUMIFS(' 2-3-6. Travel&Costs of Stay'!O:O,' 2-3-6. Travel&Costs of Stay'!C:C,B61,' 2-3-6. Travel&Costs of Stay'!B:B,$F$21)\n+SUMIFS(' 2-3-6. Travel&Costs of Stay'!P:P,' 2-3-6. Travel&Costs of Stay'!C:C,B61,' 2-3-6. Travel&Costs of Stay'!B:B,$F$21)\n+SUMIFS('4. Equipment Costs'!H:H,'4. Equipment Costs'!C:C,B61,'4. Equipment Costs'!B:B,$F$21)\n+SUMIFS('5. Subcontracting Costs'!H:H,'5. Subcontracting Costs'!C:C,B61,'5. Subcontracting Costs'!B:B,$F$21)\n+SUMIFS(' 2-3-6. Travel&Costs of Stay'!N:N,' 2-3-6. Travel&Costs of Stay'!C:C,B61,' 2-3-6. Travel&Costs of Stay'!B:B,$F$21)","v":0},{"$f":"SUMIFS('1. Staff costs'!S:S,'1. Staff costs'!C:C,B61,'1. Staff costs'!B:B,$G$21)\n+SUMIFS(' 2-3-6. Travel&Costs of Stay'!O:O,' 2-3-6. Travel&Costs of Stay'!C:C,B61,' 2-3-6. Travel&Costs of Stay'!B:B,$G$21)\n+SUMIFS(' 2-3-6. Travel&Costs of Stay'!P:P,' 2-3-6. Travel&Costs of Stay'!C:C,B61,' 2-3-6. Travel&Costs of Stay'!B:B,$G$21)\n+SUMIFS('4. Equipment Costs'!H:H,'4. Equipment Costs'!C:C,B61,'4. Equipment Costs'!B:B,$G$21)\n+SUMIFS('5. Subcontracting Costs'!H:H,'5. Subcontracting Costs'!C:C,B61,'5. Subcontracting Costs'!B:B,$G$21)\n+SUMIFS(' 2-3-6. Travel&Costs of Stay'!N:N,' 2-3-6. Travel&Costs of Stay'!C:C,B61,' 2-3-6. Travel&Costs of Stay'!B:B,$G$21)","v":0},0]
[null,"P41",{"$f":"SUMIFS('1. Staff costs'!S:S,'1. Staff costs'!C:C,B62,'1. Staff costs'!B:B,$C$21)\n+SUMIFS(' 2-3-6. Travel&Costs of Stay'!O:O,' 2-3-6. Travel&Costs of Stay'!C:C,B62,' 2-3-6. Travel&Costs of Stay'!B:B,$C$21)\n+SUMIFS(' 2-3-6. Travel&Costs of Stay'!P:P,' 2-3-6. Travel&Costs of Stay'!C:C,B62,' 2-3-6. Travel&Costs of Stay'!B:B,$C$21)\n+SUMIFS('4. Equipment Costs'!H:H,'4. Equipment Costs'!C:C,B62,'4. Equipment Costs'!B:B,$C$21)\n+SUMIFS('5. Subcontracting Costs'!H:H,'5. Subcontracting Costs'!C:C,B62,'5. Subcontracting Costs'!B:B,$C$21)\n+SUMIFS(' 2-3-6. Travel&Costs of Stay'!N:N,' 2-3-6. Travel&Costs of Stay'!C:C,B62,' 2-3-6. Travel&Costs of Stay'!B:B,$C$21)","v":0},{"$f":"SUMIFS('1. Staff costs'!S:S,'1. Staff costs'!C:C,B62,'1. Staff costs'!B:B,$D$21)\n+SUMIFS(' 2-3-6. Travel&Costs of Stay'!O:O,' 2-3-6. Travel&Costs of Stay'!C:C,B62,' 2-3-6. Travel&Costs of Stay'!B:B,$D$21)\n+SUMIFS(' 2-3-6. Travel&Costs of Stay'!P:P,' 2-3-6. Travel&Costs of Stay'!C:C,B62,' 2-3-6. Travel&Costs of Stay'!B:B,$D$21)\n+SUMIFS('4. Equipment Costs'!H:H,'4. Equipment Costs'!C:C,B62,'4. Equipment Costs'!B:B,$D$21)\n+SUMIFS('5. Subcontracting Costs'!H:H,'5. Subcontracting Costs'!C:C,B62,'5. Subcontracting Costs'!B:B,$D$21)\n+SUMIFS(' 2-3-6. Travel&Costs of Stay'!N:N,' 2-3-6. Travel&Costs of Stay'!C:C,B62,' 2-3-6. Travel&Costs of Stay'!B:B,$D$21)","v":0},{"$f":"SUMIFS('1. Staff costs'!S:S,'1. Staff costs'!C:C,B62,'1. Staff costs'!B:B,$E$21)\n+SUMIFS(' 2-3-6. Travel&Costs of Stay'!O:O,' 2-3-6. Travel&Costs of Stay'!C:C,B62,' 2-3-6. Travel&Costs of Stay'!B:B,$E$21)\n+SUMIFS(' 2-3-6. Travel&Costs of Stay'!P:P,' 2-3-6. Travel&Costs of Stay'!C:C,B62,' 2-3-6. Travel&Costs of Stay'!B:B,$E$21)\n+SUMIFS('4. Equipment Costs'!H:H,'4. Equipment Costs'!C:C,B62,'4. Equipment Costs'!B:B,$E$21)\n+SUMIFS('5. Subcontracting Costs'!H:H,'5. Subcontracting Costs'!C:C,B62,'5. Subcontracting Costs'!B:B,$E$21)\n+SUMIFS(' 2-3-6. Travel&Costs of Stay'!N:N,' 2-3-6. Travel&Costs of Stay'!C:C,B62,' 2-3-6. Travel&Costs of Stay'!B:B,$E$21)","v":0},{"$f":"SUMIFS('1. Staff costs'!S:S,'1. Staff costs'!C:C,B62,'1. Staff costs'!B:B,$F$21)\n+SUMIFS(' 2-3-6. Travel&Costs of Stay'!O:O,' 2-3-6. Travel&Costs of Stay'!C:C,B62,' 2-3-6. Travel&Costs of Stay'!B:B,$F$21)\n+SUMIFS(' 2-3-6. Travel&Costs of Stay'!P:P,' 2-3-6. Travel&Costs of Stay'!C:C,B62,' 2-3-6. Travel&Costs of Stay'!B:B,$F$21)\n+SUMIFS('4. Equipment Costs'!H:H,'4. Equipment Costs'!C:C,B62,'4. Equipment Costs'!B:B,$F$21)\n+SUMIFS('5. Subcontracting Costs'!H:H,'5. Subcontracting Costs'!C:C,B62,'5. Subcontracting Costs'!B:B,$F$21)\n+SUMIFS(' 2-3-6. Travel&Costs of Stay'!N:N,' 2-3-6. Travel&Costs of Stay'!C:C,B62,' 2-3-6. Travel&Costs of Stay'!B:B,$F$21)","v":0},{"$f":"SUMIFS('1. Staff costs'!S:S,'1. Staff costs'!C:C,B62,'1. Staff costs'!B:B,$G$21)\n+SUMIFS(' 2-3-6. Travel&Costs of Stay'!O:O,' 2-3-6. Travel&Costs of Stay'!C:C,B62,' 2-3-6. Travel&Costs of Stay'!B:B,$G$21)\n+SUMIFS(' 2-3-6. Travel&Costs of Stay'!P:P,' 2-3-6. Travel&Costs of Stay'!C:C,B62,' 2-3-6. Travel&Costs of Stay'!B:B,$G$21)\n+SUMIFS('4. Equipment Costs'!H:H,'4. Equipment Costs'!C:C,B62,'4. Equipment Costs'!B:B,$G$21)\n+SUMIFS('5. Subcontracting Costs'!H:H,'5. Subcontracting Costs'!C:C,B62,'5. Subcontracting Costs'!B:B,$G$21)\n+SUMIFS(' 2-3-6. Travel&Costs of Stay'!N:N,' 2-3-6. Travel&Costs of Stay'!C:C,B62,' 2-3-6. Travel&Costs of Stay'!B:B,$G$21)","v":0},0]
[null,"P42",{"$f":"SUMIFS('1. Staff costs'!S:S,'1. Staff costs'!C:C,B63,'1. Staff costs'!B:B,$C$21)\n+SUMIFS(' 2-3-6. Travel&Costs of Stay'!O:O,' 2-3-6. Travel&Costs of Stay'!C:C,B63,' 2-3-6. Travel&Costs of Stay'!B:B,$C$21)\n+SUMIFS(' 2-3-6. Travel&Costs of Stay'!P:P,' 2-3-6. Travel&Costs of Stay'!C:C,B63,' 2-3-6. Travel&Costs of Stay'!B:B,$C$21)\n+SUMIFS('4. Equipment Costs'!H:H,'4. Equipment Costs'!C:C,B63,'4. Equipment Costs'!B:B,$C$21)\n+SUMIFS('5. Subcontracting Costs'!H:H,'5. Subcontracting Costs'!C:C,B63,'5. Subcontracting Costs'!B:B,$C$21)\n+SUMIFS(' 2-3-6. Travel&Costs of Stay'!N:N,' 2-3-6. Travel&Costs of Stay'!C:C,B63,' 2-3-6. Travel&Costs of Stay'!B:B,$C$21)","v":0},{"$f":"SUMIFS('1. Staff costs'!S:S,'1. Staff costs'!C:C,B63,'1. Staff costs'!B:B,$D$21)\n+SUMIFS(' 2-3-6. Travel&Costs of Stay'!O:O,' 2-3-6. Travel&Costs of Stay'!C:C,B63,' 2-3-6. Travel&Costs of Stay'!B:B,$D$21)\n+SUMIFS(' 2-3-6. Travel&Costs of Stay'!P:P,' 2-3-6. Travel&Costs of Stay'!C:C,B63,' 2-3-6. Travel&Costs of Stay'!B:B,$D$21)\n+SUMIFS('4. Equipment Costs'!H:H,'4. Equipment Costs'!C:C,B63,'4. Equipment Costs'!B:B,$D$21)\n+SUMIFS('5. Subcontracting Costs'!H:H,'5. Subcontracting Costs'!C:C,B63,'5. Subcontracting Costs'!B:B,$D$21)\n+SUMIFS(' 2-3-6. Travel&Costs of Stay'!N:N,' 2-3-6. Travel&Costs of Stay'!C:C,B63,' 2-3-6. Travel&Costs of Stay'!B:B,$D$21)","v":0},{"$f":"SUMIFS('1. Staff costs'!S:S,'1. Staff costs'!C:C,B63,'1. Staff costs'!B:B,$E$21)\n+SUMIFS(' 2-3-6. Travel&Costs of Stay'!O:O,' 2-3-6. Travel&Costs of Stay'!C:C,B63,' 2-3-6. Travel&Costs of Stay'!B:B,$E$21)\n+SUMIFS(' 2-3-6. Travel&Costs of Stay'!P:P,' 2-3-6. Travel&Costs of Stay'!C:C,B63,' 2-3-6. Travel&Costs of Stay'!B:B,$E$21)\n+SUMIFS('4. Equipment Costs'!H:H,'4. Equipment Costs'!C:C,B63,'4. Equipment Costs'!B:B,$E$21)\n+SUMIFS('5. Subcontracting Costs'!H:H,'5. Subcontracting Costs'!C:C,B63,'5. Subcontracting Costs'!B:B,$E$21)\n+SUMIFS(' 2-3-6. Travel&Costs of Stay'!N:N,' 2-3-6. Travel&Costs of Stay'!C:C,B63,' 2-3-6. Travel&Costs of Stay'!B:B,$E$21)","v":0},{"$f":"SUMIFS('1. Staff costs'!S:S,'1. Staff costs'!C:C,B63,'1. Staff costs'!B:B,$F$21)\n+SUMIFS(' 2-3-6. Travel&Costs of Stay'!O:O,' 2-3-6. Travel&Costs of Stay'!C:C,B63,' 2-3-6. Travel&Costs of Stay'!B:B,$F$21)\n+SUMIFS(' 2-3-6. Travel&Costs of Stay'!P:P,' 2-3-6. Travel&Costs of Stay'!C:C,B63,' 2-3-6. Travel&Costs of Stay'!B:B,$F$21)\n+SUMIFS('4. Equipment Costs'!H:H,'4. Equipment Costs'!C:C,B63,'4. Equipment Costs'!B:B,$F$21)\n+SUMIFS('5. Subcontracting Costs'!H:H,'5. Subcontracting Costs'!C:C,B63,'5. Subcontracting Costs'!B:B,$F$21)\n+SUMIFS(' 2-3-6. Travel&Costs of Stay'!N:N,' 2-3-6. Travel&Costs of Stay'!C:C,B63,' 2-3-6. Travel&Costs of Stay'!B:B,$F$21)","v":0},{"$f":"SUMIFS('1. Staff costs'!S:S,'1. Staff costs'!C:C,B63,'1. Staff costs'!B:B,$G$21)\n+SUMIFS(' 2-3-6. Travel&Costs of Stay'!O:O,' 2-3-6. Travel&Costs of Stay'!C:C,B63,' 2-3-6. Travel&Costs of Stay'!B:B,$G$21)\n+SUMIFS(' 2-3-6. Travel&Costs of Stay'!P:P,' 2-3-6. Travel&Costs of Stay'!C:C,B63,' 2-3-6. Travel&Costs of Stay'!B:B,$G$21)\n+SUMIFS('4. Equipment Costs'!H:H,'4. Equipment Costs'!C:C,B63,'4. Equipment Costs'!B:B,$G$21)\n+SUMIFS('5. Subcontracting Costs'!H:H,'5. Subcontracting Costs'!C:C,B63,'5. Subcontracting Costs'!B:B,$G$21)\n+SUMIFS(' 2-3-6. Travel&Costs of Stay'!N:N,' 2-3-6. Travel&Costs of Stay'!C:C,B63,' 2-3-6. Travel&Costs of Stay'!B:B,$G$21)","v":0},0]
[null,"P43",{"$f":"SUMIFS('1. Staff costs'!S:S,'1. Staff costs'!C:C,B64,'1. Staff costs'!B:B,$C$21)\n+SUMIFS(' 2-3-6. Travel&Costs of Stay'!O:O,' 2-3-6. Travel&Costs of Stay'!C:C,B64,' 2-3-6. Travel&Costs of Stay'!B:B,$C$21)\n+SUMIFS(' 2-3-6. Travel&Costs of Stay'!P:P,' 2-3-6. Travel&Costs of Stay'!C:C,B64,' 2-3-6. Travel&Costs of Stay'!B:B,$C$21)\n+SUMIFS('4. Equipment Costs'!H:H,'4. Equipment Costs'!C:C,B64,'4. Equipment Costs'!B:B,$C$21)\n+SUMIFS('5. Subcontracting Costs'!H:H,'5. Subcontracting Costs'!C:C,B64,'5. Subcontracting Costs'!B:B,$C$21)\n+SUMIFS(' 2-3-6. Travel&Costs of Stay'!N:N,' 2-3-6. Travel&Costs of Stay'!C:C,B64,' 2-3-6. Travel&Costs of Stay'!B:B,$C$21)","v":0},{"$f":"SUMIFS('1. Staff costs'!S:S,'1. Staff costs'!C:C,B64,'1. Staff costs'!B:B,$D$21)\n+SUMIFS(' 2-3-6. Travel&Costs of Stay'!O:O,' 2-3-6. Travel&Costs of Stay'!C:C,B64,' 2-3-6. Travel&Costs of Stay'!B:B,$D$21)\n+SUMIFS(' 2-3-6. Travel&Costs of Stay'!P:P,' 2-3-6. Travel&Costs of Stay'!C:C,B64,' 2-3-6. Travel&Costs of Stay'!B:B,$D$21)\n+SUMIFS('4. Equipment Costs'!H:H,'4. Equipment Costs'!C:C,B64,'4. Equipment Costs'!B:B,$D$21)\n+SUMIFS('5. Subcontracting Costs'!H:H,'5. Subcontracting Costs'!C:C,B64,'5. Subcontracting Costs'!B:B,$D$21)\n+SUMIFS(' 2-3-6. Travel&Costs of Stay'!N:N,' 2-3-6. Travel&Costs of Stay'!C:C,B64,' 2-3-6. Travel&Costs of Stay'!B:B,$D$21)","v":0},{"$f":"SUMIFS('1. Staff costs'!S:S,'1. Staff costs'!C:C,B64,'1. Staff costs'!B:B,$E$21)\n+SUMIFS(' 2-3-6. Travel&Costs of Stay'!O:O,' 2-3-6. Travel&Costs of Stay'!C:C,B64,' 2-3-6. Travel&Costs of Stay'!B:B,$E$21)\n+SUMIFS(' 2-3-6. Travel&Costs of Stay'!P:P,' 2-3-6. Travel&Costs of Stay'!C:C,B64,' 2-3-6. Travel&Costs of Stay'!B:B,$E$21)\n+SUMIFS('4. Equipment Costs'!H:H,'4. Equipment Costs'!C:C,B64,'4. Equipment Costs'!B:B,$E$21)\n+SUMIFS('5. Subcontracting Costs'!H:H,'5. Subcontracting Costs'!C:C,B64,'5. Subcontracting Costs'!B:B,$E$21)\n+SUMIFS(' 2-3-6. Travel&Costs of Stay'!N:N,' 2-3-6. Travel&Costs of Stay'!C:C,B64,' 2-3-6. Travel&Costs of Stay'!B:B,$E$21)","v":0},{"$f":"SUMIFS('1. Staff costs'!S:S,'1. Staff costs'!C:C,B64,'1. Staff costs'!B:B,$F$21)\n+SUMIFS(' 2-3-6. Travel&Costs of Stay'!O:O,' 2-3-6. Travel&Costs of Stay'!C:C,B64,' 2-3-6. Travel&Costs of Stay'!B:B,$F$21)\n+SUMIFS(' 2-3-6. Travel&Costs of Stay'!P:P,' 2-3-6. Travel&Costs of Stay'!C:C,B64,' 2-3-6. Travel&Costs of Stay'!B:B,$F$21)\n+SUMIFS('4. Equipment Costs'!H:H,'4. Equipment Costs'!C:C,B64,'4. Equipment Costs'!B:B,$F$21)\n+SUMIFS('5. Subcontracting Costs'!H:H,'5. Subcontracting Costs'!C:C,B64,'5. Subcontracting Costs'!B:B,$F$21)\n+SUMIFS(' 2-3-6. Travel&Costs of Stay'!N:N,' 2-3-6. Travel&Costs of Stay'!C:C,B64,' 2-3-6. Travel&Costs of Stay'!B:B,$F$21)","v":0},{"$f":"SUMIFS('1. Staff costs'!S:S,'1. Staff costs'!C:C,B64,'1. Staff costs'!B:B,$G$21)\n+SUMIFS(' 2-3-6. Travel&Costs of Stay'!O:O,' 2-3-6. Travel&Costs of Stay'!C:C,B64,' 2-3-6. Travel&Costs of Stay'!B:B,$G$21)\n+SUMIFS(' 2-3-6. Travel&Costs of Stay'!P:P,' 2-3-6. Travel&Costs of Stay'!C:C,B64,' 2-3-6. Travel&Costs of Stay'!B:B,$G$21)\n+SUMIFS('4. Equipment Costs'!H:H,'4. Equipment Costs'!C:C,B64,'4. Equipment Costs'!B:B,$G$21)\n+SUMIFS('5. Subcontracting Costs'!H:H,'5. Subcontracting Costs'!C:C,B64,'5. Subcontracting Costs'!B:B,$G$21)\n+SUMIFS(' 2-3-6. Travel&Costs of Stay'!N:N,' 2-3-6. Travel&Costs of Stay'!C:C,B64,' 2-3-6. Travel&Costs of Stay'!B:B,$G$21)","v":0},0]
[null,"P44",{"$f":"SUMIFS('1. Staff costs'!S:S,'1. Staff costs'!C:C,B65,'1. Staff costs'!B:B,$C$21)\n+SUMIFS(' 2-3-6. Travel&Costs of Stay'!O:O,' 2-3-6. Travel&Costs of Stay'!C:C,B65,' 2-3-6. Travel&Costs of Stay'!B:B,$C$21)\n+SUMIFS(' 2-3-6. Travel&Costs of Stay'!P:P,' 2-3-6. Travel&Costs of Stay'!C:C,B65,' 2-3-6. Travel&Costs of Stay'!B:B,$C$21)\n+SUMIFS('4. Equipment Costs'!H:H,'4. Equipment Costs'!C:C,B65,'4. Equipment Costs'!B:B,$C$21)\n+SUMIFS('5. Subcontracting Costs'!H:H,'5. Subcontracting Costs'!C:C,B65,'5. Subcontracting Costs'!B:B,$C$21)\n+SUMIFS(' 2-3-6. Travel&Costs of Stay'!N:N,' 2-3-6. Travel&Costs of Stay'!C:C,B65,' 2-3-6. Travel&Costs of Stay'!B:B,$C$21)","v":0},{"$f":"SUMIFS('1. Staff costs'!S:S,'1. Staff costs'!C:C,B65,'1. Staff costs'!B:B,$D$21)\n+SUMIFS(' 2-3-6. Travel&Costs of Stay'!O:O,' 2-3-6. Travel&Costs of Stay'!C:C,B65,' 2-3-6. Travel&Costs of Stay'!B:B,$D$21)\n+SUMIFS(' 2-3-6. Travel&Costs of Stay'!P:P,' 2-3-6. Travel&Costs of Stay'!C:C,B65,' 2-3-6. Travel&Costs of Stay'!B:B,$D$21)\n+SUMIFS('4. Equipment Costs'!H:H,'4. Equipment Costs'!C:C,B65,'4. Equipment Costs'!B:B,$D$21)\n+SUMIFS('5. Subcontracting Costs'!H:H,'5. Subcontracting Costs'!C:C,B65,'5. Subcontracting Costs'!B:B,$D$21)\n+SUMIFS(' 2-3-6. Travel&Costs of Stay'!N:N,' 2-3-6. Travel&Costs of Stay'!C:C,B65,' 2-3-6. Travel&Costs of Stay'!B:B,$D$21)","v":0},{"$f":"SUMIFS('1. Staff costs'!S:S,'1. Staff costs'!C:C,B65,'1. Staff costs'!B:B,$E$21)\n+SUMIFS(' 2-3-6. Travel&Costs of Stay'!O:O,' 2-3-6. Travel&Costs of Stay'!C:C,B65,' 2-3-6. Travel&Costs of Stay'!B:B,$E$21)\n+SUMIFS(' 2-3-6. Travel&Costs of Stay'!P:P,' 2-3-6. Travel&Costs of Stay'!C:C,B65,' 2-3-6. Travel&Costs of Stay'!B:B,$E$21)\n+SUMIFS('4. Equipment Costs'!H:H,'4. Equipment Costs'!C:C,B65,'4. Equipment Costs'!B:B,$E$21)\n+SUMIFS('5. Subcontracting Costs'!H:H,'5. Subcontracting Costs'!C:C,B65,'5. Subcontracting Costs'!B:B,$E$21)\n+SUMIFS(' 2-3-6. Travel&Costs of Stay'!N:N,' 2-3-6. Travel&Costs of Stay'!C:C,B65,' 2-3-6. Travel&Costs of Stay'!B:B,$E$21)","v":0},{"$f":"SUMIFS('1. Staff costs'!S:S,'1. Staff costs'!C:C,B65,'1. Staff costs'!B:B,$F$21)\n+SUMIFS(' 2-3-6. Travel&Costs of Stay'!O:O,' 2-3-6. Travel&Costs of Stay'!C:C,B65,' 2-3-6. Travel&Costs of Stay'!B:B,$F$21)\n+SUMIFS(' 2-3-6. Travel&Costs of Stay'!P:P,' 2-3-6. Travel&Costs of Stay'!C:C,B65,' 2-3-6. Travel&Costs of Stay'!B:B,$F$21)\n+SUMIFS('4. Equipment Costs'!H:H,'4. Equipment Costs'!C:C,B65,'4. Equipment Costs'!B:B,$F$21)\n+SUMIFS('5. Subcontracting Costs'!H:H,'5. Subcontracting Costs'!C:C,B65,'5. Subcontracting Costs'!B:B,$F$21)\n+SUMIFS(' 2-3-6. Travel&Costs of Stay'!N:N,' 2-3-6. Travel&Costs of Stay'!C:C,B65,' 2-3-6. Travel&Costs of Stay'!B:B,$F$21)","v":0},{"$f":"SUMIFS('1. Staff costs'!S:S,'1. Staff costs'!C:C,B65,'1. Staff costs'!B:B,$G$21)\n+SUMIFS(' 2-3-6. Travel&Costs of Stay'!O:O,' 2-3-6. Travel&Costs of Stay'!C:C,B65,' 2-3-6. Travel&Costs of Stay'!B:B,$G$21)\n+SUMIFS(' 2-3-6. Travel&Costs of Stay'!P:P,' 2-3-6. Travel&Costs of Stay'!C:C,B65,' 2-3-6. Travel&Costs of Stay'!B:B,$G$21)\n+SUMIFS('4. Equipment Costs'!H:H,'4. Equipment Costs'!C:C,B65,'4. Equipment Costs'!B:B,$G$21)\n+SUMIFS('5. Subcontracting Costs'!H:H,'5. Subcontracting Costs'!C:C,B65,'5. Subcontracting Costs'!B:B,$G$21)\n+SUMIFS(' 2-3-6. Travel&Costs of Stay'!N:N,' 2-3-6. Travel&Costs of Stay'!C:C,B65,' 2-3-6. Travel&Costs of Stay'!B:B,$G$21)","v":0},0]
[null,"P45",{"$f":"SUMIFS('1. Staff costs'!S:S,'1. Staff costs'!C:C,B66,'1. Staff costs'!B:B,$C$21)\n+SUMIFS(' 2-3-6. Travel&Costs of Stay'!O:O,' 2-3-6. Travel&Costs of Stay'!C:C,B66,' 2-3-6. Travel&Costs of Stay'!B:B,$C$21)\n+SUMIFS(' 2-3-6. Travel&Costs of Stay'!P:P,' 2-3-6. Travel&Costs of Stay'!C:C,B66,' 2-3-6. Travel&Costs of Stay'!B:B,$C$21)\n+SUMIFS('4. Equipment Costs'!H:H,'4. Equipment Costs'!C:C,B66,'4. Equipment Costs'!B:B,$C$21)\n+SUMIFS('5. Subcontracting Costs'!H:H,'5. Subcontracting Costs'!C:C,B66,'5. Subcontracting Costs'!B:B,$C$21)\n+SUMIFS(' 2-3-6. Travel&Costs of Stay'!N:N,' 2-3-6. Travel&Costs of Stay'!C:C,B66,' 2-3-6. Travel&Costs of Stay'!B:B,$C$21)","v":0},{"$f":"SUMIFS('1. Staff costs'!S:S,'1. Staff costs'!C:C,B66,'1. Staff costs'!B:B,$D$21)\n+SUMIFS(' 2-3-6. Travel&Costs of Stay'!O:O,' 2-3-6. Travel&Costs of Stay'!C:C,B66,' 2-3-6. Travel&Costs of Stay'!B:B,$D$21)\n+SUMIFS(' 2-3-6. Travel&Costs of Stay'!P:P,' 2-3-6. Travel&Costs of Stay'!C:C,B66,' 2-3-6. Travel&Costs of Stay'!B:B,$D$21)\n+SUMIFS('4. Equipment Costs'!H:H,'4. Equipment Costs'!C:C,B66,'4. Equipment Costs'!B:B,$D$21)\n+SUMIFS('5. Subcontracting Costs'!H:H,'5. Subcontracting Costs'!C:C,B66,'5. Subcontracting Costs'!B:B,$D$21)\n+SUMIFS(' 2-3-6. Travel&Costs of Stay'!N:N,' 2-3-6. Travel&Costs of Stay'!C:C,B66,' 2-3-6. Travel&Costs of Stay'!B:B,$D$21)","v":0},{"$f":"SUMIFS('1. Staff costs'!S:S,'1. Staff costs'!C:C,B66,'1. Staff costs'!B:B,$E$21)\n+SUMIFS(' 2-3-6. Travel&Costs of Stay'!O:O,' 2-3-6. Travel&Costs of Stay'!C:C,B66,' 2-3-6. Travel&Costs of Stay'!B:B,$E$21)\n+SUMIFS(' 2-3-6. Travel&Costs of Stay'!P:P,' 2-3-6. Travel&Costs of Stay'!C:C,B66,' 2-3-6. Travel&Costs of Stay'!B:B,$E$21)\n+SUMIFS('4. Equipment Costs'!H:H,'4. Equipment Costs'!C:C,B66,'4. Equipment Costs'!B:B,$E$21)\n+SUMIFS('5. Subcontracting Costs'!H:H,'5. Subcontracting Costs'!C:C,B66,'5. Subcontracting Costs'!B:B,$E$21)\n+SUMIFS(' 2-3-6. Travel&Costs of Stay'!N:N,' 2-3-6. Travel&Costs of Stay'!C:C,B66,' 2-3-6. Travel&Costs of Stay'!B:B,$E$21)","v":0},{"$f":"SUMIFS('1. Staff costs'!S:S,'1. Staff costs'!C:C,B66,'1. Staff costs'!B:B,$F$21)\n+SUMIFS(' 2-3-6. Travel&Costs of Stay'!O:O,' 2-3-6. Travel&Costs of Stay'!C:C,B66,' 2-3-6. Travel&Costs of Stay'!B:B,$F$21)\n+SUMIFS(' 2-3-6. Travel&Costs of Stay'!P:P,' 2-3-6. Travel&Costs of Stay'!C:C,B66,' 2-3-6. Travel&Costs of Stay'!B:B,$F$21)\n+SUMIFS('4. Equipment Costs'!H:H,'4. Equipment Costs'!C:C,B66,'4. Equipment Costs'!B:B,$F$21)\n+SUMIFS('5. Subcontracting Costs'!H:H,'5. Subcontracting Costs'!C:C,B66,'5. Subcontracting Costs'!B:B,$F$21)\n+SUMIFS(' 2-3-6. Travel&Costs of Stay'!N:N,' 2-3-6. Travel&Costs of Stay'!C:C,B66,' 2-3-6. Travel&Costs of Stay'!B:B,$F$21)","v":0},{"$f":"SUMIFS('1. Staff costs'!S:S,'1. Staff costs'!C:C,B66,'1. Staff costs'!B:B,$G$21)\n+SUMIFS(' 2-3-6. Travel&Costs of Stay'!O:O,' 2-3-6. Travel&Costs of Stay'!C:C,B66,' 2-3-6. Travel&Costs of Stay'!B:B,$G$21)\n+SUMIFS(' 2-3-6. Travel&Costs of Stay'!P:P,' 2-3-6. Travel&Costs of Stay'!C:C,B66,' 2-3-6. Travel&Costs of Stay'!B:B,$G$21)\n+SUMIFS('4. Equipment Costs'!H:H,'4. Equipment Costs'!C:C,B66,'4. Equipment Costs'!B:B,$G$21)\n+SUMIFS('5. Subcontracting Costs'!H:H,'5. Subcontracting Costs'!C:C,B66,'5. Subcontracting Costs'!B:B,$G$21)\n+SUMIFS(' 2-3-6. Travel&Costs of Stay'!N:N,' 2-3-6. Travel&Costs of Stay'!C:C,B66,' 2-3-6. Travel&Costs of Stay'!B:B,$G$21)","v":0},0]
[null,"P46",{"$f":"SUMIFS('1. Staff costs'!S:S,'1. Staff costs'!C:C,B67,'1. Staff costs'!B:B,$C$21)\n+SUMIFS(' 2-3-6. Travel&Costs of Stay'!O:O,' 2-3-6. Travel&Costs of Stay'!C:C,B67,' 2-3-6. Travel&Costs of Stay'!B:B,$C$21)\n+SUMIFS(' 2-3-6. Travel&Costs of Stay'!P:P,' 2-3-6. Travel&Costs of Stay'!C:C,B67,' 2-3-6. Travel&Costs of Stay'!B:B,$C$21)\n+SUMIFS('4. Equipment Costs'!H:H,'4. Equipment Costs'!C:C,B67,'4. Equipment Costs'!B:B,$C$21)\n+SUMIFS('5. Subcontracting Costs'!H:H,'5. Subcontracting Costs'!C:C,B67,'5. Subcontracting Costs'!B:B,$C$21)\n+SUMIFS(' 2-3-6. Travel&Costs of Stay'!N:N,' 2-3-6. Travel&Costs of Stay'!C:C,B67,' 2-3-6. Travel&Costs of Stay'!B:B,$C$21)","v":0},{"$f":"SUMIFS('1. Staff costs'!S:S,'1. Staff costs'!C:C,B67,'1. Staff costs'!B:B,$D$21)\n+SUMIFS(' 2-3-6. Travel&Costs of Stay'!O:O,' 2-3-6. Travel&Costs of Stay'!C:C,B67,' 2-3-6. Travel&Costs of Stay'!B:B,$D$21)\n+SUMIFS(' 2-3-6. Travel&Costs of Stay'!P:P,' 2-3-6. Travel&Costs of Stay'!C:C,B67,' 2-3-6. Travel&Costs of Stay'!B:B,$D$21)\n+SUMIFS('4. Equipment Costs'!H:H,'4. Equipment Costs'!C:C,B67,'4. Equipment Costs'!B:B,$D$21)\n+SUMIFS('5. Subcontracting Costs'!H:H,'5. Subcontracting Costs'!C:C,B67,'5. Subcontracting Costs'!B:B,$D$21)\n+SUMIFS(' 2-3-6. Travel&Costs of Stay'!N:N,' 2-3-6. Travel&Costs of Stay'!C:C,B67,' 2-3-6. Travel&Costs of Stay'!B:B,$D$21)","v":0},{"$f":"SUMIFS('1. Staff costs'!S:S,'1. Staff costs'!C:C,B67,'1. Staff costs'!B:B,$E$21)\n+SUMIFS(' 2-3-6. Travel&Costs of Stay'!O:O,' 2-3-6. Travel&Costs of Stay'!C:C,B67,' 2-3-6. Travel&Costs of Stay'!B:B,$E$21)\n+SUMIFS(' 2-3-6. Travel&Costs of Stay'!P:P,' 2-3-6. Travel&Costs of Stay'!C:C,B67,' 2-3-6. Travel&Costs of Stay'!B:B,$E$21)\n+SUMIFS('4. Equipment Costs'!H:H,'4. Equipment Costs'!C:C,B67,'4. Equipment Costs'!B:B,$E$21)\n+SUMIFS('5. Subcontracting Costs'!H:H,'5. Subcontracting Costs'!C:C,B67,'5. Subcontracting Costs'!B:B,$E$21)\n+SUMIFS(' 2-3-6. Travel&Costs of Stay'!N:N,' 2-3-6. Travel&Costs of Stay'!C:C,B67,' 2-3-6. Travel&Costs of Stay'!B:B,$E$21)","v":0},{"$f":"SUMIFS('1. Staff costs'!S:S,'1. Staff costs'!C:C,B67,'1. Staff costs'!B:B,$F$21)\n+SUMIFS(' 2-3-6. Travel&Costs of Stay'!O:O,' 2-3-6. Travel&Costs of Stay'!C:C,B67,' 2-3-6. Travel&Costs of Stay'!B:B,$F$21)\n+SUMIFS(' 2-3-6. Travel&Costs of Stay'!P:P,' 2-3-6. Travel&Costs of Stay'!C:C,B67,' 2-3-6. Travel&Costs of Stay'!B:B,$F$21)\n+SUMIFS('4. Equipment Costs'!H:H,'4. Equipment Costs'!C:C,B67,'4. Equipment Costs'!B:B,$F$21)\n+SUMIFS('5. Subcontracting Costs'!H:H,'5. Subcontracting Costs'!C:C,B67,'5. Subcontracting Costs'!B:B,$F$21)\n+SUMIFS(' 2-3-6. Travel&Costs of Stay'!N:N,' 2-3-6. Travel&Costs of Stay'!C:C,B67,' 2-3-6. Travel&Costs of Stay'!B:B,$F$21)","v":0},{"$f":"SUMIFS('1. Staff costs'!S:S,'1. Staff costs'!C:C,B67,'1. Staff costs'!B:B,$G$21)\n+SUMIFS(' 2-3-6. Travel&Costs of Stay'!O:O,' 2-3-6. Travel&Costs of Stay'!C:C,B67,' 2-3-6. Travel&Costs of Stay'!B:B,$G$21)\n+SUMIFS(' 2-3-6. Travel&Costs of Stay'!P:P,' 2-3-6. Travel&Costs of Stay'!C:C,B67,' 2-3-6. Travel&Costs of Stay'!B:B,$G$21)\n+SUMIFS('4. Equipment Costs'!H:H,'4. Equipment Costs'!C:C,B67,'4. Equipment Costs'!B:B,$G$21)\n+SUMIFS('5. Subcontracting Costs'!H:H,'5. Subcontracting Costs'!C:C,B67,'5. Subcontracting Costs'!B:B,$G$21)\n+SUMIFS(' 2-3-6. Travel&Costs of Stay'!N:N,' 2-3-6. Travel&Costs of Stay'!C:C,B67,' 2-3-6. Travel&Costs of Stay'!B:B,$G$21)","v":0},0]
[null,"P47",{"$f":"SUMIFS('1. Staff costs'!S:S,'1. Staff costs'!C:C,B68,'1. Staff costs'!B:B,$C$21)\n+SUMIFS(' 2-3-6. Travel&Costs of Stay'!O:O,' 2-3-6. Travel&Costs of Stay'!C:C,B68,' 2-3-6. Travel&Costs of Stay'!B:B,$C$21)\n+SUMIFS(' 2-3-6. Travel&Costs of Stay'!P:P,' 2-3-6. Travel&Costs of Stay'!C:C,B68,' 2-3-6. Travel&Costs of Stay'!B:B,$C$21)\n+SUMIFS('4. Equipment Costs'!H:H,'4. Equipment Costs'!C:C,B68,'4. Equipment Costs'!B:B,$C$21)\n+SUMIFS('5. Subcontracting Costs'!H:H,'5. Subcontracting Costs'!C:C,B68,'5. Subcontracting Costs'!B:B,$C$21)\n+SUMIFS(' 2-3-6. Travel&Costs of Stay'!N:N,' 2-3-6. Travel&Costs of Stay'!C:C,B68,' 2-3-6. Travel&Costs of Stay'!B:B,$C$21)","v":0},{"$f":"SUMIFS('1. Staff costs'!S:S,'1. Staff costs'!C:C,B68,'1. Staff costs'!B:B,$D$21)\n+SUMIFS(' 2-3-6. Travel&Costs of Stay'!O:O,' 2-3-6. Travel&Costs of Stay'!C:C,B68,' 2-3-6. Travel&Costs of Stay'!B:B,$D$21)\n+SUMIFS(' 2-3-6. Travel&Costs of Stay'!P:P,' 2-3-6. Travel&Costs of Stay'!C:C,B68,' 2-3-6. Travel&Costs of Stay'!B:B,$D$21)\n+SUMIFS('4. Equipment Costs'!H:H,'4. Equipment Costs'!C:C,B68,'4. Equipment Costs'!B:B,$D$21)\n+SUMIFS('5. Subcontracting Costs'!H:H,'5. Subcontracting Costs'!C:C,B68,'5. Subcontracting Costs'!B:B,$D$21)\n+SUMIFS(' 2-3-6. Travel&Costs of Stay'!N:N,' 2-3-6. Travel&Costs of Stay'!C:C,B68,' 2-3-6. Travel&Costs of Stay'!B:B,$D$21)","v":0},{"$f":"SUMIFS('1. Staff costs'!S:S,'1. Staff costs'!C:C,B68,'1. Staff costs'!B:B,$E$21)\n+SUMIFS(' 2-3-6. Travel&Costs of Stay'!O:O,' 2-3-6. Travel&Costs of Stay'!C:C,B68,' 2-3-6. Travel&Costs of Stay'!B:B,$E$21)\n+SUMIFS(' 2-3-6. Travel&Costs of Stay'!P:P,' 2-3-6. Travel&Costs of Stay'!C:C,B68,' 2-3-6. Travel&Costs of Stay'!B:B,$E$21)\n+SUMIFS('4. Equipment Costs'!H:H,'4. Equipment Costs'!C:C,B68,'4. Equipment Costs'!B:B,$E$21)\n+SUMIFS('5. Subcontracting Costs'!H:H,'5. Subcontracting Costs'!C:C,B68,'5. Subcontracting Costs'!B:B,$E$21)\n+SUMIFS(' 2-3-6. Travel&Costs of Stay'!N:N,' 2-3-6. Travel&Costs of Stay'!C:C,B68,' 2-3-6. Travel&Costs of Stay'!B:B,$E$21)","v":0},{"$f":"SUMIFS('1. Staff costs'!S:S,'1. Staff costs'!C:C,B68,'1. Staff costs'!B:B,$F$21)\n+SUMIFS(' 2-3-6. Travel&Costs of Stay'!O:O,' 2-3-6. Travel&Costs of Stay'!C:C,B68,' 2-3-6. Travel&Costs of Stay'!B:B,$F$21)\n+SUMIFS(' 2-3-6. Travel&Costs of Stay'!P:P,' 2-3-6. Travel&Costs of Stay'!C:C,B68,' 2-3-6. Travel&Costs of Stay'!B:B,$F$21)\n+SUMIFS('4. Equipment Costs'!H:H,'4. Equipment Costs'!C:C,B68,'4. Equipment Costs'!B:B,$F$21)\n+SUMIFS('5. Subcontracting Costs'!H:H,'5. Subcontracting Costs'!C:C,B68,'5. Subcontracting Costs'!B:B,$F$21)\n+SUMIFS(' 2-3-6. Travel&Costs of Stay'!N:N,' 2-3-6. Travel&Costs of Stay'!C:C,B68,' 2-3-6. Travel&Costs of Stay'!B:B,$F$21)","v":0},{"$f":"SUMIFS('1. Staff costs'!S:S,'1. Staff costs'!C:C,B68,'1. Staff costs'!B:B,$G$21)\n+SUMIFS(' 2-3-6. Travel&Costs of Stay'!O:O,' 2-3-6. Travel&Costs of Stay'!C:C,B68,' 2-3-6. Travel&Costs of Stay'!B:B,$G$21)\n+SUMIFS(' 2-3-6. Travel&Costs of Stay'!P:P,' 2-3-6. Travel&Costs of Stay'!C:C,B68,' 2-3-6. Travel&Costs of Stay'!B:B,$G$21)\n+SUMIFS('4. Equipment Costs'!H:H,'4. Equipment Costs'!C:C,B68,'4. Equipment Costs'!B:B,$G$21)\n+SUMIFS('5. Subcontracting Costs'!H:H,'5. Subcontracting Costs'!C:C,B68,'5. Subcontracting Costs'!B:B,$G$21)\n+SUMIFS(' 2-3-6. Travel&Costs of Stay'!N:N,' 2-3-6. Travel&Costs of Stay'!C:C,B68,' 2-3-6. Travel&Costs of Stay'!B:B,$G$21)","v":0},0]
[null,"P48",{"$f":"SUMIFS('1. Staff costs'!S:S,'1. Staff costs'!C:C,B69,'1. Staff costs'!B:B,$C$21)\n+SUMIFS(' 2-3-6. Travel&Costs of Stay'!O:O,' 2-3-6. Travel&Costs of Stay'!C:C,B69,' 2-3-6. Travel&Costs of Stay'!B:B,$C$21)\n+SUMIFS(' 2-3-6. Travel&Costs of Stay'!P:P,' 2-3-6. Travel&Costs of Stay'!C:C,B69,' 2-3-6. Travel&Costs of Stay'!B:B,$C$21)\n+SUMIFS('4. Equipment Costs'!H:H,'4. Equipment Costs'!C:C,B69,'4. Equipment Costs'!B:B,$C$21)\n+SUMIFS('5. Subcontracting Costs'!H:H,'5. Subcontracting Costs'!C:C,B69,'5. Subcontracting Costs'!B:B,$C$21)\n+SUMIFS(' 2-3-6. Travel&Costs of Stay'!N:N,' 2-3-6. Travel&Costs of Stay'!C:C,B69,' 2-3-6. Travel&Costs of Stay'!B:B,$C$21)","v":0},{"$f":"SUMIFS('1. Staff costs'!S:S,'1. Staff costs'!C:C,B69,'1. Staff costs'!B:B,$D$21)\n+SUMIFS(' 2-3-6. Travel&Costs of Stay'!O:O,' 2-3-6. Travel&Costs of Stay'!C:C,B69,' 2-3-6. Travel&Costs of Stay'!B:B,$D$21)\n+SUMIFS(' 2-3-6. Travel&Costs of Stay'!P:P,' 2-3-6. Travel&Costs of Stay'!C:C,B69,' 2-3-6. Travel&Costs of Stay'!B:B,$D$21)\n+SUMIFS('4. Equipment Costs'!H:H,'4. Equipment Costs'!C:C,B69,'4. Equipment Costs'!B:B,$D$21)\n+SUMIFS('5. Subcontracting Costs'!H:H,'5. Subcontracting Costs'!C:C,B69,'5. Subcontracting Costs'!B:B,$D$21)\n+SUMIFS(' 2-3-6. Travel&Costs of Stay'!N:N,' 2-3-6. Travel&Costs of Stay'!C:C,B69,' 2-3-6. Travel&Costs of Stay'!B:B,$D$21)","v":0},{"$f":"SUMIFS('1. Staff costs'!S:S,'1. Staff costs'!C:C,B69,'1. Staff costs'!B:B,$E$21)\n+SUMIFS(' 2-3-6. Travel&Costs of Stay'!O:O,' 2-3-6. Travel&Costs of Stay'!C:C,B69,' 2-3-6. Travel&Costs of Stay'!B:B,$E$21)\n+SUMIFS(' 2-3-6. Travel&Costs of Stay'!P:P,' 2-3-6. Travel&Costs of Stay'!C:C,B69,' 2-3-6. Travel&Costs of Stay'!B:B,$E$21)\n+SUMIFS('4. Equipment Costs'!H:H,'4. Equipment Costs'!C:C,B69,'4. Equipment Costs'!B:B,$E$21)\n+SUMIFS('5. Subcontracting Costs'!H:H,'5. Subcontracting Costs'!C:C,B69,'5. Subcontracting Costs'!B:B,$E$21)\n+SUMIFS(' 2-3-6. Travel&Costs of Stay'!N:N,' 2-3-6. Travel&Costs of Stay'!C:C,B69,' 2-3-6. Travel&Costs of Stay'!B:B,$E$21)","v":0},{"$f":"SUMIFS('1. Staff costs'!S:S,'1. Staff costs'!C:C,B69,'1. Staff costs'!B:B,$F$21)\n+SUMIFS(' 2-3-6. Travel&Costs of Stay'!O:O,' 2-3-6. Travel&Costs of Stay'!C:C,B69,' 2-3-6. Travel&Costs of Stay'!B:B,$F$21)\n+SUMIFS(' 2-3-6. Travel&Costs of Stay'!P:P,' 2-3-6. Travel&Costs of Stay'!C:C,B69,' 2-3-6. Travel&Costs of Stay'!B:B,$F$21)\n+SUMIFS('4. Equipment Costs'!H:H,'4. Equipment Costs'!C:C,B69,'4. Equipment Costs'!B:B,$F$21)\n+SUMIFS('5. Subcontracting Costs'!H:H,'5. Subcontracting Costs'!C:C,B69,'5. Subcontracting Costs'!B:B,$F$21)\n+SUMIFS(' 2-3-6. Travel&Costs of Stay'!N:N,' 2-3-6. Travel&Costs of Stay'!C:C,B69,' 2-3-6. Travel&Costs of Stay'!B:B,$F$21)","v":0},{"$f":"SUMIFS('1. Staff costs'!S:S,'1. Staff costs'!C:C,B69,'1. Staff costs'!B:B,$G$21)\n+SUMIFS(' 2-3-6. Travel&Costs of Stay'!O:O,' 2-3-6. Travel&Costs of Stay'!C:C,B69,' 2-3-6. Travel&Costs of Stay'!B:B,$G$21)\n+SUMIFS(' 2-3-6. Travel&Costs of Stay'!P:P,' 2-3-6. Travel&Costs of Stay'!C:C,B69,' 2-3-6. Travel&Costs of Stay'!B:B,$G$21)\n+SUMIFS('4. Equipment Costs'!H:H,'4. Equipment Costs'!C:C,B69,'4. Equipment Costs'!B:B,$G$21)\n+SUMIFS('5. Subcontracting Costs'!H:H,'5. Subcontracting Costs'!C:C,B69,'5. Subcontracting Costs'!B:B,$G$21)\n+SUMIFS(' 2-3-6. Travel&Costs of Stay'!N:N,' 2-3-6. Travel&Costs of Stay'!C:C,B69,' 2-3-6. Travel&Costs of Stay'!B:B,$G$21)","v":0},0]
[null,"P49",{"$f":"SUMIFS('1. Staff costs'!S:S,'1. Staff costs'!C:C,B70,'1. Staff costs'!B:B,$C$21)\n+SUMIFS(' 2-3-6. Travel&Costs of Stay'!O:O,' 2-3-6. Travel&Costs of Stay'!C:C,B70,' 2-3-6. Travel&Costs of Stay'!B:B,$C$21)\n+SUMIFS(' 2-3-6. Travel&Costs of Stay'!P:P,' 2-3-6. Travel&Costs of Stay'!C:C,B70,' 2-3-6. Travel&Costs of Stay'!B:B,$C$21)\n+SUMIFS('4. Equipment Costs'!H:H,'4. Equipment Costs'!C:C,B70,'4. Equipment Costs'!B:B,$C$21)\n+SUMIFS('5. Subcontracting Costs'!H:H,'5. Subcontracting Costs'!C:C,B70,'5. Subcontracting Costs'!B:B,$C$21)\n+SUMIFS(' 2-3-6. Travel&Costs of Stay'!N:N,' 2-3-6. Travel&Costs of Stay'!C:C,B70,' 2-3-6. Travel&Costs of Stay'!B:B,$C$21)","v":0},{"$f":"SUMIFS('1. Staff costs'!S:S,'1. Staff costs'!C:C,B70,'1. Staff costs'!B:B,$D$21)\n+SUMIFS(' 2-3-6. Travel&Costs of Stay'!O:O,' 2-3-6. Travel&Costs of Stay'!C:C,B70,' 2-3-6. Travel&Costs of Stay'!B:B,$D$21)\n+SUMIFS(' 2-3-6. Travel&Costs of Stay'!P:P,' 2-3-6. Travel&Costs of Stay'!C:C,B70,' 2-3-6. Travel&Costs of Stay'!B:B,$D$21)\n+SUMIFS('4. Equipment Costs'!H:H,'4. Equipment Costs'!C:C,B70,'4. Equipment Costs'!B:B,$D$21)\n+SUMIFS('5. Subcontracting Costs'!H:H,'5. Subcontracting Costs'!C:C,B70,'5. Subcontracting Costs'!B:B,$D$21)\n+SUMIFS(' 2-3-6. Travel&Costs of Stay'!N:N,' 2-3-6. Travel&Costs of Stay'!C:C,B70,' 2-3-6. Travel&Costs of Stay'!B:B,$D$21)","v":0},{"$f":"SUMIFS('1. Staff costs'!S:S,'1. Staff costs'!C:C,B70,'1. Staff costs'!B:B,$E$21)\n+SUMIFS(' 2-3-6. Travel&Costs of Stay'!O:O,' 2-3-6. Travel&Costs of Stay'!C:C,B70,' 2-3-6. Travel&Costs of Stay'!B:B,$E$21)\n+SUMIFS(' 2-3-6. Travel&Costs of Stay'!P:P,' 2-3-6. Travel&Costs of Stay'!C:C,B70,' 2-3-6. Travel&Costs of Stay'!B:B,$E$21)\n+SUMIFS('4. Equipment Costs'!H:H,'4. Equipment Costs'!C:C,B70,'4. Equipment Costs'!B:B,$E$21)\n+SUMIFS('5. Subcontracting Costs'!H:H,'5. Subcontracting Costs'!C:C,B70,'5. Subcontracting Costs'!B:B,$E$21)\n+SUMIFS(' 2-3-6. Travel&Costs of Stay'!N:N,' 2-3-6. Travel&Costs of Stay'!C:C,B70,' 2-3-6. Travel&Costs of Stay'!B:B,$E$21)","v":0},{"$f":"SUMIFS('1. Staff costs'!S:S,'1. Staff costs'!C:C,B70,'1. Staff costs'!B:B,$F$21)\n+SUMIFS(' 2-3-6. Travel&Costs of Stay'!O:O,' 2-3-6. Travel&Costs of Stay'!C:C,B70,' 2-3-6. Travel&Costs of Stay'!B:B,$F$21)\n+SUMIFS(' 2-3-6. Travel&Costs of Stay'!P:P,' 2-3-6. Travel&Costs of Stay'!C:C,B70,' 2-3-6. Travel&Costs of Stay'!B:B,$F$21)\n+SUMIFS('4. Equipment Costs'!H:H,'4. Equipment Costs'!C:C,B70,'4. Equipment Costs'!B:B,$F$21)\n+SUMIFS('5. Subcontracting Costs'!H:H,'5. Subcontracting Costs'!C:C,B70,'5. Subcontracting Costs'!B:B,$F$21)\n+SUMIFS(' 2-3-6. Travel&Costs of Stay'!N:N,' 2-3-6. Travel&Costs of Stay'!C:C,B70,' 2-3-6. Travel&Costs of Stay'!B:B,$F$21)","v":0},{"$f":"SUMIFS('1. Staff costs'!S:S,'1. Staff costs'!C:C,B70,'1. Staff costs'!B:B,$G$21)\n+SUMIFS(' 2-3-6. Travel&Costs of Stay'!O:O,' 2-3-6. Travel&Costs of Stay'!C:C,B70,' 2-3-6. Travel&Costs of Stay'!B:B,$G$21)\n+SUMIFS(' 2-3-6. Travel&Costs of Stay'!P:P,' 2-3-6. Travel&Costs of Stay'!C:C,B70,' 2-3-6. Travel&Costs of Stay'!B:B,$G$21)\n+SUMIFS('4. Equipment Costs'!H:H,'4. Equipment Costs'!C:C,B70,'4. Equipment Costs'!B:B,$G$21)\n+SUMIFS('5. Subcontracting Costs'!H:H,'5. Subcontracting Costs'!C:C,B70,'5. Subcontracting Costs'!B:B,$G$21)\n+SUMIFS(' 2-3-6. Travel&Costs of Stay'!N:N,' 2-3-6. Travel&Costs of Stay'!C:C,B70,' 2-3-6. Travel&Costs of Stay'!B:B,$G$21)","v":0},0]
[null,"P50",{"$f":"SUMIFS('1. Staff costs'!S:S,'1. Staff costs'!C:C,B71,'1. Staff costs'!B:B,$C$21)\n+SUMIFS(' 2-3-6. Travel&Costs of Stay'!O:O,' 2-3-6. Travel&Costs of Stay'!C:C,B71,' 2-3-6. Travel&Costs of Stay'!B:B,$C$21)\n+SUMIFS(' 2-3-6. Travel&Costs of Stay'!P:P,' 2-3-6. Travel&Costs of Stay'!C:C,B71,' 2-3-6. Travel&Costs of Stay'!B:B,$C$21)\n+SUMIFS('4. Equipment Costs'!H:H,'4. Equipment Costs'!C:C,B71,'4. Equipment Costs'!B:B,$C$21)\n+SUMIFS('5. Subcontracting Costs'!H:H,'5. Subcontracting Costs'!C:C,B71,'5. Subcontracting Costs'!B:B,$C$21)\n+SUMIFS(' 2-3-6. Travel&Costs of Stay'!N:N,' 2-3-6. Travel&Costs of Stay'!C:C,B71,' 2-3-6. Travel&Costs of Stay'!B:B,$C$21)","v":0},{"$f":"SUMIFS('1. Staff costs'!S:S,'1. Staff costs'!C:C,B71,'1. Staff costs'!B:B,$D$21)\n+SUMIFS(' 2-3-6. Travel&Costs of Stay'!O:O,' 2-3-6. Travel&Costs of Stay'!C:C,B71,' 2-3-6. Travel&Costs of Stay'!B:B,$D$21)\n+SUMIFS(' 2-3-6. Travel&Costs of Stay'!P:P,' 2-3-6. Travel&Costs of Stay'!C:C,B71,' 2-3-6. Travel&Costs of Stay'!B:B,$D$21)\n+SUMIFS('4. Equipment Costs'!H:H,'4. Equipment Costs'!C:C,B71,'4. Equipment Costs'!B:B,$D$21)\n+SUMIFS('5. Subcontracting Costs'!H:H,'5. Subcontracting Costs'!C:C,B71,'5. Subcontracting Costs'!B:B,$D$21)\n+SUMIFS(' 2-3-6. Travel&Costs of Stay'!N:N,' 2-3-6. Travel&Costs of Stay'!C:C,B71,' 2-3-6. Travel&Costs of Stay'!B:B,$D$21)","v":0},{"$f":"SUMIFS('1. Staff costs'!S:S,'1. Staff costs'!C:C,B71,'1. Staff costs'!B:B,$E$21)\n+SUMIFS(' 2-3-6. Travel&Costs of Stay'!O:O,' 2-3-6. Travel&Costs of Stay'!C:C,B71,' 2-3-6. Travel&Costs of Stay'!B:B,$E$21)\n+SUMIFS(' 2-3-6. Travel&Costs of Stay'!P:P,' 2-3-6. Travel&Costs of Stay'!C:C,B71,' 2-3-6. Travel&Costs of Stay'!B:B,$E$21)\n+SUMIFS('4. Equipment Costs'!H:H,'4. Equipment Costs'!C:C,B71,'4. Equipment Costs'!B:B,$E$21)\n+SUMIFS('5. Subcontracting Costs'!H:H,'5. Subcontracting Costs'!C:C,B71,'5. Subcontracting Costs'!B:B,$E$21)\n+SUMIFS(' 2-3-6. Travel&Costs of Stay'!N:N,' 2-3-6. Travel&Costs of Stay'!C:C,B71,' 2-3-6. Travel&Costs of Stay'!B:B,$E$21)","v":0},{"$f":"SUMIFS('1. Staff costs'!S:S,'1. Staff costs'!C:C,B71,'1. Staff costs'!B:B,$F$21)\n+SUMIFS(' 2-3-6. Travel&Costs of Stay'!O:O,' 2-3-6. Travel&Costs of Stay'!C:C,B71,' 2-3-6. Travel&Costs of Stay'!B:B,$F$21)\n+SUMIFS(' 2-3-6. Travel&Costs of Stay'!P:P,' 2-3-6. Travel&Costs of Stay'!C:C,B71,' 2-3-6. Travel&Costs of Stay'!B:B,$F$21)\n+SUMIFS('4. Equipment Costs'!H:H,'4. Equipment Costs'!C:C,B71,'4. Equipment Costs'!B:B,$F$21)\n+SUMIFS('5. Subcontracting Costs'!H:H,'5. Subcontracting Costs'!C:C,B71,'5. Subcontracting Costs'!B:B,$F$21)\n+SUMIFS(' 2-3-6. Travel&Costs of Stay'!N:N,' 2-3-6. Travel&Costs of Stay'!C:C,B71,' 2-3-6. Travel&Costs of Stay'!B:B,$F$21)","v":0},{"$f":"SUMIFS('1. Staff costs'!S:S,'1. Staff costs'!C:C,B71,'1. Staff costs'!B:B,$G$21)\n+SUMIFS(' 2-3-6. Travel&Costs of Stay'!O:O,' 2-3-6. Travel&Costs of Stay'!C:C,B71,' 2-3-6. Travel&Costs of Stay'!B:B,$G$21)\n+SUMIFS(' 2-3-6. Travel&Costs of Stay'!P:P,' 2-3-6. Travel&Costs of Stay'!C:C,B71,' 2-3-6. Travel&Costs of Stay'!B:B,$G$21)\n+SUMIFS('4. Equipment Costs'!H:H,'4. Equipment Costs'!C:C,B71,'4. Equipment Costs'!B:B,$G$21)\n+SUMIFS('5. Subcontracting Costs'!H:H,'5. Subcontracting Costs'!C:C,B71,'5. Subcontracting Costs'!B:B,$G$21)\n+SUMIFS(' 2-3-6. Travel&Costs of Stay'!N:N,' 2-3-6. Travel&Costs of Stay'!C:C,B71,' 2-3-6. Travel&Costs of Stay'!B:B,$G$21)","v":0},0]
[null,"P51",{"$f":"SUMIFS('1. Staff costs'!S:S,'1. Staff costs'!C:C,B72,'1. Staff costs'!B:B,$C$21)\n+SUMIFS(' 2-3-6. Travel&Costs of Stay'!O:O,' 2-3-6. Travel&Costs of Stay'!C:C,B72,' 2-3-6. Travel&Costs of Stay'!B:B,$C$21)\n+SUMIFS(' 2-3-6. Travel&Costs of Stay'!P:P,' 2-3-6. Travel&Costs of Stay'!C:C,B72,' 2-3-6. Travel&Costs of Stay'!B:B,$C$21)\n+SUMIFS('4. Equipment Costs'!H:H,'4. Equipment Costs'!C:C,B72,'4. Equipment Costs'!B:B,$C$21)\n+SUMIFS('5. Subcontracting Costs'!H:H,'5. Subcontracting Costs'!C:C,B72,'5. Subcontracting Costs'!B:B,$C$21)\n+SUMIFS(' 2-3-6. Travel&Costs of Stay'!N:N,' 2-3-6. Travel&Costs of Stay'!C:C,B72,' 2-3-6. Travel&Costs of Stay'!B:B,$C$21)","v":0},{"$f":"SUMIFS('1. Staff costs'!S:S,'1. Staff costs'!C:C,B72,'1. Staff costs'!B:B,$D$21)\n+SUMIFS(' 2-3-6. Travel&Costs of Stay'!O:O,' 2-3-6. Travel&Costs of Stay'!C:C,B72,' 2-3-6. Travel&Costs of Stay'!B:B,$D$21)\n+SUMIFS(' 2-3-6. Travel&Costs of Stay'!P:P,' 2-3-6. Travel&Costs of Stay'!C:C,B72,' 2-3-6. Travel&Costs of Stay'!B:B,$D$21)\n+SUMIFS('4. Equipment Costs'!H:H,'4. Equipment Costs'!C:C,B72,'4. Equipment Costs'!B:B,$D$21)\n+SUMIFS('5. Subcontracting Costs'!H:H,'5. Subcontracting Costs'!C:C,B72,'5. Subcontracting Costs'!B:B,$D$21)\n+SUMIFS(' 2-3-6. Travel&Costs of Stay'!N:N,' 2-3-6. Travel&Costs of Stay'!C:C,B72,' 2-3-6. Travel&Costs of Stay'!B:B,$D$21)","v":0},{"$f":"SUMIFS('1. Staff costs'!S:S,'1. Staff costs'!C:C,B72,'1. Staff costs'!B:B,$E$21)\n+SUMIFS(' 2-3-6. Travel&Costs of Stay'!O:O,' 2-3-6. Travel&Costs of Stay'!C:C,B72,' 2-3-6. Travel&Costs of Stay'!B:B,$E$21)\n+SUMIFS(' 2-3-6. Travel&Costs of Stay'!P:P,' 2-3-6. Travel&Costs of Stay'!C:C,B72,' 2-3-6. Travel&Costs of Stay'!B:B,$E$21)\n+SUMIFS('4. Equipment Costs'!H:H,'4. Equipment Costs'!C:C,B72,'4. Equipment Costs'!B:B,$E$21)\n+SUMIFS('5. Subcontracting Costs'!H:H,'5. Subcontracting Costs'!C:C,B72,'5. Subcontracting Costs'!B:B,$E$21)\n+SUMIFS(' 2-3-6. Travel&Costs of Stay'!N:N,' 2-3-6. Travel&Costs of Stay'!C:C,B72,' 2-3-6. Travel&Costs of Stay'!B:B,$E$21)","v":0},{"$f":"SUMIFS('1. Staff costs'!S:S,'1. Staff costs'!C:C,B72,'1. Staff costs'!B:B,$F$21)\n+SUMIFS(' 2-3-6. Travel&Costs of Stay'!O:O,' 2-3-6. Travel&Costs of Stay'!C:C,B72,' 2-3-6. Travel&Costs of Stay'!B:B,$F$21)\n+SUMIFS(' 2-3-6. Travel&Costs of Stay'!P:P,' 2-3-6. Travel&Costs of Stay'!C:C,B72,' 2-3-6. Travel&Costs of Stay'!B:B,$F$21)\n+SUMIFS('4. Equipment Costs'!H:H,'4. Equipment Costs'!C:C,B72,'4. Equipment Costs'!B:B,$F$21)\n+SUMIFS('5. Subcontracting Costs'!H:H,'5. Subcontracting Costs'!C:C,B72,'5. Subcontracting Costs'!B:B,$F$21)\n+SUMIFS(' 2-3-6. Travel&Costs of Stay'!N:N,' 2-3-6. Travel&Costs of Stay'!C:C,B72,' 2-3-6. Travel&Costs of Stay'!B:B,$F$21)","v":0},{"$f":"SUMIFS('1. Staff costs'!S:S,'1. Staff costs'!C:C,B72,'1. Staff costs'!B:B,$G$21)\n+SUMIFS(' 2-3-6. Travel&Costs of Stay'!O:O,' 2-3-6. Travel&Costs of Stay'!C:C,B72,' 2-3-6. Travel&Costs of Stay'!B:B,$G$21)\n+SUMIFS(' 2-3-6. Travel&Costs of Stay'!P:P,' 2-3-6. Travel&Costs of Stay'!C:C,B72,' 2-3-6. Travel&Costs of Stay'!B:B,$G$21)\n+SUMIFS('4. Equipment Costs'!H:H,'4. Equipment Costs'!C:C,B72,'4. Equipment Costs'!B:B,$G$21)\n+SUMIFS('5. Subcontracting Costs'!H:H,'5. Subcontracting Costs'!C:C,B72,'5. Subcontracting Costs'!B:B,$G$21)\n+SUMIFS(' 2-3-6. Travel&Costs of Stay'!N:N,' 2-3-6. Travel&Costs of Stay'!C:C,B72,' 2-3-6. Travel&Costs of Stay'!B:B,$G$21)","v":0},0]
[null,"P52",{"$f":"SUMIFS('1. Staff costs'!S:S,'1. Staff costs'!C:C,B73,'1. Staff costs'!B:B,$C$21)\n+SUMIFS(' 2-3-6. Travel&Costs of Stay'!O:O,' 2-3-6. Travel&Costs of Stay'!C:C,B73,' 2-3-6. Travel&Costs of Stay'!B:B,$C$21)\n+SUMIFS(' 2-3-6. Travel&Costs of Stay'!P:P,' 2-3-6. Travel&Costs of Stay'!C:C,B73,' 2-3-6. Travel&Costs of Stay'!B:B,$C$21)\n+SUMIFS('4. Equipment Costs'!H:H,'4. Equipment Costs'!C:C,B73,'4. Equipment Costs'!B:B,$C$21)\n+SUMIFS('5. Subcontracting Costs'!H:H,'5. Subcontracting Costs'!C:C,B73,'5. Subcontracting Costs'!B:B,$C$21)\n+SUMIFS(' 2-3-6. Travel&Costs of Stay'!N:N,' 2-3-6. Travel&Costs of Stay'!C:C,B73,' 2-3-6. Travel&Costs of Stay'!B:B,$C$21)","v":0},{"$f":"SUMIFS('1. Staff costs'!S:S,'1. Staff costs'!C:C,B73,'1. Staff costs'!B:B,$D$21)\n+SUMIFS(' 2-3-6. Travel&Costs of Stay'!O:O,' 2-3-6. Travel&Costs of Stay'!C:C,B73,' 2-3-6. Travel&Costs of Stay'!B:B,$D$21)\n+SUMIFS(' 2-3-6. Travel&Costs of Stay'!P:P,' 2-3-6. Travel&Costs of Stay'!C:C,B73,' 2-3-6. Travel&Costs of Stay'!B:B,$D$21)\n+SUMIFS('4. Equipment Costs'!H:H,'4. Equipment Costs'!C:C,B73,'4. Equipment Costs'!B:B,$D$21)\n+SUMIFS('5. Subcontracting Costs'!H:H,'5. Subcontracting Costs'!C:C,B73,'5. Subcontracting Costs'!B:B,$D$21)\n+SUMIFS(' 2-3-6. Travel&Costs of Stay'!N:N,' 2-3-6. Travel&Costs of Stay'!C:C,B73,' 2-3-6. Travel&Costs of Stay'!B:B,$D$21)","v":0},{"$f":"SUMIFS('1. Staff costs'!S:S,'1. Staff costs'!C:C,B73,'1. Staff costs'!B:B,$E$21)\n+SUMIFS(' 2-3-6. Travel&Costs of Stay'!O:O,' 2-3-6. Travel&Costs of Stay'!C:C,B73,' 2-3-6. Travel&Costs of Stay'!B:B,$E$21)\n+SUMIFS(' 2-3-6. Travel&Costs of Stay'!P:P,' 2-3-6. Travel&Costs of Stay'!C:C,B73,' 2-3-6. Travel&Costs of Stay'!B:B,$E$21)\n+SUMIFS('4. Equipment Costs'!H:H,'4. Equipment Costs'!C:C,B73,'4. Equipment Costs'!B:B,$E$21)\n+SUMIFS('5. Subcontracting Costs'!H:H,'5. Subcontracting Costs'!C:C,B73,'5. Subcontracting Costs'!B:B,$E$21)\n+SUMIFS(' 2-3-6. Travel&Costs of Stay'!N:N,' 2-3-6. Travel&Costs of Stay'!C:C,B73,' 2-3-6. Travel&Costs of Stay'!B:B,$E$21)","v":0},{"$f":"SUMIFS('1. Staff costs'!S:S,'1. Staff costs'!C:C,B73,'1. Staff costs'!B:B,$F$21)\n+SUMIFS(' 2-3-6. Travel&Costs of Stay'!O:O,' 2-3-6. Travel&Costs of Stay'!C:C,B73,' 2-3-6. Travel&Costs of Stay'!B:B,$F$21)\n+SUMIFS(' 2-3-6. Travel&Costs of Stay'!P:P,' 2-3-6. Travel&Costs of Stay'!C:C,B73,' 2-3-6. Travel&Costs of Stay'!B:B,$F$21)\n+SUMIFS('4. Equipment Costs'!H:H,'4. Equipment Costs'!C:C,B73,'4. Equipment Costs'!B:B,$F$21)\n+SUMIFS('5. Subcontracting Costs'!H:H,'5. Subcontracting Costs'!C:C,B73,'5. Subcontracting Costs'!B:B,$F$21)\n+SUMIFS(' 2-3-6. Travel&Costs of Stay'!N:N,' 2-3-6. Travel&Costs of Stay'!C:C,B73,' 2-3-6. Travel&Costs of Stay'!B:B,$F$21)","v":0},{"$f":"SUMIFS('1. Staff costs'!S:S,'1. Staff costs'!C:C,B73,'1. Staff costs'!B:B,$G$21)\n+SUMIFS(' 2-3-6. Travel&Costs of Stay'!O:O,' 2-3-6. Travel&Costs of Stay'!C:C,B73,' 2-3-6. Travel&Costs of Stay'!B:B,$G$21)\n+SUMIFS(' 2-3-6. Travel&Costs of Stay'!P:P,' 2-3-6. Travel&Costs of Stay'!C:C,B73,' 2-3-6. Travel&Costs of Stay'!B:B,$G$21)\n+SUMIFS('4. Equipment Costs'!H:H,'4. Equipment Costs'!C:C,B73,'4. Equipment Costs'!B:B,$G$21)\n+SUMIFS('5. Subcontracting Costs'!H:H,'5. Subcontracting Costs'!C:C,B73,'5. Subcontracting Costs'!B:B,$G$21)\n+SUMIFS(' 2-3-6. Travel&Costs of Stay'!N:N,' 2-3-6. Travel&Costs of Stay'!C:C,B73,' 2-3-6. Travel&Costs of Stay'!B:B,$G$21)","v":0},0]
[null,"P53",{"$f":"SUMIFS('1. Staff costs'!S:S,'1. Staff costs'!C:C,B74,'1. Staff costs'!B:B,$C$21)\n+SUMIFS(' 2-3-6. Travel&Costs of Stay'!O:O,' 2-3-6. Travel&Costs of Stay'!C:C,B74,' 2-3-6. Travel&Costs of Stay'!B:B,$C$21)\n+SUMIFS(' 2-3-6. Travel&Costs of Stay'!P:P,' 2-3-6. Travel&Costs of Stay'!C:C,B74,' 2-3-6. Travel&Costs of Stay'!B:B,$C$21)\n+SUMIFS('4. Equipment Costs'!H:H,'4. Equipment Costs'!C:C,B74,'4. Equipment Costs'!B:B,$C$21)\n+SUMIFS('5. Subcontracting Costs'!H:H,'5. Subcontracting Costs'!C:C,B74,'5. Subcontracting Costs'!B:B,$C$21)\n+SUMIFS(' 2-3-6. Travel&Costs of Stay'!N:N,' 2-3-6. Travel&Costs of Stay'!C:C,B74,' 2-3-6. Travel&Costs of Stay'!B:B,$C$21)","v":0},{"$f":"SUMIFS('1. Staff costs'!S:S,'1. Staff costs'!C:C,B74,'1. Staff costs'!B:B,$D$21)\n+SUMIFS(' 2-3-6. Travel&Costs of Stay'!O:O,' 2-3-6. Travel&Costs of Stay'!C:C,B74,' 2-3-6. Travel&Costs of Stay'!B:B,$D$21)\n+SUMIFS(' 2-3-6. Travel&Costs of Stay'!P:P,' 2-3-6. Travel&Costs of Stay'!C:C,B74,' 2-3-6. Travel&Costs of Stay'!B:B,$D$21)\n+SUMIFS('4. Equipment Costs'!H:H,'4. Equipment Costs'!C:C,B74,'4. Equipment Costs'!B:B,$D$21)\n+SUMIFS('5. Subcontracting Costs'!H:H,'5. Subcontracting Costs'!C:C,B74,'5. Subcontracting Costs'!B:B,$D$21)\n+SUMIFS(' 2-3-6. Travel&Costs of Stay'!N:N,' 2-3-6. Travel&Costs of Stay'!C:C,B74,' 2-3-6. Travel&Costs of Stay'!B:B,$D$21)","v":0},{"$f":"SUMIFS('1. Staff costs'!S:S,'1. Staff costs'!C:C,B74,'1. Staff costs'!B:B,$E$21)\n+SUMIFS(' 2-3-6. Travel&Costs of Stay'!O:O,' 2-3-6. Travel&Costs of Stay'!C:C,B74,' 2-3-6. Travel&Costs of Stay'!B:B,$E$21)\n+SUMIFS(' 2-3-6. Travel&Costs of Stay'!P:P,' 2-3-6. Travel&Costs of Stay'!C:C,B74,' 2-3-6. Travel&Costs of Stay'!B:B,$E$21)\n+SUMIFS('4. Equipment Costs'!H:H,'4. Equipment Costs'!C:C,B74,'4. Equipment Costs'!B:B,$E$21)\n+SUMIFS('5. Subcontracting Costs'!H:H,'5. Subcontracting Costs'!C:C,B74,'5. Subcontracting Costs'!B:B,$E$21)\n+SUMIFS(' 2-3-6. Travel&Costs of Stay'!N:N,' 2-3-6. Travel&Costs of Stay'!C:C,B74,' 2-3-6. Travel&Costs of Stay'!B:B,$E$21)","v":0},{"$f":"SUMIFS('1. Staff costs'!S:S,'1. Staff costs'!C:C,B74,'1. Staff costs'!B:B,$F$21)\n+SUMIFS(' 2-3-6. Travel&Costs of Stay'!O:O,' 2-3-6. Travel&Costs of Stay'!C:C,B74,' 2-3-6. Travel&Costs of Stay'!B:B,$F$21)\n+SUMIFS(' 2-3-6. Travel&Costs of Stay'!P:P,' 2-3-6. Travel&Costs of Stay'!C:C,B74,' 2-3-6. Travel&Costs of Stay'!B:B,$F$21)\n+SUMIFS('4. Equipment Costs'!H:H,'4. Equipment Costs'!C:C,B74,'4. Equipment Costs'!B:B,$F$21)\n+SUMIFS('5. Subcontracting Costs'!H:H,'5. Subcontracting Costs'!C:C,B74,'5. Subcontracting Costs'!B:B,$F$21)\n+SUMIFS(' 2-3-6. Travel&Costs of Stay'!N:N,' 2-3-6. Travel&Costs of Stay'!C:C,B74,' 2-3-6. Travel&Costs of Stay'!B:B,$F$21)","v":0},{"$f":"SUMIFS('1. Staff costs'!S:S,'1. Staff costs'!C:C,B74,'1. Staff costs'!B:B,$G$21)\n+SUMIFS(' 2-3-6. Travel&Costs of Stay'!O:O,' 2-3-6. Travel&Costs of Stay'!C:C,B74,' 2-3-6. Travel&Costs of Stay'!B:B,$G$21)\n+SUMIFS(' 2-3-6. Travel&Costs of Stay'!P:P,' 2-3-6. Travel&Costs of Stay'!C:C,B74,' 2-3-6. Travel&Costs of Stay'!B:B,$G$21)\n+SUMIFS('4. Equipment Costs'!H:H,'4. Equipment Costs'!C:C,B74,'4. Equipment Costs'!B:B,$G$21)\n+SUMIFS('5. Subcontracting Costs'!H:H,'5. Subcontracting Costs'!C:C,B74,'5. Subcontracting Costs'!B:B,$G$21)\n+SUMIFS(' 2-3-6. Travel&Costs of Stay'!N:N,' 2-3-6. Travel&Costs of Stay'!C:C,B74,' 2-3-6. Travel&Costs of Stay'!B:B,$G$21)","v":0},0]
[null,"P54",{"$f":"SUMIFS('1. Staff costs'!S:S,'1. Staff costs'!C:C,B75,'1. Staff costs'!B:B,$C$21)\n+SUMIFS(' 2-3-6. Travel&Costs of Stay'!O:O,' 2-3-6. Travel&Costs of Stay'!C:C,B75,' 2-3-6. Travel&Costs of Stay'!B:B,$C$21)\n+SUMIFS(' 2-3-6. Travel&Costs of Stay'!P:P,' 2-3-6. Travel&Costs of Stay'!C:C,B75,' 2-3-6. Travel&Costs of Stay'!B:B,$C$21)\n+SUMIFS('4. Equipment Costs'!H:H,'4. Equipment Costs'!C:C,B75,'4. Equipment Costs'!B:B,$C$21)\n+SUMIFS('5. Subcontracting Costs'!H:H,'5. Subcontracting Costs'!C:C,B75,'5. Subcontracting Costs'!B:B,$C$21)\n+SUMIFS(' 2-3-6. Travel&Costs of Stay'!N:N,' 2-3-6. Travel&Costs of Stay'!C:C,B75,' 2-3-6. Travel&Costs of Stay'!B:B,$C$21)","v":0},{"$f":"SUMIFS('1. Staff costs'!S:S,'1. Staff costs'!C:C,B75,'1. Staff costs'!B:B,$D$21)\n+SUMIFS(' 2-3-6. Travel&Costs of Stay'!O:O,' 2-3-6. Travel&Costs of Stay'!C:C,B75,' 2-3-6. Travel&Costs of Stay'!B:B,$D$21)\n+SUMIFS(' 2-3-6. Travel&Costs of Stay'!P:P,' 2-3-6. Travel&Costs of Stay'!C:C,B75,' 2-3-6. Travel&Costs of Stay'!B:B,$D$21)\n+SUMIFS('4. Equipment Costs'!H:H,'4. Equipment Costs'!C:C,B75,'4. Equipment Costs'!B:B,$D$21)\n+SUMIFS('5. Subcontracting Costs'!H:H,'5. Subcontracting Costs'!C:C,B75,'5. Subcontracting Costs'!B:B,$D$21)\n+SUMIFS(' 2-3-6. Travel&Costs of Stay'!N:N,' 2-3-6. Travel&Costs of Stay'!C:C,B75,' 2-3-6. Travel&Costs of Stay'!B:B,$D$21)","v":0},{"$f":"SUMIFS('1. Staff costs'!S:S,'1. Staff costs'!C:C,B75,'1. Staff costs'!B:B,$E$21)\n+SUMIFS(' 2-3-6. Travel&Costs of Stay'!O:O,' 2-3-6. Travel&Costs of Stay'!C:C,B75,' 2-3-6. Travel&Costs of Stay'!B:B,$E$21)\n+SUMIFS(' 2-3-6. Travel&Costs of Stay'!P:P,' 2-3-6. Travel&Costs of Stay'!C:C,B75,' 2-3-6. Travel&Costs of Stay'!B:B,$E$21)\n+SUMIFS('4. Equipment Costs'!H:H,'4. Equipment Costs'!C:C,B75,'4. Equipment Costs'!B:B,$E$21)\n+SUMIFS('5. Subcontracting Costs'!H:H,'5. Subcontracting Costs'!C:C,B75,'5. Subcontracting Costs'!B:B,$E$21)\n+SUMIFS(' 2-3-6. Travel&Costs of Stay'!N:N,' 2-3-6. Travel&Costs of Stay'!C:C,B75,' 2-3-6. Travel&Costs of Stay'!B:B,$E$21)","v":0},{"$f":"SUMIFS('1. Staff costs'!S:S,'1. Staff costs'!C:C,B75,'1. Staff costs'!B:B,$F$21)\n+SUMIFS(' 2-3-6. Travel&Costs of Stay'!O:O,' 2-3-6. Travel&Costs of Stay'!C:C,B75,' 2-3-6. Travel&Costs of Stay'!B:B,$F$21)\n+SUMIFS(' 2-3-6. Travel&Costs of Stay'!P:P,' 2-3-6. Travel&Costs of Stay'!C:C,B75,' 2-3-6. Travel&Costs of Stay'!B:B,$F$21)\n+SUMIFS('4. Equipment Costs'!H:H,'4. Equipment Costs'!C:C,B75,'4. Equipment Costs'!B:B,$F$21)\n+SUMIFS('5. Subcontracting Costs'!H:H,'5. Subcontracting Costs'!C:C,B75,'5. Subcontracting Costs'!B:B,$F$21)\n+SUMIFS(' 2-3-6. Travel&Costs of Stay'!N:N,' 2-3-6. Travel&Costs of Stay'!C:C,B75,' 2-3-6. Travel&Costs of Stay'!B:B,$F$21)","v":0},{"$f":"SUMIFS('1. Staff costs'!S:S,'1. Staff costs'!C:C,B75,'1. Staff costs'!B:B,$G$21)\n+SUMIFS(' 2-3-6. Travel&Costs of Stay'!O:O,' 2-3-6. Travel&Costs of Stay'!C:C,B75,' 2-3-6. Travel&Costs of Stay'!B:B,$G$21)\n+SUMIFS(' 2-3-6. Travel&Costs of Stay'!P:P,' 2-3-6. Travel&Costs of Stay'!C:C,B75,' 2-3-6. Travel&Costs of Stay'!B:B,$G$21)\n+SUMIFS('4. Equipment Costs'!H:H,'4. Equipment Costs'!C:C,B75,'4. Equipment Costs'!B:B,$G$21)\n+SUMIFS('5. Subcontracting Costs'!H:H,'5. Subcontracting Costs'!C:C,B75,'5. Subcontracting Costs'!B:B,$G$21)\n+SUMIFS(' 2-3-6. Travel&Costs of Stay'!N:N,' 2-3-6. Travel&Costs of Stay'!C:C,B75,' 2-3-6. Travel&Costs of Stay'!B:B,$G$21)","v":0},0]
[null,"P55",{"$f":"SUMIFS('1. Staff costs'!S:S,'1. Staff costs'!C:C,B76,'1. Staff costs'!B:B,$C$21)\n+SUMIFS(' 2-3-6. Travel&Costs of Stay'!O:O,' 2-3-6. Travel&Costs of Stay'!C:C,B76,' 2-3-6. Travel&Costs of Stay'!B:B,$C$21)\n+SUMIFS(' 2-3-6. Travel&Costs of Stay'!P:P,' 2-3-6. Travel&Costs of Stay'!C:C,B76,' 2-3-6. Travel&Costs of Stay'!B:B,$C$21)\n+SUMIFS('4. Equipment Costs'!H:H,'4. Equipment Costs'!C:C,B76,'4. Equipment Costs'!B:B,$C$21)\n+SUMIFS('5. Subcontracting Costs'!H:H,'5. Subcontracting Costs'!C:C,B76,'5. Subcontracting Costs'!B:B,$C$21)\n+SUMIFS(' 2-3-6. Travel&Costs of Stay'!N:N,' 2-3-6. Travel&Costs of Stay'!C:C,B76,' 2-3-6. Travel&Costs of Stay'!B:B,$C$21)","v":0},{"$f":"SUMIFS('1. Staff costs'!S:S,'1. Staff costs'!C:C,B76,'1. Staff costs'!B:B,$D$21)\n+SUMIFS(' 2-3-6. Travel&Costs of Stay'!O:O,' 2-3-6. Travel&Costs of Stay'!C:C,B76,' 2-3-6. Travel&Costs of Stay'!B:B,$D$21)\n+SUMIFS(' 2-3-6. Travel&Costs of Stay'!P:P,' 2-3-6. Travel&Costs of Stay'!C:C,B76,' 2-3-6. Travel&Costs of Stay'!B:B,$D$21)\n+SUMIFS('4. Equipment Costs'!H:H,'4. Equipment Costs'!C:C,B76,'4. Equipment Costs'!B:B,$D$21)\n+SUMIFS('5. Subcontracting Costs'!H:H,'5. Subcontracting Costs'!C:C,B76,'5. Subcontracting Costs'!B:B,$D$21)\n+SUMIFS(' 2-3-6. Travel&Costs of Stay'!N:N,' 2-3-6. Travel&Costs of Stay'!C:C,B76,' 2-3-6. Travel&Costs of Stay'!B:B,$D$21)","v":0},{"$f":"SUMIFS('1. Staff costs'!S:S,'1. Staff costs'!C:C,B76,'1. Staff costs'!B:B,$E$21)\n+SUMIFS(' 2-3-6. Travel&Costs of Stay'!O:O,' 2-3-6. Travel&Costs of Stay'!C:C,B76,' 2-3-6. Travel&Costs of Stay'!B:B,$E$21)\n+SUMIFS(' 2-3-6. Travel&Costs of Stay'!P:P,' 2-3-6. Travel&Costs of Stay'!C:C,B76,' 2-3-6. Travel&Costs of Stay'!B:B,$E$21)\n+SUMIFS('4. Equipment Costs'!H:H,'4. Equipment Costs'!C:C,B76,'4. Equipment Costs'!B:B,$E$21)\n+SUMIFS('5. Subcontracting Costs'!H:H,'5. Subcontracting Costs'!C:C,B76,'5. Subcontracting Costs'!B:B,$E$21)\n+SUMIFS(' 2-3-6. Travel&Costs of Stay'!N:N,' 2-3-6. Travel&Costs of Stay'!C:C,B76,' 2-3-6. Travel&Costs of Stay'!B:B,$E$21)","v":0},{"$f":"SUMIFS('1. Staff costs'!S:S,'1. Staff costs'!C:C,B76,'1. Staff costs'!B:B,$F$21)\n+SUMIFS(' 2-3-6. Travel&Costs of Stay'!O:O,' 2-3-6. Travel&Costs of Stay'!C:C,B76,' 2-3-6. Travel&Costs of Stay'!B:B,$F$21)\n+SUMIFS(' 2-3-6. Travel&Costs of Stay'!P:P,' 2-3-6. Travel&Costs of Stay'!C:C,B76,' 2-3-6. Travel&Costs of Stay'!B:B,$F$21)\n+SUMIFS('4. Equipment Costs'!H:H,'4. Equipment Costs'!C:C,B76,'4. Equipment Costs'!B:B,$F$21)\n+SUMIFS('5. Subcontracting Costs'!H:H,'5. Subcontracting Costs'!C:C,B76,'5. Subcontracting Costs'!B:B,$F$21)\n+SUMIFS(' 2-3-6. Travel&Costs of Stay'!N:N,' 2-3-6. Travel&Costs of Stay'!C:C,B76,' 2-3-6. Travel&Costs of Stay'!B:B,$F$21)","v":0},{"$f":"SUMIFS('1. Staff costs'!S:S,'1. Staff costs'!C:C,B76,'1. Staff costs'!B:B,$G$21)\n+SUMIFS(' 2-3-6. Travel&Costs of Stay'!O:O,' 2-3-6. Travel&Costs of Stay'!C:C,B76,' 2-3-6. Travel&Costs of Stay'!B:B,$G$21)\n+SUMIFS(' 2-3-6. Travel&Costs of Stay'!P:P,' 2-3-6. Travel&Costs of Stay'!C:C,B76,' 2-3-6. Travel&Costs of Stay'!B:B,$G$21)\n+SUMIFS('4. Equipment Costs'!H:H,'4. Equipment Costs'!C:C,B76,'4. Equipment Costs'!B:B,$G$21)\n+SUMIFS('5. Subcontracting Costs'!H:H,'5. Subcontracting Costs'!C:C,B76,'5. Subcontracting Costs'!B:B,$G$21)\n+SUMIFS(' 2-3-6. Travel&Costs of Stay'!N:N,' 2-3-6. Travel&Costs of Stay'!C:C,B76,' 2-3-6. Travel&Costs of Stay'!B:B,$G$21)","v":0},0]
[null,"Total",{"$f":"SUM(C22:C76)","v":"#ERROR!"},"#ERROR!","#ERROR!","#ERROR!","#ERROR!","#ERROR!"]

{"sheet":"Unit Costs & Funding Rule","index":8,"n_rows":186,"n_cols":19,"rows_kept":186,"cut":false,"hidden":false,"merged":[[3,11,3,13],[4,11,5,13],[3,18,3,20],[4,18,5,20],[6,15,6,16],[6,18,6,20],[0,1,0,20],[3,1,3,6],[3,8,3,9],[3,15,3,16],[4,1,5,6],[4,8,5,9],[4,15,5,16]]}
[null,"UNIT COSTS AND SUMMARY OF THE FUNDING RULES FOR  JOINT AND STRUCTURAL CAPACITY BUILDING PROJECTS\n\nYou can find below the unit costs values used in this file for the calculation of the grant.\nPlease refer to the Erasmus+ Programme guide 2020* for a complete overview of the funding rules applying to the Joint and Structural Capacity Building Projects (Part B of the guide and Annex 1)."]
[null,"* Link to Erasmus+ Programme guide 2019: ","https://ec.europa.eu/programmes/erasmus-plus/resources/documents/erasmus-programme-guide-2020_en"]
[null,"* Link to CBHE Call for proposal, forms, annexes and guidelines: ","https://eacea.ec.europa.eu/erasmus-plus/funding/capacity-building-in-the-field-of-higher-education-2020_en"]
[null,"A.1 Staff Costs",null,null,null,null,null,null,"A.2 & B Travel Costs",null,null,"A. 3 Costs of Stay",null,null,null,"A.4 Equipment",null,null,"A.5 Subcontracting"]
[null,"Unit costs\n\nContribution to the costs of staff performing tasks which are directly necessary to the achievements of the project's objectives.\n\nConditional: applicants will have to justify the type and volume of resources needed in relation to the implementation of the proposed activities and outputs. The contribution is provided on the  condition that the salary for the same tasks is compensated only once.",null,null,null,null,null,null,"Unit costs based on the travel distance per participant. \n\nTravel distances must be calculated using the distance calculator supported by the European Commission . \nThe applicant must indicate the distance of a one-way travel to calculate the amount of the EU grant that will support the round trip.",null,null,"Costs for subsistence, accommodation, local and public transport such as bus and taxi, personal or optional health insurance.\n\nUnit costs based on the duration of the stay of the participants:\n\nStaff: \n120 EUR/day from day 1 to day 14\n70 EUR/day from day 15 to day 60\n50 EUR/day from day 61 to day 90 (the maximum)\n\nStudent: \n55 EUR/day from day 1 to day 14\n40 EUR/day from day 15 to max day 90 (the maximum)",null,null,null,"Contribution for the purchase of equipment necessary for the implementation of the project. Support is provided only for equipment purchased for the benefit of the HEIs in the Partner Countries. \n\nConditional: the request for financial support to cover these costs must be motivated in the application form",null,null,"Support for sub-contracting costs that are necessary to the implementation of the project, including, in particular, costs for the compulsory financial audits (audit certificate) and for any external quality assurance procedure.\n\nSub-contracting for project-management-related tasks is not eligible.\n\nSub-contracting to external bodies should be very occasional. The specific competences and particular expertise needed to reach the project objectives should be found in the consortium and should determine its composition."]
[]
[null,"Country","PR/PA","Manager","Teacher/Trainer/Researcher","Technical Staff","Administrative Staff",null,"Distance","Travel \nCosts\n(EUR)",null,"Number of \nDays","Student","Staff",null,"100% of eligible costs\nMax. 30% of the total grant",null,null,"100% of eligible costs\nMax. 10% of the total grant"]
[null,"Austria","Programme Countries",294.0,241.0,190.0,157.0,null,"0 KM and 9 KM",0.0,null,1.0,{"$f":"L8*55","v":55},{"$f":"L8*120","v":120}]
[null,"Belgium","Programme Countries",280.0,214.0,162.0,131.0,null,"10 KM and 99 KM",20.0,null,2.0,110,240,null,"WorkPackage"]
[null,"Bulgaria","Programme Countries",88.0,74.0,55.0,39.0,null,"100 KM and 499 KM",180.0,null,3.0,165,360,null,"Preparation"]
[null,"Croatia","Programme Countries",88.0,74.0,55.0,39.0,null,"500 KM and 1999 KM",275.0,null,4.0,220,480,null,"Development"]
[null,"Cyprus","Programme Countries",164.0,137.0,102.0,78.0,null,"2000 KM and 2999 KM",360.0,null,5.0,275,600,null,"Quality Plan"]
[null,"Czech Republic","Programme Countries",164.0,137.0,102.0,78.0,null,"3000 KM and 3999 KM",530.0,null,6.0,330,720,null,"Dissemination & Exploitation"]
[null,"Denmark","Programme Countries",294.0,241.0,190.0,157.0,null,"4000 KM and 7999 KM",820.0,null,7.0,385,840,null,"Management"]
[null,"Estonia","Programme Countries",88.0,74.0,55.0,39.0,null,"8000 KM or more",1500.0,null,8.0,440,960]
[null,"Finland","Programme Countries",280.0,214.0,162.0,131.0,null,null,null,null,9.0,495,1080,null,"Category"]
[null,"Republic of North Macedonia","Programme Countries",88.0,74.0,55.0,39.0,null,null,null,null,10.0,550,1200,null,"Staff"]
[null,"France","Programme Countries",280.0,214.0,162.0,131.0,null,null,null,null,11.0,605,1320,null,"Student"]
[null,"Germany","Programme Countries",280.0,214.0,162.0,131.0,null,null,null,null,12.0,660,1440]
[null,"Greece","Programme Countries",164.0,137.0,102.0,78.0,null,null,null,null,13.0,715,1560,null,"Exceptional Costs"]
[null,"Hungary","Programme Countries",88.0,74.0,55.0,39.0,null,null,null,null,14.0,770,1680,null,"Replace unit costs with exceptional costs"]
[null,"Iceland","Programme Countries",280.0,214.0,162.0,131.0,null,null,null,null,15.0,{"$f":"((L22-$L$21)*40)+770","v":810},{"$f":"((L22-$L$21)*70)+1680","v":1750}]
[null,"Ireland","Programme Countries",294.0,241.0,190.0,157.0,null,null,null,null,16.0,850,1820]
[null,"Italy","Programme Countries",280.0,214.0,162.0,131.0,null,null,null,null,17.0,890,1890]
[null,"Latvia","Programme Countries",88.0,74.0,55.0,39.0,null,null,null,null,18.0,930,1960]
[null,"Liechtenstein","Programme Countries",294.0,241.0,190.0,157.0,null,null,null,null,19.0,970,2030]
[null,"Lithuania","Programme Countries",88.0,74.0,55.0,39.0,null,null,null,null,20.0,1010,2100]
[null,"Luxembourg","Programme Countries",294.0,241.0,190.0,157.0,null,null,null,null,21.0,1050,2170]
[null,"Malta","Programme Countries",164.0,137.0,102.0,78.0,null,null,null,null,22.0,1090,2240]
[null,"Netherlands","Programme Countries",294.0,241.0,190.0,157.0,null,null,null,null,23.0,1130,2310]
[null,"Norway","Programme Countries",294.0,241.0,190.0,157.0,null,null,null,null,24.0,1170,2380]
[null,"Poland","Programme Countries",88.0,74.0,55.0,39.0,null,null,null,null,25.0,1210,2450]
[null,"Portugal","Programme Countries",164.0,137.0,102.0,78.0,null,null,null,null,26.0,1250,2520]
[null,"Romania","Programme Countries",88.0,74.0,55.0,39.0,null,null,null,null,27.0,1290,2590]
[null,"Serbia","Programme Countries",88.0,74.0,55.0,39.0,null,null,null,null,28.0,1330,2660]
[null,"Slovakia","Programme Countries",88.0,74.0,55.0,39.0,null,null,null,null,29.0,1370,2730]
[null,"Slovenia","Programme Countries",164.0,137.0,102.0,78.0,null,null,null,null,30.0,1410,2800]
[null,"Spain","Programme Countries",164.0,137.0,102.0,78.0,null,null,null,null,31.0,1450,2870]
[null,"Sweden","Programme Countries",294.0,241.0,190.0,157.0,null,null,null,null,32.0,1490,2940]
[null,"Turkey","Programme Countries",88.0,74.0,55.0,39.0,null,null,null,null,33.0,1530,3010]
[null,"United Kingdom","Programme Countries",280.0,214.0,162.0,131.0,null,null,null,null,34.0,1570,3080]
[null,"Afghanistan","Partner Countries",77.0,57.0,40.0,32.0,null,null,null,null,35.0,1610,3150]
[null,"Albania","Partner Countries",108.0,80.0,57.0,45.0,null,null,null,null,36.0,1650,3220]
[null,"Algeria","Partner Countries",47.0,33.0,22.0,17.0,null,null,null,null,37.0,1690,3290]
[null,"Angola","Partner Countries",108.0,80.0,57.0,45.0,null,null,null,null,38.0,1730,3360]
[null,"Antigua and Barbuda","Partner Countries",108.0,80.0,57.0,45.0,null,null,null,null,39.0,1770,3430]
[null,"Argentina","Partner Countries",108.0,80.0,57.0,45.0,null,null,null,null,40.0,1810,3500]
[null,"Armenia","Partner Countries",47.0,33.0,22.0,17.0,null,null,null,null,41.0,1850,3570]
[null,"Azerbaijan","Partner Countries",77.0,57.0,40.0,32.0,null,null,null,null,42.0,1890,3640]
[null,"Bahamas","Partner Countries",77.0,57.0,40.0,32.0,null,null,null,null,43.0,1930,3710]
[null,"Bangladesh","Partner Countries",47.0,33.0,22.0,17.0,null,null,null,null,44.0,1970,3780]
[null,"Barbados","Partner Countries",108.0,80.0,57.0,45.0,null,null,null,null,45.0,2010,3850]
[null,"Belarus","Partner Countries",47.0,33.0,22.0,17.0,null,null,null,null,46.0,2050,3920]
[null,"Belize","Partner Countries",47.0,33.0,22.0,17.0,null,null,null,null,47.0,2090,3990]
[null,"Benin","Partner Countries",47.0,33.0,22.0,17.0,null,null,null,null,48.0,2130,4060]
[null,"Bhutan","Partner Countries",47.0,33.0,22.0,17.0,null,null,null,null,49.0,2170,4130]
[null,"Bolivia","Partner Countries",77.0,57.0,40.0,32.0,null,null,null,null,50.0,2210,4200]
[null,"Bosnia and Herzegovina","Partner Countries",108.0,80.0,57.0,45.0,null,null,null,null,51.0,2250,4270]
[null,"Botswana","Partner Countries",47.0,33.0,22.0,17.0,null,null,null,null,52.0,2290,4340]
[null,"Brazil","Partner Countries",108.0,80.0,57.0,45.0,null,null,null,null,53.0,2330,4410]
[null,"Burkina Faso","Partner Countries",77.0,57.0,40.0,32.0,null,null,null,null,54.0,2370,4480]
[null,"Burundi","Partner Countries",47.0,33.0,22.0,17.0,null,null,null,null,55.0,2410,4550]
[null,"Cambodia","Partner Countries",47.0,33.0,22.0,17.0,null,null,null,null,56.0,2450,4620]
[null,"Cameroon","Partner Countries",77.0,57.0,40.0,32.0,null,null,null,null,57.0,2490,4690]
[null,"Cape Verde","Partner Countries",47.0,33.0,22.0,17.0,null,null,null,null,58.0,2530,4760]
[null,"Central African Republic","Partner Countries",47.0,33.0,22.0,17.0,null,null,null,null,59.0,2570,4830]
[null,"Chad","Partner Countries",47.0,33.0,22.0,17.0,null,null,null,null,60.0,2610,4900]
[null,"Chile","Partner Countries",108.0,80.0,57.0,45.0,null,null,null,null,61.0,2650,{"$f":"((L68-$L$67)*50)+4900","v":4950}]
[null,"China","Partner Countries",77.0,57.0,40.0,32.0,null,null,null,null,62.0,2690,5000]
[null,"Colombia","Partner Countries",108.0,80.0,57.0,45.0,null,null,null,null,63.0,2730,5050]
[null,"Comoros","Partner Countries",108.0,80.0,57.0,45.0,null,null,null,null,64.0,2770,5100]
[null,"Congo","Partner Countries",77.0,57.0,40.0,32.0,null,null,null,null,65.0,2810,5150]
[null,"Congo - Republic of the-","Partner Countries",47.0,33.0,22.0,17.0,null,null,null,null,66.0,2850,5200]
[null,"Cook Islands","Partner Countries",108.0,80.0,57.0,45.0,null,null,null,null,67.0,2890,5250]
[null,"Costa Rica","Partner Countries",77.0,57.0,40.0,32.0,null,null,null,null,68.0,2930,5300]
[null,"Cuba","Partner Countries",47.0,33.0,22.0,17.0,null,null,null,null,69.0,2970,5350]
[null,"Djibouti","Partner Countries",77.0,57.0,40.0,32.0,null,null,null,null,70.0,3010,5400]
[null,"Dominica","Partner Countries",108.0,80.0,57.0,45.0,null,null,null,null,71.0,3050,5450]
[null,"Dominican Republic","Partner Countries",77.0,57.0,40.0,32.0,null,null,null,null,72.0,3090,5500]
[null,"DPR Korea","Partner Countries",47.0,33.0,22.0,17.0,null,null,null,null,73.0,3130,5550]
[null,"Ecuador","Partner Countries",77.0,57.0,40.0,32.0,null,null,null,null,74.0,3170,5600]
[null,"Egypt","Partner Countries",47.0,33.0,22.0,17.0,null,null,null,null,75.0,3210,5650]
[null,"El Salvador","Partner Countries",77.0,57.0,40.0,32.0,null,null,null,null,76.0,3250,5700]
[null,"Equatorial Guinea","Partner Countries",47.0,33.0,22.0,17.0,null,null,null,null,77.0,3290,5750]
[null,"Eritrea","Partner Countries",47.0,33.0,22.0,17.0,null,null,null,null,78.0,3330,5800]
[null,"Ethiopia","Partner Countries",47.0,33.0,22.0,17.0,null,null,null,null,79.0,3370,5850]
[null,"Fiji","Partner Countries",47.0,33.0,22.0,17.0,null,null,null,null,80.0,3410,5900]
[null,"Gabon","Partner Countries",108.0,80.0,57.0,45.0,null,null,null,null,81.0,3450,5950]
[null,"Gambia","Partner Countries",47.0,33.0,22.0,17.0,null,null,null,null,82.0,3490,6000]
[null,"Georgia","Partner Countries",77.0,57.0,40.0,32.0,null,null,null,null,83.0,3530,6050]
[null,"Ghana","Partner Countries",47.0,33.0,22.0,17.0,null,null,null,null,84.0,3570,6100]
[null,"Grenada","Partner Countries",108.0,80.0,57.0,45.0,null,null,null,null,85.0,3610,6150]
[null,"Guatemala","Partner Countries",77.0,57.0,40.0,32.0,null,null,null,null,86.0,3650,6200]
[null,"Guinea","Partner Countries",47.0,33.0,22.0,17.0,null,null,null,null,87.0,3690,6250]
[null,"Guinea-Bissau","Partner Countries",77.0,57.0,40.0,32.0,null,null,null,null,88.0,3730,6300]
[null,"Guyana","Partner Countries",47.0,33.0,22.0,17.0,null,null,null,null,89.0,3770,6350]
[null,"Haiti","Partner Countries",77.0,57.0,40.0,32.0,null,null,null,null,90.0,3810,6400]
[null,"Honduras","Partner Countries",47.0,33.0,22.0,17.0]
[null,"India","Partner Countries",47.0,33.0,22.0,17.0]
[null,"Indonesia","Partner Countries",47.0,33.0,22.0,17.0]
[null,"Iran","Partner Countries",77.0,57.0,40.0,32.0]
[null,"Iraq","Partner Countries",77.0,57.0,40.0,32.0]
[null,"Israel","Partner Countries",166.0,132.0,102.0,92.0]
[null,"Ivory Coast","Partner Countries",108.0,80.0,57.0,45.0]
[null,"Jamaica","Partner Countries",77.0,57.0,40.0,32.0]
[null,"Jordan","Partner Countries",77.0,57.0,40.0,32.0]
[null,"Kazakstan","Partner Countries",77.0,57.0,40.0,32.0]
[null,"Kenya","Partner Countries",77.0,57.0,40.0,32.0]
[null,"Kiribati","Partner Countries",47.0,33.0,22.0,17.0]
[null,"Kosovo","Partner Countries",108.0,80.0,57.0,45.0]
[null,"Kyrgyzstan","Partner Countries",47.0,33.0,22.0,17.0]
[null,"Laos","Partner Countries",47.0,33.0,22.0,17.0]
[null,"Lebanon","Partner Countries",108.0,80.0,57.0,45.0]
[null,"Lesotho","Partner Countries",47.0,33.0,22.0,17.0]
[null,"Liberia","Partner Countries",47.0,33.0,22.0,17.0]
[null,"Libya","Partner Countries",108.0,80.0,57.0,45.0]
[null,"Madagascar","Partner Countries",47.0,33.0,22.0,17.0]
[null,"Malawi","Partner Countries",47.0,33.0,22.0,17.0]
[null,"Malaysia","Partner Countries",47.0,33.0,22.0,17.0]
[null,"Maldives","Partner Countries",47.0,33.0,22.0,17.0]
[null,"Mali","Partner Countries",47.0,33.0,22.0,17.0]
[null,"Marshall Islands","Partner Countries",47.0,33.0,22.0,17.0]
[null,"Mauritania","Partner Countries",47.0,33.0,22.0,17.0]
[null,"Mauritius","Partner Countries",47.0,33.0,22.0,17.0]
[null,"Mexico","Partner Countries",108.0,80.0,57.0,45.0]
[null,"Micronesia - Federated States of-","Partner Countries",77.0,57.0,40.0,32.0]
[null,"Moldova","Partner Countries",47.0,33.0,22.0,17.0]
[null,"Mongolia","Partner Countries",47.0,33.0,22.0,17.0]
[null,"Montenegro","Partner Countries",108.0,80.0,57.0,45.0]
[null,"Morocco","Partner Countries",77.0,57.0,40.0,32.0]
[null,"Mozambique","Partner Countries",77.0,57.0,40.0,32.0]
[null,"Myanmar","Partner Countries",47.0,33.0,22.0,17.0]
[null,"Namibia","Partner Countries",77.0,57.0,40.0,32.0]
[null,"Nauru","Partner Countries",47.0,33.0,22.0,17.0]
[null,"Nepal","Partner Countries",47.0,33.0,22.0,17.0]
[null,"Nicaragua","Partner Countries",47.0,33.0,22.0,17.0]
[null,"Niger","Partner Countries",47.0,33.0,22.0,17.0]
[null,"Nigeria","Partner Countries",108.0,80.0,57.0,45.0]
[null,"Niue","Partner Countries",47.0,33.0,22.0,17.0]
[null,"Pakistan","Partner Countries",47.0,33.0,22.0,17.0]
[null,"Palau","Partner Countries",47.0,33.0,22.0,17.0]
[null,"Palestine","Partner Countries",77.0,57.0,40.0,32.0]
[null,"Panama","Partner Countries",77.0,57.0,40.0,32.0]
[null,"Papua New Guinea","Partner Countries",77.0,57.0,40.0,32.0]
[null,"Paraguay","Partner Countries",77.0,57.0,40.0,32.0]
[null,"Peru","Partner Countries",108.0,80.0,57.0,45.0]
[null,"Philippines","Partner Countries",47.0,33.0,22.0,17.0]
[null,"Russia","Partner Countries",77.0,57.0,40.0,32.0]
[null,"Rwanda","Partner Countries",47.0,33.0,22.0,17.0]
[null,"Saint Kitts and Nevis","Partner Countries",108.0,80.0,57.0,45.0]
[null,"Saint Lucia","Partner Countries",108.0,80.0,57.0,45.0]
[null,"Saint Vincent and the Grenadines","Partner Countries",108.0,80.0,57.0,45.0]
[null,"Samoa","Partner Countries",47.0,33.0,22.0,17.0]
[null,"Sao Tome and Principe","Partner Countries",108.0,80.0,57.0,45.0]
[null,"Senegal","Partner Countries",77.0,57.0,40.0,32.0]
[null,"Seychelles","Partner Countries",108.0,80.0,57.0,45.0]
[null,"Sierra Leone","Partner Countries",47.0,33.0,22.0,17.0]
[null,"Solomon Islands","Partner Countries",47.0,33.0,22.0,17.0]
[null,"Somalia","Partner Countries",47.0,33.0,22.0,17.0]
[null,"South Africa","Partner Countries",77.0,57.0,40.0,32.0]
[null,"South Sudan","Partner Countries",47.0,33.0,22.0,17.0]
[null,"Sri Lanka","Partner Countries",47.0,33.0,22.0,17.0]
[null,"Sudan","Partner Countries",47.0,33.0,22.0,17.0]
[null,"Suriname","Partner Countries",77.0,57.0,40.0,32.0]
[null,"Eswatini","Partner Countries",77.0,57.0,40.0,32.0]
[null,"Syria","Partner Countries",47.0,33.0,22.0,17.0]
[null,"Tajikistan","Partner Countries",47.0,33.0,22.0,17.0]
[null,"Tanzania","Partner Countries",47.0,33.0,22.0,17.0]
[null,"Thailand","Partner Countries",108.0,80.0,57.0,45.0]
[null,"Timor Leste - Republic of-","Partner Countries",47.0,33.0,22.0,17.0]
[null,"Togo","Partner Countries",47.0,33.0,22.0,17.0]
[null,"Tonga","Partner Countries",47.0,33.0,22.0,17.0]
[null,"Trinidad and Tobago","Partner Countries",77.0,57.0,40.0,32.0]
[null,"Tunisia","Partner Countries",47.0,33.0,22.0,17.0]
[null,"Turkmenistan","Partner Countries",47.0,33.0,22.0,17.0]
[null,"Tuvalu","Partner Countries",47.0,33.0,22.0,17.0]
[null,"Uganda","Partner Countries",47.0,33.0,22.0,17.0]
[null,"Ukraine","Partner Countries",108.0,80.0,57.0,45.0]
[null,"Uruguay","Partner Countries",108.0,80.0,57.0,45.0]
[null,"Uzbekistan","Partner Countries",47.0,33.0,22.0,17.0]
[null,"Vanuatu","Partner Countries",77.0,57.0,40.0,32.0]
[null,"Venezuela","Partner Countries",108.0,80.0,57.0,45.0]
[null,"Vietnam","Partner Countries",47.0,33.0,22.0,17.0]
[null,"Yemen","Partner Countries",47.0,33.0,22.0,17.0]
[null,"Zambia","Partner Countries",108.0,80.0,57.0,45.0]
[null,"Zimbabwe","Partner Countries",108.0,80.0,57.0,45.0]