{"text_format":"1","workbook":"xlsx","n_sheets":9,"sheets":["Overview","Sheet Validation","1. Staff costs"," 2-3-6. Travel&Costs of Stay","4. Equipment Costs","5. Subcontracting Costs","Co-financing","Breakdown & Project Funding","Unit Costs & Funding Rule"],"not_rendered":{"charts":0,"images":2,"macros":1,"external_links":1,"defined_names":23,"comments":0,"pivot_tables":0},"unopened":[],"bounds":{"document_bytes":16777216,"sheet_cells":100000,"rows_first":2000,"rows_last":500,"rows_between":2000,"halvings":0,"cell_chars":16384,"cell_head_chars":4096},"cells_cut":0,"cells_raw":0,"read":"whole","date_system":"1900"}

{"sheet":"Overview","index":0,"n_rows":81,"n_cols":12,"rows_kept":81,"cut":false,"hidden":false,"merged":[[11,4,11,11],[12,4,12,11],[6,1,6,11],[7,1,7,11],[8,1,8,11],[10,1,10,2],[10,4,10,11],[11,1,11,2],[12,1,12,2],[17,4,17,7],[17,8,17,11],[13,1,13,2],[13,3,13,11],[15,1,15,11],[16,1,16,2],[16,4,16,7],[16,8,16,11],[17,1,17,2],[20,4,20,7],[20,8,20,11],[21,1,21,2],[21,4,21,7],[21,8,21,11],[22,1,22,2],[22,4,22,7],[22,8,22,11],[24,1,24,11],[18,1,18,2],[18,4,18,7],[18,8,18,11],[19,1,19,2],[19,4,19,7],[19,8,19,11],[20,1,20,2]]}
[]
[]
[null,null,null,"Key Action 2: Cooperation for innovation and the exchange of good practices"]
[null,null,null,"Capacity Building in the field of higher education"]
[]
[]
[null,"Before completing this table please read carefully the instructions available on the EACEA website"]
[null,"CALL FOR PROPOSALS 2020 – EAC/A02/2019 - Erasmus+ Programme (2019/C 373/06)"]
[null,"Programme guide and instructions for applicants"]
[]
{"$rows_left_out":72}
{"sheet":"Sheet Validation","index":1,"n_rows":7,"n_cols":2,"rows_kept":7,"cut":false,"hidden":true,"merged":[]}
["Data Sheet Validation"]
["1. Staff Costs",{"$f":"IF(COUNTIF('1. Staff costs'!T:T,\"Error\")<=1,\"OK\",\"Please check data in Tab '\"&A2&\"'\")","v":"OK"}]
["2-3. Travel Costs&Costs of Stay",{"$f":"IF(COUNTIF(' 2-3-6. Travel&Costs of Stay'!R:R,\"Error\")<=1,\"OK\",\"Please check data in Tab '\"&A3&\"'\")","v":"OK"}]
["4. Equipment Costs",{"$f":"IF(COUNTIF('4. Equipment Costs'!I:T,\"Error\")<=1,\"OK\",\"Please check data in Tab '\"&A4&\"'\")","v":"OK"}]
["5. Subcontracting Costs",{"$f":"IF(COUNTIF('5. Subcontracting Costs'!I:I,\"Error\")<=1,\"OK\",\"Please check data in Tab '\"&A5&\"'\")","v":"OK"}]
["Co-financing",{"$f":"IF(COUNTIF('Co-financing'!J:J,\"Error\")<=1,\"OK\",\"Please check data in Tab '\"&A6&\"'\")","v":"OK"}]
["Exceptional Travel Costs (EUR)",{"$f":"IF(' 2-3-6. Travel&Costs of Stay'!K4=\"\",\"OK\",\"Please check Exceptional Travel Costs (EUR) in Tab '\"&A3&\"'\")","v":"OK"}]

{"sheet":"1. Staff costs","index":2,"n_rows":73,"n_cols":20,"rows_kept":73,"cut":false,"hidden":false,"merged":[[1,1,1,19],[2,1,2,19],[3,1,3,2],[3,5,8,19],[4,1,4,2],[5,1,5,2],[6,1,6,2],[9,1,9,19],[10,8,10,10],[10,11,10,13],[10,14,10,16],[10,17,11,17],[10,18,11,18],[10,19,11,19],[7,1,7,2],[8,1,8,2],[10,1,11,1],[10,2,11,2],[10,3,11,3],[10,4,11,4],[10,5,10,7]]}
[]
[null,"1. Staff Costs"]
[]
[null,null,null,"Total (EUR)","Number of Days"]
[null,"Manager",null,{"$f":"SUM(H:H)","v":0},{"$f":"SUMIF(T:T,\"<>Error\",F:F)","v":444}]
[null,"Teacher/Trainer/Researcher",null,{"$f":"SUM(K:K)","v":0},{"$f":"SUMIF(T:T,\"<>Error\",I:I)","v":2798}]
[null,"Technical Staff",null,{"$f":"SUM(N:N)","v":0},{"$f":"SUMIF(T:T,\"<>Error\",L:L)","v":660}]
[null,"Administrative Staff",null,{"$f":"SUM(Q:Q)","v":0},{"$f":"SUMIF(T:T,\"<>Error\",O:O)","v":348}]
[null,null,null,{"$f":"SUM(D5:D8)","v":0},4250]
[]
{"$rows_left_out":64}
{"sheet":" 2-3-6. Travel&Costs of Stay","index":3,"n_rows":118,"n_cols":18,"rows_kept":118,"cut":false,"hidden":false,"merged":[[4,1,4,2],[5,1,5,2],[5,4,6,4],[5,5,6,5],[6,1,6,2],[7,1,7,2],[7,4,8,4],[7,5,8,5],[8,1,8,2],[9,1,9,2],[1,1,1,17],[2,1,2,17],[3,1,3,2],[3,4,4,4],[3,5,4,5],[3,11,3,13],[4,11,10,13]]}
[]
[null,"2-3. Travel Costs & Costs of Stay"]
[]
[null,"Travel Costs Student (EUR)",null,{"$f":"SUMIF(G:G,\"Student\",O:O)","v":0},{"$f":"D4+D5","v":0},{"$f":"SUMIFS(H:H,G:G,\"Student\",R:R,\"<>Error\")","v":0},null,null,null,null,null,"Exceptional Costs for Expensive Travel"]
[null,"Costs of Stay Student (EUR)",null,{"$f":"SUMIF(G:G,\"Student\",P:P)","v":0},null,null,null,null,null,null,null,"Exceptional costs for expensive travel - including the use of cleaner, lower carbon emission means of transport - can be claimed if for a specific travel, the unit cost amount covers less than 65% of the actual (/real) cost. In such a case, you can claim financial support up to a maximum of 80% of the actual (/real) cost for that travel. If exceptional costs are claimed, please indicate the total estimated cost for the travel(s) concerned. An amount corresponding to 80% of the estimated cost will be automatically calculated and will replace the respective unit cost for the travel(s) concerned. Please note that the need for exceptional costs has to be justified under Section E.3 of the \"Detailed Description of the Project\"."]
[null,"Travel Costs Staff (EUR)",null,{"$f":"SUMIF(G:G,\"Staff\",O:O)","v":"#ERROR!"},{"$f":"D6+D7","v":"#ERROR!"},{"$f":"SUMIFS(H:H,G:G,\"Staff\",R:R,\"<>Error\")","v":292}]
[null,"Costs of Stay Staff (EUR)",null,{"$f":"SUMIF(G:G,\"Staff\",P:P)","v":"#ERROR!"}]
[null,"Total Travel Costs (EUR)",null,{"$f":"SUM(O:O)","v":"#ERROR!"},{"$f":"D8+D9","v":"#ERROR!"},{"$f":"F4+F6","v":292}]
[null,"Total Costs of Stay (EUR)",null,{"$f":"SUM(P:P)","v":"#ERROR!"}]
[null,"Exceptional Cost for Expensive Travel (EUR)",null,{"$f":"SUM(N:N)","v":0}]
{"$rows_left_out":109}
{"sheet":"4. Equipment Costs","index":4,"n_rows":90,"n_cols":9,"rows_kept":90,"cut":false,"hidden":false,"merged":[[10,1,11,1],[10,2,11,2],[10,3,11,3],[10,4,11,4],[10,5,11,5],[10,6,11,6],[10,7,11,7],[10,8,11,8],[0,1,0,8],[1,1,1,8],[2,1,2,8],[3,1,8,1],[3,2,8,3],[3,4,8,8],[9,1,9,8]]}
[]
[null,"4. Equipment Costs"]
[]
[null,"Total (EUR)",{"$f":"SUM(H:H)","v":"#ERROR!"}]
[]
[]
[]
[]
[]
[]
{"$rows_left_out":81}
{"sheet":"5. Subcontracting Costs","index":5,"n_rows":40,"n_cols":9,"rows_kept":40,"cut":false,"hidden":false,"merged":[[10,1,11,1],[10,2,11,2],[10,3,11,3],[10,4,11,4],[10,5,11,5],[10,6,11,6],[10,7,11,7],[10,8,11,8],[0,1,0,8],[1,1,1,8],[2,1,2,8],[3,1,8,1],[3,2,8,3],[3,4,8,8],[9,1,9,8]]}
[]
[null,"5. Subcontracting Costs"]
[]
[null,"Total (EUR)",{"$f":"SUM(H:H)","v":"#ERROR!"}]
[]
[]
[]
[]
[]
[]
{"$rows_left_out":31}
{"sheet":"Co-financing","index":6,"n_rows":29,"n_cols":10,"rows_kept":29,"cut":false,"hidden":false,"merged":[[0,1,0,9],[1,1,1,9],[2,1,2,9],[3,1,8,1],[3,2,8,2],[3,3,8,9],[9,1,9,9],[10,8,11,8],[10,9,11,9],[10,1,11,1],[10,2,11,2],[10,3,11,3],[10,4,11,4],[10,5,11,5],[10,6,11,6],[10,7,11,7]]}
[]
[null,"Information for the Co-financing"]
[]
[null,"Total (EUR)",{"$f":"SUM(I:I)","v":"#ERROR!"}]
[]
[]
[]
[]
[]
[]
{"$rows_left_out":20}
{"sheet":"Breakdown & Project Funding","index":7,"n_rows":77,"n_cols":9,"rows_kept":77,"cut":false,"hidden":false,"merged":[[60,7,60,8],[61,7,61,8],[62,7,62,8],[63,7,63,8],[64,7,64,8],[65,7,65,8],[66,7,66,8],[74,7,74,8],[75,7,75,8],[76,7,76,8],[67,7,67,8],[68,7,68,8],[69,7,69,8],[70,7,70,8],[71,7,71,8],[72,7,72,8],[73,7,73,8],[0,1,0,8],[1,1,1,8],[2,1,2,8],[10,1,10,8],[11,1,11,8],[12,1,12,8],[17,1,17,8],[18,1,18,8],[19,1,19,8],[20,7,20,8],[21,7,21,8],[22,7,22,8],[23,7,23,8],[24,7,24,8],[25,7,25,8],[26,7,26,8],[27,7,27,8],[28,7,28,8],[29,7,29,8],[30,7,30,8],[31,7,31,8],[32,7,32,8],[33,7,33,8],[34,7,34,8],[35,7,35,8],[36,7,36,8],[37,7,37,8],[38,7,38,8],[39,7,39,8],[40,7,40,8],[41,7,41,8],[42,7,42,8],[43,7,43,8],[44,7,44,8],[45,7,45,8],[46,7,46,8],[47,7,47,8],[48,7,48,8],[49,7,49,8],[50,7,50,8],[51,7,51,8],[52,7,52,8],[53,7,53,8],[54,7,54,8],[55,7,55,8],[56,7,56,8],[57,7,57,8],[58,7,58,8],[59,7,59,8]]}
[]
[null,"Budget Breakdown by Workpackage / Budget Headings"]
[]
[null,"Work\nPackage","1. Staff \nCosts","2. Travel \nCosts","3. Costs \nof Stay","4. Equipment\nCosts","5. Subcontracting\nCosts","6. Exceptional Costs","Total\n(EUR)"]
[null,{"$f":"'Unit Costs & Funding Rule'!P10","v":"Preparation"},{"$f":"SUMIF('1. Staff costs'!B:B,B5,'1. Staff costs'!S:S)","v":"#ERROR!"},{"$f":"SUMIF(' 2-3-6. Travel&Costs of Stay'!B:B,B5,' 2-3-6. Travel&Costs of Stay'!O:O)","v":"#ERROR!"},{"$f":"SUMIF(' 2-3-6. Travel&Costs of Stay'!B:B,B5,' 2-3-6. Travel&Costs of Stay'!P:P)","v":"#ERROR!"},{"$f":"SUMIF('4. Equipment Costs'!B:B,B5,'4. Equipment Costs'!H:H)","v":0},{"$f":"SUMIF('5. Subcontracting Costs'!B:B,B5,'5. Subcontracting Costs'!H:H)","v":"#ERROR!"},{"$f":"SUMIF(' 2-3-6. Travel&Costs of Stay'!B:B,B5,' 2-3-6. Travel&Costs of Stay'!N:N)","v":0},{"$f":"SUM(C5:H5)","v":"#ERROR!"}]
[null,{"$f":"'Unit Costs & Funding Rule'!P11","v":"Development"},{"$f":"SUMIF('1. Staff costs'!B:B,B6,'1. Staff costs'!S:S)","v":"#ERROR!"},{"$f":"SUMIF(' 2-3-6. Travel&Costs of Stay'!B:B,B6,' 2-3-6. Travel&Costs of Stay'!O:O)","v":"#ERROR!"},{"$f":"SUMIF(' 2-3-6. Travel&Costs of Stay'!B:B,B6,' 2-3-6. Travel&Costs of Stay'!P:P)","v":"#ERROR!"},{"$f":"SUMIF('4. Equipment Costs'!B:B,B6,'4. Equipment Costs'!H:H)","v":"#ERROR!"},{"$f":"SUMIF('5. Subcontracting Costs'!B:B,B6,'5. Subcontracting Costs'!H:H)","v":"#ERROR!"},{"$f":"SUMIF(' 2-3-6. Travel&Costs of Stay'!B:B,B6,' 2-3-6. Travel&Costs of Stay'!N:N)","v":0},"#ERROR!"]
[null,{"$f":"'Unit Costs & Funding Rule'!P12","v":"Quality Plan"},{"$f":"SUMIF('1. Staff costs'!B:B,B7,'1. Staff costs'!S:S)","v":"#ERROR!"},{"$f":"SUMIF(' 2-3-6. Travel&Costs of Stay'!B:B,B7,' 2-3-6. Travel&Costs of Stay'!O:O)","v":0},{"$f":"SUMIF(' 2-3-6. Travel&Costs of Stay'!B:B,B7,' 2-3-6. Travel&Costs of Stay'!P:P)","v":0},{"$f":"SUMIF('4. Equipment Costs'!B:B,B7,'4. Equipment Costs'!H:H)","v":0},{"$f":"SUMIF('5. Subcontracting Costs'!B:B,B7,'5. Subcontracting Costs'!H:H)","v":"#ERROR!"},{"$f":"SUMIF(' 2-3-6. Travel&Costs of Stay'!B:B,B7,' 2-3-6. Travel&Costs of Stay'!N:N)","v":0},"#ERROR!"]
[null,{"$f":"'Unit Costs & Funding Rule'!P13","v":"Dissemination & Exploitation"},{"$f":"SUMIF('1. Staff costs'!B:B,B8,'1. Staff costs'!S:S)","v":"#ERROR!"},{"$f":"SUMIF(' 2-3-6. Travel&Costs of Stay'!B:B,B8,' 2-3-6. Travel&Costs of Stay'!O:O)","v":"#ERROR!"},{"$f":"SUMIF(' 2-3-6. Travel&Costs of Stay'!B:B,B8,' 2-3-6. Travel&Costs of Stay'!P:P)","v":"#ERROR!"},{"$f":"SUMIF('4. Equipment Costs'!B:B,B8,'4. Equipment Costs'!H:H)","v":0},{"$f":"SUMIF('5. Subcontracting Costs'!B:B,B8,'5. Subcontracting Costs'!H:H)","v":"#ERROR!"},{"$f":"SUMIF(' 2-3-6. Travel&Costs of Stay'!B:B,B8,' 2-3-6. Travel&Costs of Stay'!N:N)","v":0},"#ERROR!"]
[null,{"$f":"'Unit Costs & Funding Rule'!P14","v":"Management"},{"$f":"SUMIF('1. Staff costs'!B:B,B9,'1. Staff costs'!S:S)","v":"#ERROR!"},{"$f":"SUMIF(' 2-3-6. Travel&Costs of Stay'!B:B,B9,' 2-3-6. Travel&Costs of Stay'!O:O)","v":"#ERROR!"},{"$f":"SUMIF(' 2-3-6. Travel&Costs of Stay'!B:B,B9,' 2-3-6. Travel&Costs of Stay'!P:P)","v":"#ERROR!"},{"$f":"SUMIF('4. Equipment Costs'!B:B,B9,'4. Equipment Costs'!H:H)","v":0},{"$f":"SUMIF('5. Subcontracting Costs'!B:B,B9,'5. Subcontracting Costs'!H:H)","v":"#ERROR!"},{"$f":"SUMIF(' 2-3-6. Travel&Costs of Stay'!B:B,B9,' 2-3-6. Travel&Costs of Stay'!N:N)","v":0},"#ERROR!"]
[null,"Total",{"$f":"SUM(C5:C9)","v":"#ERROR!"},"#ERROR!","#ERROR!","#ERROR!","#ERROR!",0,"#ERROR!"]
{"$rows_left_out":68}
{"sheet":"Unit Costs & Funding Rule","index":8,"n_rows":186,"n_cols":19,"rows_kept":186,"cut":false,"hidden":false,"merged":[[3,11,3,13],[4,11,5,13],[3,18,3,20],[4,18,5,20],[6,15,6,16],[6,18,6,20],[0,1,0,20],[3,1,3,6],[3,8,3,9],[3,15,3,16],[4,1,5,6],[4,8,5,9],[4,15,5,16]]}
[null,"UNIT COSTS AND SUMMARY OF THE FUNDING RULES FOR  JOINT AND STRUCTURAL CAPACITY BUILDING PROJECTS\n\nYou can find below the unit costs values used in this file for the calculation of the grant.\nPlease refer to the Erasmus+ Programme guide 2020* for a complete overview of the funding rules applying to the Joint and Structural Capacity Building Projects (Part B of the guide and Annex 1)."]
[null,"* Link to Erasmus+ Programme guide 2019: ","https://ec.europa.eu/programmes/erasmus-plus/resources/documents/erasmus-programme-guide-2020_en"]
[null,"* Link to CBHE Call for proposal, forms, annexes and guidelines: ","https://eacea.ec.europa.eu/erasmus-plus/funding/capacity-building-in-the-field-of-higher-education-2020_en"]
[null,"A.1 Staff Costs",null,null,null,null,null,null,"A.2 & B Travel Costs",null,null,"A. 3 Costs of Stay",null,null,null,"A.4 Equipment",null,null,"A.5 Subcontracting"]
[null,"Unit costs\n\nContribution to the costs of staff performing tasks which are directly necessary to the achievements of the project's objectives.\n\nConditional: applicants will have to justify the type and volume of resources needed in relation to the implementation of the proposed activities and outputs. The contribution is provided on the  condition that the salary for the same tasks is compensated only once.",null,null,null,null,null,null,"Unit costs based on the travel distance per participant. \n\nTravel distances must be calculated using the distance calculator supported by the European Commission . \nThe applicant must indicate the distance of a one-way travel to calculate the amount of the EU grant that will support the round trip.",null,null,"Costs for subsistence, accommodation, local and public transport such as bus and taxi, personal or optional health insurance.\n\nUnit costs based on the duration of the stay of the participants:\n\nStaff: \n120 EUR/day from day 1 to day 14\n70 EUR/day from day 15 to day 60\n50 EUR/day from day 61 to day 90 (the maximum)\n\nStudent: \n55 EUR/day from day 1 to day 14\n40 EUR/day from day 15 to max day 90 (the maximum)",null,null,null,"Contribution for the purchase of equipment necessary for the implementation of the project. Support is provided only for equipment purchased for the benefit of the HEIs in the Partner Countries. \n\nConditional: the request for financial support to cover these costs must be motivated in the application form",null,null,"Support for sub-contracting costs that are necessary to the implementation of the project, including, in particular, costs for the compulsory financial audits (audit certificate) and for any external quality assurance procedure.\n\nSub-contracting for project-management-related tasks is not eligible.\n\nSub-contracting to external bodies should be very occasional. The specific competences and particular expertise needed to reach the project objectives should be found in the consortium and should determine its composition."]
[]
[null,"Country","PR/PA","Manager","Teacher/Trainer/Researcher","Technical Staff","Administrative Staff",null,"Distance","Travel \nCosts\n(EUR)",null,"Number of \nDays","Student","Staff",null,"100% of eligible costs\nMax. 30% of the total grant",null,null,"100% of eligible costs\nMax. 10% of the total grant"]
[null,"Austria","Programme Countries",294.0,241.0,190.0,157.0,null,"0 KM and 9 KM",0.0,null,1.0,{"$f":"L8*55","v":55},{"$f":"L8*120","v":120}]
[null,"Belgium","Programme Countries",280.0,214.0,162.0,131.0,null,"10 KM and 99 KM",20.0,null,2.0,110,240,null,"WorkPackage"]
[null,"Bulgaria","Programme Countries",88.0,74.0,55.0,39.0,null,"100 KM and 499 KM",180.0,null,3.0,165,360,null,"Preparation"]
{"$rows_left_out":176}